{"text_format":"1","workbook":"xlsx","n_sheets":5,"sheets":["Eligible AFDC Station IDs","Overview","Budget","Team Information","Project Template"],"not_rendered":{"charts":0,"images":2,"macros":1,"external_links":0,"defined_names":13,"comments":0,"pivot_tables":0},"unopened":[],"bounds":{"document_bytes":16777216,"sheet_cells":100000,"rows_first":2000,"rows_last":500,"rows_between":2000,"halvings":0,"cell_chars":16384,"cell_head_chars":4096},"cells_cut":0,"cells_raw":0,"read":"whole","date_system":"1900"}

{"sheet":"Eligible AFDC Station IDs","index":0,"n_rows":175,"n_cols":15,"rows_kept":175,"cut":false,"hidden":false,"merged":[]}
["ID","EV Network","Station Name","Address","City","State","ZIP","Phone","Lat","Lon","DAC Score","TMPU Ports Total","TMPU Ports L1","TMPU Ports L2","TMPU Ports DC"]
[49698,"ChargePoint","PARKWAY 12 & FILBERT 2","1201 Filbert St","Philadelphia","PA",19107,"888-758-4389",39.953071000000001,-75.160030000000006,5,1,0,1,0]
[50400,"ChargePoint","SECOND & STATE 2ND & STATE","409-477 N 2nd St","Harrisburg","PA",17101,"888-758-4389",40.262951000000001,-76.886619999999994,4,1,0,1,0]
[68766,"ChargePoint","PARKWAY 8TH & WALNUT","804 Walnut St","Philadelphia","PA",19107,"888-758-4389",39.948033000000002,-75.154624999999996,4,2,0,2,0]
[75608,"Non-Networked","Bryner Chevrolet","1750 The Fairway","Jenkintown","PA",19046,"215-886-3140",40.105553999999998,-75.121919000000005,0,2,0,2,0]
[85668,"ChargePoint","KOCH 33 TOYOTA SOUTH STATION","3816 Hecktown Rd","Easton","PA",18045,"888-758-4389",40.701828999999996,-75.288488000000001,0,2,0,2,0]
[85684,"Non-Networked","Gold 1 Garage","792 W General Robinson St","Pittsburgh","PA",15212,"412-323-4455",40.447848,-80.012879999999996,0,2,0,0,2]
[102965,"ChargePoint","SARTOMERAMERICA SARTOMER #1","502 Thomas Jones Way","Exton","PA",19341,"888-758-4389",40.021196000000003,-75.654539,0,2,0,2,0]
[103634,"ChargePoint","EAST MARKET 1100MARKET3","1100 Market St","Philadelphia","PA",19107,"888-758-4389",39.951352,-75.159563000000006,5,2,0,2,0]
[104199,"ChargePoint","ADDISON @ EVA THE ADDISON","700 Lower State Rd","North Wales","PA",19454,"888-758-4389",40.210647000000002,-75.219064000000003,0,2,0,2,0]
[117236,"Non-Networked","Roost Deli and Market","3251 US-209","Bushkill","PA",18324,"570-588-7062",41.103469699999998,-75.039678600000002,0,2,0,2,0]
[123428,"Blink","C&F Management Enterprises LLC c/o CBRE","680 Anderson Drive","Pittsburgh","PA",15220,"888-998-2546",40.421157000000001,-80.061190999999994,0,1,0,1,0]
[143238,"ChargePoint","TOWNSHIP O'HARA COMMUNITY PARK","330 Fox Chapel Rd","Pittsburgh","PA",15238,"888-758-4389",40.497157999999999,-79.882059999999996,0,2,0,2,0]
[143911,"Blink","JADEC","5000 Renaissance Drive","New Freedom","PA",17349,"888-998-2546",39.770081990000001,-76.656422989999996,0,2,0,2,0]
[144004,"ChargePoint","STONE HILL STONE HILL","532 Brookhaven Rd","Brookhaven","PA",19015,"888-758-4389",39.865506000000003,-75.395987000000005,0,2,0,2,0]
[147173,"Blink","Island View Crossing","1414 Radcliffe St","Bristol","PA",19007,"888-998-2546",40.103268,-74.841184999999996,0,2,0,2,0]
[147630,"ChargePoint","FOUNDRY41 FOUNDRY41","4107 Willow St","Pittsburgh","PA",15201,"888-758-4389",40.472209999999997,-79.964340000000007,0,2,0,2,0]
[148077,"Blink","Schenley Place","4420 Bayard Street","Pittsburgh","PA",15213,"800-663-5633",40.4474722,-79.953588100000005,4,2,0,2,0]
[148172,"Blink","Ambler Yards","300 Brookside Avenue\nBldg 4","Ambler","PA",19002,"800-663-5633",40.160943699999997,-75.232436300000003,0,1,0,1,0]
[149540,"ChargePoint","MURDOCH MURDOCH","3420 Iroquois Way","Pittsburgh","PA",15213,"888-758-4389",40.43862,-79.960080000000005,3,2,0,2,0]
{"$rows_left_out":156}
{"sheet":"Overview","index":1,"n_rows":236,"n_cols":8,"rows_kept":236,"cut":false,"hidden":false,"merged":[[3,0,6,0],[30,6,32,7],[3,10,3,12],[3,6,3,7],[2,1,2,2],[3,3,6,4],[7,6,11,7],[23,7,24,7],[20,7,21,7]]}
[]
[null,"PennDOT EVC-RAA Proposal Excel File"]
[null,"General Information"]
["Step 1","Organization Name",null,"* Click \"Enable Editing\" or \"Enable Content\" if a security warning pops up. If a red security warning pops up, close the file, right click and go to properties. There, check \"unlock\" to trust the file.",null,null,"General Notes"]
[null,"Organization Address",null,null,null,null,"* Only edit the yellow highlighted cells"]
[null,"Contact Name",null,null,null,null,"* Gray cells have formulas in them. Do not edit these"]
[null,"Contact Email"]
[null,null,null,null,null,null,"The majority of questions are answered within this spreadsheet. Remaining questions are to be completed within eGrants and are labeled as such along with the method to complete the questions (e.g., “File Upload”). See Appendix II-IV of PennDOT RAA Funding Opportunity for more information."]
["Step 2","Number of Projects",3]
[]
[null,null,"AFDC Station ID","Project Address","Total Budget"]
["Step 3",1,null,{"$f":"IF(NOT(ISBLANK(C12)), VLOOKUP(C12, 'Eligible AFDC Station IDs'!$A$1:$D$175, 4, FALSE), \"\")","v":""},{"$f":"IF(NOT(ISBLANK(C12)), VLOOKUP(C12, Budget!$B$9:$U$190, 20, FALSE), \"\")","v":""}]
[null,2,null,{"$f":"IF(NOT(ISBLANK(C13)), VLOOKUP(C13, 'Eligible AFDC Station IDs'!$A$1:$D$175, 4, FALSE), \"\")","v":""},{"$f":"IF(NOT(ISBLANK(C13)), VLOOKUP(C13, Budget!$B$9:$U$190, 20, FALSE), \"\")","v":""}]
[null,3,null,{"$f":"IF(NOT(ISBLANK(C14)), VLOOKUP(C14, 'Eligible AFDC Station IDs'!$A$1:$D$175, 4, FALSE), \"\")","v":""},{"$f":"IF(NOT(ISBLANK(C14)), VLOOKUP(C14, Budget!$B$9:$U$190, 20, FALSE), \"\")","v":""}]
[null,null,null,{"$f":"IF(NOT(ISBLANK(C15)), VLOOKUP(C15, 'Eligible AFDC Station IDs'!$A$1:$D$175, 4, FALSE), \"\")","v":""},{"$f":"IF(NOT(ISBLANK(C15)), VLOOKUP(C15, Budget!$B$9:$U$190, 20, FALSE), \"\")","v":""},null,"Step #","Instructions"]
[null,null,null,{"$f":"IF(NOT(ISBLANK(C16)), VLOOKUP(C16, 'Eligible AFDC Station IDs'!$A$1:$D$175, 4, FALSE), \"\")","v":""},{"$f":"IF(NOT(ISBLANK(C16)), VLOOKUP(C16, Budget!$B$9:$U$190, 20, FALSE), \"\")","v":""},null,1,"Begin by entering your general information in C4:C7"]
[null,null,null,{"$f":"IF(NOT(ISBLANK(C17)), VLOOKUP(C17, 'Eligible AFDC Station IDs'!$A$1:$D$175, 4, FALSE), \"\")","v":""},{"$f":"IF(NOT(ISBLANK(C17)), VLOOKUP(C17, Budget!$B$9:$U$190, 20, FALSE), \"\")","v":""},null,2,"Enter the number of Projects in C9"]
[null,null,null,{"$f":"IF(NOT(ISBLANK(C18)), VLOOKUP(C18, 'Eligible AFDC Station IDs'!$A$1:$D$175, 4, FALSE), \"\")","v":""},{"$f":"IF(NOT(ISBLANK(C18)), VLOOKUP(C18, Budget!$B$9:$U$190, 20, FALSE), \"\")","v":""},null,3,"Enter your Project IDs in C12 and downward"]
[null,null,null,{"$f":"IF(NOT(ISBLANK(C19)), VLOOKUP(C19, 'Eligible AFDC Station IDs'!$A$1:$D$175, 4, FALSE), \"\")","v":""},{"$f":"IF(NOT(ISBLANK(C19)), VLOOKUP(C19, Budget!$B$9:$U$190, 20, FALSE), \"\")","v":""},null,4,"Click the \"Create Project Tabs\" button"]
[null,null,null,{"$f":"IF(NOT(ISBLANK(C20)), VLOOKUP(C20, 'Eligible AFDC Station IDs'!$A$1:$D$175, 4, FALSE), \"\")","v":""},{"$f":"IF(NOT(ISBLANK(C20)), VLOOKUP(C20, Budget!$B$9:$U$190, 20, FALSE), \"\")","v":""},null,5,"Fill in the budget information for each Project in the tab \"Budget\""]
{"$rows_left_out":217}
{"sheet":"Budget","index":2,"n_rows":179,"n_cols":21,"rows_kept":179,"cut":false,"hidden":false,"merged":[[5,1,6,1],[8,20,9,20],[8,1,9,1],[8,2,8,4],[8,5,8,8],[8,9,8,11],[8,18,9,18],[8,19,9,19],[5,2,6,16],[5,18,5,19],[6,18,6,19]]}
[]
[null,"PennDOT EVC-RAA Proposal Excel File - Step 5: Budget Information"]
[null,"* For each proposed Project, Prospective Contractors apply for 80 percent federal cost share of the eligible costs, with a required match of 20 percent from non-federal sources."]
[null,"* If a Prospective Contractor wishes to overmatch to make their Project more competative, they should exclude costs from the Budget tab table and instead describe those costs in the narrative section on the Budget tab."]
[]
[null,"(Optional) Budget Narrative",null,null,null,null,null,null,null,null,null,null,null,null,null,null,null,null,"Total Budget for All Projects"]
[null,null,null,null,null,null,null,null,null,null,null,null,null,null,null,null,null,null,{"$f":"SUM(U11:U190)","v":0}]
[]
[null,"AFDC Station ID","Pre-Construction",null,null,"Construction",null,null,null,"Equipment",null,null,"Utility","Networking Contract","Warranty/\nMaintenance\nContract","Workforce Training","EV Charging Safety Trainings",null,"Amount From PennDOT EVC-RAA Funding Opportunity","Amount From Other Funding Private","Total Project Budget\n(Should match with eGrants)"]
[null,null,"Permitting","Design","Other","Site Work","Electrical","Installation/\nCommission-ing","Other","Chargers","Supporting Equipment","Other","-","-","-","-","-"]
[{"$f":"NOT(ISBLANK(Overview!C12))","v":false},{"$f":"IFERROR(IF(ISBLANK(_xlfn._xlws.FILTER(Overview!C12:C200, A11:A199)), \"-\", _xlfn._xlws.FILTER(Overview!C12:C200, A11:A199)), \"-\")","v":"-"},null,null,null,null,null,null,null,null,null,null,null,null,null,null,null,null,{"$f":"IF(SUM(C11:Q11)<>0, SUM(C11:Q11)*0.8, \"\")","v":""},{"$f":"IF(SUM(C11:Q11)<>0, SUM(C11:Q11)*0.2, \"\")","v":""},{"$f":"IF(SUM(C11:Q11)<>0, SUM(C11:Q11), \"\")","v":""}]
[{"$f":"NOT(ISBLANK(Overview!C13))","v":false},null,null,null,null,null,null,null,null,null,null,null,null,null,null,null,null,null,"","",""]
[{"$f":"NOT(ISBLANK(Overview!C14))","v":false},null,null,null,null,null,null,null,null,null,null,null,null,null,null,null,null,null,"","",""]
[{"$f":"NOT(ISBLANK(Overview!C15))","v":false},null,null,null,null,null,null,null,null,null,null,null,null,null,null,null,null,null,"","",""]
[{"$f":"NOT(ISBLANK(Overview!C16))","v":false},null,null,null,null,null,null,null,null,null,null,null,null,null,null,null,null,null,"","",""]
[{"$f":"NOT(ISBLANK(Overview!C17))","v":false},null,null,null,null,null,null,null,null,null,null,null,null,null,null,null,null,null,"","",""]
[{"$f":"NOT(ISBLANK(Overview!C18))","v":false},null,null,null,null,null,null,null,null,null,null,null,null,null,null,null,null,null,"","",""]
[{"$f":"NOT(ISBLANK(Overview!C19))","v":false},null,null,null,null,null,null,null,null,null,null,null,null,null,null,null,null,null,"","",""]
[{"$f":"NOT(ISBLANK(Overview!C20))","v":false},null,null,null,null,null,null,null,null,null,null,null,null,null,null,null,null,null,"","",""]
[{"$f":"NOT(ISBLANK(Overview!C21))","v":false},null,null,null,null,null,null,null,null,null,null,null,null,null,null,null,null,null,"","",""]
{"$rows_left_out":160}
{"sheet":"Team Information","index":3,"n_rows":30,"n_cols":24,"rows_kept":30,"cut":false,"hidden":false,"merged":[[12,14,13,17],[18,6,40,13],[5,0,5,1]]}
[]
[null,"PennDOT EVC-RAA Proposal Excel File - Step 6: Team Information"]
[]
[null,1,"Team Qualifications and Project Approach [15pts]"]
[]
[1.1000000000000001,null,"[15pts] Team Qualifications and Experience"]
[]
[null,null,"Role Title","Name of Organization","Relevant Experience",null,"Please Read"]
[null,null,"Other","N/A",null,null,null,null,null,null,null,null,null,null,{"$f":"_xlfn._xlws.SORT(_xlfn._xlws.FILTER(D9:D1000, (C9:C1000=\"Site Host\")*(D9:D1000<>\"\"), ))","v":"N/A"},{"$f":"_xlfn._xlws.SORT(_xlfn._xlws.FILTER(D9:D1000, (C9:C1000=\"Project Owner\")*(D9:D1000<>\"\"), ))","v":"N/A"},{"$f":"_xlfn._xlws.SORT(_xlfn._xlws.FILTER(D9:D1000, (C9:C1000=\"EVSE Supplier\")*(D9:D1000<>\"\"), ))","v":"N/A"},{"$f":"_xlfn._xlws.SORT(_xlfn._xlws.FILTER(D9:D1000, (C9:C1000=\"Electrical Sub-Contractor\")*(D9:D1000<>\"\"), ))","v":"N/A"},{"$f":"_xlfn._xlws.SORT(_xlfn._xlws.FILTER(D9:D1000, (C9:C1000=\"General Sub-Contractor\")*(D9:D1000<>\"\"), ))","v":"N/A"},{"$f":"_xlfn._xlws.SORT(_xlfn._xlws.FILTER(D9:D1000, (C9:C1000=\"Operator\")*(D9:D1000<>\"\"), ))","v":"N/A"},{"$f":"_xlfn._xlws.SORT(_xlfn._xlws.FILTER(D9:D1000, (C9:C1000=\"Maintainer\")*(D9:D1000<>\"\"), ))","v":"N/A"},{"$f":"_xlfn._xlws.SORT(_xlfn._xlws.FILTER(D9:D1000, (C9:C1000=\"Utility Provider (If Applicable)\")*(D9:D1000<>\"\"), ))","v":"N/A"},{"$f":"_xlfn._xlws.SORT(_xlfn._xlws.FILTER(D9:D1000, (C9:C1000=\"Charging Network Provider\")*(D9:D1000<>\"\"), ))","v":"N/A"},{"$f":"_xlfn._xlws.SORT(_xlfn._xlws.FILTER(D9:D1000, (C9:C1000=\"Other\")*(D9:D1000<>\"\"), ))","v":"N/A"}]
[null,null,"Site Host","N/A"]
[null,null,"Project Owner","N/A"]
[null,null,"EVSE Supplier","N/A"]
[null,null,"Electrical Sub-Contractor","N/A"]
[null,null,"General Sub-Contractor","N/A"]
[null,null,"Operator","N/A"]
[null,null,"Maintainer","N/A"]
[null,null,"Utility Provider (If Applicable)","N/A"]
[null,null,"Charging Network Provider","N/A"]
[null,null,"Site Host",null,null,null,"In this tab, provide a list of all known team member organizations and their relevant experience for each Project site. When one or more Project team member organizations are not yet identified, add the role title, name them as \"Unknown\" and describe the method of selecting such team member organizations(s) and any minimum requirements/expectations in \"Relevant Experience\".\n\n* All roles and names you fill out here will populate the drop downs of your Project tabs.\n\n* If a team member organization has multiple roles, please enter their relevant experience for each role\n\nExample: If a team member organization acts as both a site host and the project owner, enter them in two rows with \"Site Host\" and \"Project Owner\" next to their name.\n\nExample: If you have ten different Site Hosts, add in nine additional Site Host lines at the bottom of the table. If you have two different Operators between these Projects, add in only two Operator lines.\n\n* You do not need to fill in every row in the table. For rows after row 28, enter team member organizations if and only if you have additional team member organizations.\n\n* You do not need to fill in 'Relevant Experience' for a Utility Provider or Site Host."]
[null,null,"Project Owner"]
{"$rows_left_out":11}
{"sheet":"Project Template","index":4,"n_rows":153,"n_cols":11,"rows_kept":153,"cut":false,"hidden":false,"merged":[[150,2,150,10],[152,2,152,10],[123,2,123,10],[91,2,91,10],[93,2,93,10],[113,2,113,10],[95,2,95,10],[97,2,97,10],[98,2,98,10],[100,2,100,10],[101,2,101,10],[103,2,103,10],[126,2,126,10],[128,2,128,10],[130,2,130,3],[114,2,114,10],[125,2,125,10],[104,2,104,10],[106,2,106,10],[107,2,107,10],[87,2,87,10],[111,2,111,10],[116,2,116,10],[117,2,117,10],[119,2,119,10],[120,2,120,10],[122,2,122,10],[109,2,109,10],[66,2,66,10],[80,2,80,10],[81,2,81,10],[82,2,82,10],[7,2,7,10],[62,2,62,10],[63,2,63,10],[48,2,48,10],[50,2,50,10],[71,2,71,10],[73,2,73,3],[70,2,70,10],[38,2,38,8],[27,2,27,10],[29,5,29,7],[30,5,30,7],[29,2,32,2],[57,2,57,10],[59,2,59,10],[60,2,60,10],[65,2,65,10],[51,2,51,10],[53,2,53,10],[54,2,54,10],[56,2,56,10],[47,2,47,10],[40,2,40,10],[41,2,41,10],[43,2,43,10],[44,2,44,10],[46,2,46,10],[25,2,25,10],[8,2,8,10],[20,4,20,10],[21,4,21,10],[22,4,22,10],[23,4,23,10],[15,4,15,10],[16,4,16,10],[17,4,17,10],[18,4,18,10],[19,4,19,10],[9,2,9,10],[11,4,11,10],[13,4,13,10],[12,4,12,10],[14,4,14,10],[144,2,144,10],[146,2,146,10],[148,2,148,10],[132,2,132,10],[142,2,142,10],[134,2,134,6],[136,2,136,6],[138,2,140,6],[68,2,68,10],[84,2,85,8],[88,2,88,10],[90,2,90,10],[74,2,74,3],[77,2,77,10],[78,2,78,10],[79,2,79,10],[75,2,75,10],[76,2,76,10],[72,2,72,10]]}
[]
[null,"PennDOT EVC-RAA Proposal Excel File - Step 7: Site Information"]
[]
[null,1,"Team Qualifications and Project Approach [15pts]"]
[]
[null,1.1000000000000001,"[15pts] Team Qualifications and Experience"]
[]
[null,null,"A. Provide a list of all known team member organizations expected to be part of the Project and their relevant experience. Prospective Contractors may follow their typical procurement processes when selecting team member organizations, as long as they follow the processes/requirements outlined in the Federal Rule. When one or more Project team member organizations are not yet identified, describe the method of selecting such team member organization(s) and any minimum requirements/expectations."]
[]
[null,null,"* The relevant experience will auto-populate. The 'Name of Organization' box will have a drop down for each of the names you entered in \"Team Information.\""]
[]
[null,null,"Role Title","Name of Organization","Relevant Experience"]
[null,null,"Site Host",null,"Not Applicable"]
[null,null,"Project Owner",null,{"$f":"IFERROR(IF(OR(INDEX('Team Information'!$E$9:$E$1000,MATCH(1,('Team Information'!$C$9:$C$1000=C14)*('Team Information'!$D$9:$D$1000=D14),0))=0, ISERROR(INDEX('Team Information'!$E$9:$E$1000,MATCH(1,('Team Information'!$C$9:$C$1000=C14)*('Team Information'!$D$9:$D$1000=D14),0)))), \"-\", INDEX('Team Information'!$E$9:$E$1000,MATCH(1,('Team Information'!$C$9:$C$1000=C14)*('Team Information'!$D$9:$D$1000=D14),0))), \"-\")","v":"-"}]
[null,null,"EVSE Supplier",null,{"$f":"IFERROR(IF(OR(INDEX('Team Information'!$E$9:$E$1000,MATCH(1,('Team Information'!$C$9:$C$1000=C15)*('Team Information'!$D$9:$D$1000=D15),0))=0, ISERROR(INDEX('Team Information'!$E$9:$E$1000,MATCH(1,('Team Information'!$C$9:$C$1000=C15)*('Team Information'!$D$9:$D$1000=D15),0)))), \"-\", INDEX('Team Information'!$E$9:$E$1000,MATCH(1,('Team Information'!$C$9:$C$1000=C15)*('Team Information'!$D$9:$D$1000=D15),0))), \"-\")","v":"-"}]
[null,null,"Electrical Sub-Contractor",null,{"$f":"IFERROR(IF(OR(INDEX('Team Information'!$E$9:$E$1000,MATCH(1,('Team Information'!$C$9:$C$1000=C16)*('Team Information'!$D$9:$D$1000=D16),0))=0, ISERROR(INDEX('Team Information'!$E$9:$E$1000,MATCH(1,('Team Information'!$C$9:$C$1000=C16)*('Team Information'!$D$9:$D$1000=D16),0)))), \"-\", INDEX('Team Information'!$E$9:$E$1000,MATCH(1,('Team Information'!$C$9:$C$1000=C16)*('Team Information'!$D$9:$D$1000=D16),0))), \"-\")","v":"-"}]
[null,null,"General Sub-Contractor",null,{"$f":"IFERROR(IF(OR(INDEX('Team Information'!$E$9:$E$1000,MATCH(1,('Team Information'!$C$9:$C$1000=C17)*('Team Information'!$D$9:$D$1000=D17),0))=0, ISERROR(INDEX('Team Information'!$E$9:$E$1000,MATCH(1,('Team Information'!$C$9:$C$1000=C17)*('Team Information'!$D$9:$D$1000=D17),0)))), \"-\", INDEX('Team Information'!$E$9:$E$1000,MATCH(1,('Team Information'!$C$9:$C$1000=C17)*('Team Information'!$D$9:$D$1000=D17),0))), \"-\")","v":"-"}]
[null,null,"Operator",null,{"$f":"IFERROR(IF(OR(INDEX('Team Information'!$E$9:$E$1000,MATCH(1,('Team Information'!$C$9:$C$1000=C18)*('Team Information'!$D$9:$D$1000=D18),0))=0, ISERROR(INDEX('Team Information'!$E$9:$E$1000,MATCH(1,('Team Information'!$C$9:$C$1000=C18)*('Team Information'!$D$9:$D$1000=D18),0)))), \"-\", INDEX('Team Information'!$E$9:$E$1000,MATCH(1,('Team Information'!$C$9:$C$1000=C18)*('Team Information'!$D$9:$D$1000=D18),0))), \"-\")","v":"-"}]
[null,null,"Maintainer",null,{"$f":"IFERROR(IF(OR(INDEX('Team Information'!$E$9:$E$1000,MATCH(1,('Team Information'!$C$9:$C$1000=C19)*('Team Information'!$D$9:$D$1000=D19),0))=0, ISERROR(INDEX('Team Information'!$E$9:$E$1000,MATCH(1,('Team Information'!$C$9:$C$1000=C19)*('Team Information'!$D$9:$D$1000=D19),0)))), \"-\", INDEX('Team Information'!$E$9:$E$1000,MATCH(1,('Team Information'!$C$9:$C$1000=C19)*('Team Information'!$D$9:$D$1000=D19),0))), \"-\")","v":"-"}]
[null,null,"Utility Provider (If Applicable)",null,"Not Applicable"]
{"$rows_left_out":133}