{"text_format":"1","workbook":"xlsx","n_sheets":24,"sheets":["S1","S2","S3","S4","S5","S6","S7","S8","S9","S10","S11","S12","QA Samples","Chart 1-24","Chart 25-48","Chart 49-72","Chart 73-96","Chart 97-120","Chart 121-144","S13","S14","Avg","AP","Critical screen tolerances"],"not_rendered":{"charts":54,"images":34,"macros":1,"external_links":1,"defined_names":12,"comments":0,"pivot_tables":0},"unopened":[],"bounds":{"document_bytes":16777216,"sheet_cells":100000,"rows_first":2000,"rows_last":500,"rows_between":2000,"halvings":0,"cell_chars":16384,"cell_head_chars":4096},"cells_cut":0,"cells_raw":0,"read":"whole","date_system":"1900"}

{"sheet":"S1","index":0,"n_rows":50,"n_cols":14,"rows_kept":50,"cut":false,"hidden":false,"merged":[[32,0,32,1],[43,0,45,1],[43,2,45,3],[43,4,45,5],[42,4,42,5],[42,0,42,1],[42,8,42,9],[42,10,42,11],[27,8,27,9],[27,10,27,11],[27,0,27,1],[27,2,27,3],[27,12,27,13],[3,10,3,11],[3,12,3,13],[23,8,25,9],[23,10,25,11],[23,12,25,13],[11,8,11,9],[11,12,11,13],[7,4,7,5],[7,6,7,7],[27,4,27,5],[27,6,27,7],[8,10,8,11],[8,12,8,13],[0,0,3,1],[1,10,1,11],[1,12,1,13],[2,10,2,11],[2,12,2,13],[23,0,25,1],[23,2,25,3],[23,4,25,5],[23,6,25,7],[21,8,21,9],[21,10,21,11],[21,12,21,13],[9,0,9,1],[4,10,4,11],[4,12,4,13],[5,3,5,8],[8,0,8,1],[8,2,8,3],[8,4,8,5],[8,6,8,7],[8,8,8,9],[7,0,7,1],[7,2,7,3],[12,0,12,1],[11,2,11,3],[11,4,11,5],[11,6,11,7],[28,6,28,7],[31,0,31,1],[30,0,30,1],[31,2,31,3],[31,4,31,5],[31,6,31,7],[29,0,29,1],[21,2,21,3],[21,4,21,5],[21,6,21,7],[28,2,28,3],[28,4,28,5],[42,12,42,13],[42,2,42,3],[43,6,45,7],[43,8,45,9],[43,10,45,11],[43,12,45,13],[42,6,42,7],[31,8,31,9],[31,10,31,11],[31,12,31,13],[41,2,41,3],[41,4,41,5],[41,6,41,7],[41,8,41,9],[41,10,41,11],[41,12,41,13],[4,0,4,1],[28,8,28,9],[28,10,28,11],[28,12,28,13],[22,12,22,13],[11,10,11,11],[1,2,1,7],[2,2,2,7],[3,2,3,7],[0,8,3,9],[11,0,11,1],[10,0,10,1],[5,10,5,11],[5,12,5,13],[7,8,7,9],[7,10,7,11],[7,12,7,13],[22,8,22,9],[22,10,22,11],[22,0,22,1],[22,2,22,3],[22,4,22,5],[22,6,22,7],[28,0,28,1]]}
[]
[null,null,"COMMONWEALTH OF PENNSYLVANIA",null,null,null,null,null,null,null,"DISTRICT"]
[null,null,"DEPARTMENT OF TRANSPORTATION",null,null,null,null,null,null,null,"PLANT CODE"]
[null,null,"PENNSYLVANIA TURNPIKE COMMISSION",null,null,null,null,null,null,null,"AGG SIZE",null,"Type A"]
["Concrete 2023",null,null,null,null,null,null,null,null,null,"FM Target Value"]
[null,null,null,"Material Test Results for Type A Fine Aggregate"]
[]
["Sample No."]
["Date"]
["St. Wt. Before Wash",null,null,"% Loss",null,"% Loss",null,"% Loss",null,"% Loss",null,"% Loss",null,"% Loss"]
["Dry Wt. After Wash",null,null,{"$f":"IF(ISBLANK(C11),\" \",IF(ISBLANK(C14),\" \",(C11-C14)/C11*100))","v":" "},null,{"$f":"IF(ISBLANK(E11),\" \",IF(ISBLANK(E14),\" \",(E11-E14)/E11*100))","v":" "},null,{"$f":"IF(ISBLANK(G11),\" \",IF(ISBLANK(G14),\" \",(G11-G14)/G11*100))","v":" "},null,{"$f":"IF(ISBLANK(I11),\" \",IF(ISBLANK(I14),\" \",(I11-I14)/I11*100))","v":" "},null,{"$f":"IF(ISBLANK(K11),\" \",IF(ISBLANK(K14),\" \",(K11-K14)/K11*100))","v":" "},null,{"$f":"IF(ISBLANK(M11),\" \",IF(ISBLANK(M14),\" \",(M11-M14)/M11*100))","v":" "}]
["Wt. Loss",null,{"$f":"IF(ISBLANK(C10),\" \",IF(ISBLANK(C11),\" \",C10-C11))","v":" "},null,{"$f":"IF(ISBLANK(E10),\" \",IF(ISBLANK(E11),\" \",E10-E11))","v":" "},null,{"$f":"IF(ISBLANK(G10),\" \",IF(ISBLANK(G11),\" \",G10-G11))","v":" "},null,{"$f":"IF(ISBLANK(I10),\" \",IF(ISBLANK(I11),\" \",I10-I11))","v":" "},null,{"$f":"IF(ISBLANK(K10),\" \",IF(ISBLANK(K11),\" \",K10-K11))","v":" "},null,{"$f":"IF(ISBLANK(M10),\" \",IF(ISBLANK(M11),\" \",M10-M11))","v":" "}]
[null,null,"Wt","% Passing","Wt","% Passing","Wt","% Passing","Wt","% Passing","Wt","% Passing","Wt","% Passing"]
[100,0.375,null,{"$f":"IF(ISBLANK(C$10),\"  \",IF(ISBLANK(C$11),\" \",IF(ISBLANK(C14),\" \",ROUND((C14+C$12)/C$10*100,1))))","v":"  "},null,{"$f":"IF(ISBLANK(E$10),\"  \",IF(ISBLANK(E$11),\" \",IF(ISBLANK(E14),\" \",ROUND((E14+E$12)/E$10*100,1))))","v":"  "},null,{"$f":"IF(ISBLANK(G$10),\"  \",IF(ISBLANK(G$11),\" \",IF(ISBLANK(G14),\" \",ROUND((G14+G$12)/G$10*100,1))))","v":"  "},null,{"$f":"IF(ISBLANK(I$10),\"  \",IF(ISBLANK(I$11),\" \",IF(ISBLANK(I14),\" \",ROUND((I14+I$12)/I$10*100,1))))","v":"  "},null,{"$f":"IF(ISBLANK(K$10),\"  \",IF(ISBLANK(K$11),\" \",IF(ISBLANK(K14),\" \",ROUND((K14+K$12)/K$10*100,1))))","v":"  "},null,{"$f":"IF(ISBLANK(M$10),\"  \",IF(ISBLANK(M$11),\" \",IF(ISBLANK(M14),\" \",ROUND((M14+M$12)/M$10*100,1))))","v":"  "}]
["95-100",4,null,{"$f":"IF(ISBLANK(C$10),\"  \",IF(ISBLANK(C$11),\" \",IF(ISBLANK(C15),\" \",ROUND((C15+C$12)/C$10*100,0))))","v":"  "},null,{"$f":"IF(ISBLANK(E$10),\"  \",IF(ISBLANK(E$11),\" \",IF(ISBLANK(E15),\" \",ROUND((E15+E$12)/E$10*100,0))))","v":"  "},null,{"$f":"IF(ISBLANK(G$10),\"  \",IF(ISBLANK(G$11),\" \",IF(ISBLANK(G15),\" \",ROUND((G15+G$12)/G$10*100,0))))","v":"  "},null,{"$f":"IF(ISBLANK(I$10),\"  \",IF(ISBLANK(I$11),\" \",IF(ISBLANK(I15),\" \",ROUND((I15+I$12)/I$10*100,0))))","v":"  "},null,{"$f":"IF(ISBLANK(K$10),\"  \",IF(ISBLANK(K$11),\" \",IF(ISBLANK(K15),\" \",ROUND((K15+K$12)/K$10*100,0))))","v":"  "},null,{"$f":"IF(ISBLANK(M$10),\"  \",IF(ISBLANK(M$11),\" \",IF(ISBLANK(M15),\" \",ROUND((M15+M$12)/M$10*100,0))))","v":"  "}]
["70-100",8,null,"  ",null,"  ",null,"  ",null,"  ",null,"  ",null,"  "]
["45-85",16,null,"  ",null,"  ",null,"  ",null,"  ",null,"  ",null,"  "]
["25-65",30,null,"  ",null,"  ",null,"  ",null,"  ",null,"  ",null,"  "]
["10-30",50,null,"  ",null,"  ",null,"  ",null,"  ",null,"  ",null,"  "]
["0-10",100,null,"  ",null,"  ",null,"  ",null,"  ",null,"  ",null,"  "]
[3,200,null,{"$f":"IF(ISBLANK(C$10),\"  \",IF(ISBLANK(C$11),\" \",IF(ISBLANK(C21),\" \",ROUND((C21+C$12)/C$10*100,2))))","v":"  "},null,{"$f":"IF(ISBLANK(E$10),\"  \",IF(ISBLANK(E$11),\" \",IF(ISBLANK(E21),\" \",ROUND((E21+E$12)/E$10*100,2))))","v":"  "},null,{"$f":"IF(ISBLANK(G$10),\"  \",IF(ISBLANK(G$11),\" \",IF(ISBLANK(G21),\" \",ROUND((G21+G$12)/G$10*100,2))))","v":"  "},null,{"$f":"IF(ISBLANK(I$10),\"  \",IF(ISBLANK(I$11),\" \",IF(ISBLANK(I21),\" \",ROUND((I21+I$12)/I$10*100,2))))","v":"  "},null,{"$f":"IF(ISBLANK(K$10),\"  \",IF(ISBLANK(K$11),\" \",IF(ISBLANK(K21),\" \",ROUND((K21+K$12)/K$10*100,2))))","v":"  "},null,{"$f":"IF(ISBLANK(M$10),\"  \",IF(ISBLANK(M$11),\" \",IF(ISBLANK(M21),\" \",ROUND((M21+M$12)/M$10*100,2))))","v":"  "}]
["2.30-3.15","FM",{"$f":"IF(ISBLANK(C10),\" \",IF(ISBLANK(C14),\" \",(600-SUM(D15:D20))/100))","v":" "},null,{"$f":"IF(ISBLANK(E10),\" \",IF(ISBLANK(E14),\" \",(600-SUM(F15:F20))/100))","v":" "},null,{"$f":"IF(ISBLANK(G10),\" \",IF(ISBLANK(G14),\" \",(600-SUM(H15:H20))/100))","v":" "},null,{"$f":"IF(ISBLANK(I10),\" \",IF(ISBLANK(I14),\" \",(600-SUM(J15:J20))/100))","v":" "},null,{"$f":"IF(ISBLANK(K10),\" \",IF(ISBLANK(K14),\" \",(600-SUM(L15:L20))/100))","v":" "},null,{"$f":"IF(ISBLANK(M10),\" \",IF(ISBLANK(M14),\" \",(600-SUM(N15:N20))/100))","v":" "}]
["Tested By"]
["Remarks"]
[]
[]
[]
["Sample No."]
["Date"]
["St. Wt. Before Wash",null,null,"% Loss",null,"% Loss",null,"% Loss",null,"% Loss",null,"% Loss",null,"% Loss"]
["Dry Wt. After Wash",null,null,{"$f":"IF(ISBLANK(C31),\" \",IF(ISBLANK(C34),\" \",(C31-C34)/C31*100))","v":" "},null,{"$f":"IF(ISBLANK(E31),\" \",IF(ISBLANK(E34),\" \",(E31-E34)/E31*100))","v":" "},null,{"$f":"IF(ISBLANK(G31),\" \",IF(ISBLANK(G34),\" \",(G31-G34)/G31*100))","v":" "},null,{"$f":"IF(ISBLANK(I31),\" \",IF(ISBLANK(I34),\" \",(I31-I34)/I31*100))","v":" "},null,{"$f":"IF(ISBLANK(K31),\" \",IF(ISBLANK(K34),\" \",(K31-K34)/K31*100))","v":" "},null,{"$f":"IF(ISBLANK(M31),\" \",IF(ISBLANK(M34),\" \",(M31-M34)/M31*100))","v":" "}]
["Wt. Loss",null,{"$f":"IF(ISBLANK(C30),\" \",IF(ISBLANK(C31),\" \",C30-C31))","v":" "},null,{"$f":"IF(ISBLANK(E30),\" \",IF(ISBLANK(E31),\" \",E30-E31))","v":" "},null,{"$f":"IF(ISBLANK(G30),\" \",IF(ISBLANK(G31),\" \",G30-G31))","v":" "},null,{"$f":"IF(ISBLANK(I30),\" \",IF(ISBLANK(I31),\" \",I30-I31))","v":" "},null,{"$f":"IF(ISBLANK(K30),\" \",IF(ISBLANK(K31),\" \",K30-K31))","v":" "},null,{"$f":"IF(ISBLANK(M30),\" \",IF(ISBLANK(M31),\" \",M30-M31))","v":" "}]
[null,null,"Wt","% Passing","Wt","% Passing","Wt","% Passing","Wt","% Passing","Wt","% Passing","Wt","% Passing"]
[100,0.375,null,{"$f":"IF(ISBLANK(C$30),\"  \",IF(ISBLANK(C$31),\" \",IF(ISBLANK(C34),\" \",ROUND((C34+C$32)/C$30*100,1))))","v":"  "},null,{"$f":"IF(ISBLANK(E$30),\"  \",IF(ISBLANK(E$31),\" \",IF(ISBLANK(E34),\" \",ROUND((E34+E$32)/E$30*100,1))))","v":"  "},null,{"$f":"IF(ISBLANK(G$30),\"  \",IF(ISBLANK(G$31),\" \",IF(ISBLANK(G34),\" \",ROUND((G34+G$32)/G$30*100,1))))","v":"  "},null,{"$f":"IF(ISBLANK(I$30),\"  \",IF(ISBLANK(I$31),\" \",IF(ISBLANK(I34),\" \",ROUND((I34+I$32)/I$30*100,1))))","v":"  "},null,{"$f":"IF(ISBLANK(K$30),\"  \",IF(ISBLANK(K$31),\" \",IF(ISBLANK(K34),\" \",ROUND((K34+K$32)/K$30*100,1))))","v":"  "},null,{"$f":"IF(ISBLANK(M$30),\"  \",IF(ISBLANK(M$31),\" \",IF(ISBLANK(M34),\" \",ROUND((M34+M$32)/M$30*100,1))))","v":"  "}]
["95-100",4,null,{"$f":"IF(ISBLANK(C$30),\"  \",IF(ISBLANK(C$31),\" \",IF(ISBLANK(C35),\" \",ROUND((C35+C$32)/C$30*100,0))))","v":"  "},null,{"$f":"IF(ISBLANK(E$30),\"  \",IF(ISBLANK(E$31),\" \",IF(ISBLANK(E35),\" \",ROUND((E35+E$32)/E$30*100,0))))","v":"  "},null,{"$f":"IF(ISBLANK(G$30),\"  \",IF(ISBLANK(G$31),\" \",IF(ISBLANK(G35),\" \",ROUND((G35+G$32)/G$30*100,0))))","v":"  "},null,{"$f":"IF(ISBLANK(I$30),\"  \",IF(ISBLANK(I$31),\" \",IF(ISBLANK(I35),\" \",ROUND((I35+I$32)/I$30*100,0))))","v":"  "},null,{"$f":"IF(ISBLANK(K$30),\"  \",IF(ISBLANK(K$31),\" \",IF(ISBLANK(K35),\" \",ROUND((K35+K$32)/K$30*100,0))))","v":"  "},null,{"$f":"IF(ISBLANK(M$30),\"  \",IF(ISBLANK(M$31),\" \",IF(ISBLANK(M35),\" \",ROUND((M35+M$32)/M$30*100,0))))","v":"  "}]
["70-100",8,null,"  ",null,"  ",null,"  ",null,"  ",null,"  ",null,"  "]
["45-85",16,null,"  ",null,"  ",null,"  ",null,"  ",null,"  ",null,"  "]
["25-65",30,null,"  ",null,"  ",null,"  ",null,"  ",null,"  ",null,"  "]
["10-30",50,null,"  ",null,"  ",null,"  ",null,"  ",null,"  ",null,"  "]
["0-10",100,null,"  ",null,"  ",null,"  ",null,"  ",null,"  ",null,"  "]
[3,200,null,{"$f":"IF(ISBLANK(C$30),\"  \",IF(ISBLANK(C$31),\" \",IF(ISBLANK(C41),\" \",ROUND((C41+C$32)/C$30*100,2))))","v":"  "},null,{"$f":"IF(ISBLANK(E$30),\"  \",IF(ISBLANK(E$31),\" \",IF(ISBLANK(E41),\" \",ROUND((E41+E$32)/E$30*100,2))))","v":"  "},null,{"$f":"IF(ISBLANK(G$30),\"  \",IF(ISBLANK(G$31),\" \",IF(ISBLANK(G41),\" \",ROUND((G41+G$32)/G$30*100,2))))","v":"  "},null,{"$f":"IF(ISBLANK(I$30),\"  \",IF(ISBLANK(I$31),\" \",IF(ISBLANK(I41),\" \",ROUND((I41+I$32)/I$30*100,2))))","v":"  "},null,{"$f":"IF(ISBLANK(K$30),\"  \",IF(ISBLANK(K$31),\" \",IF(ISBLANK(K41),\" \",ROUND((K41+K$32)/K$30*100,2))))","v":"  "},null,{"$f":"IF(ISBLANK(M$30),\"  \",IF(ISBLANK(M$31),\" \",IF(ISBLANK(M41),\" \",ROUND((M41+M$32)/M$30*100,2))))","v":"  "}]
["2.30-3.15","FM",{"$f":"IF(ISBLANK(C30),\" \",IF(ISBLANK(C34),\" \",(600-SUM(D35:D40))/100))","v":" "},null,{"$f":"IF(ISBLANK(E30),\" \",IF(ISBLANK(E34),\" \",(600-SUM(F35:F40))/100))","v":" "},null,{"$f":"IF(ISBLANK(G30),\" \",IF(ISBLANK(G34),\" \",(600-SUM(H35:H40))/100))","v":" "},null,{"$f":"IF(ISBLANK(I30),\" \",IF(ISBLANK(I34),\" \",(600-SUM(J35:J40))/100))","v":" "},null,{"$f":"IF(ISBLANK(K30),\" \",IF(ISBLANK(K34),\" \",(600-SUM(L35:L40))/100))","v":" "},null,{"$f":"IF(ISBLANK(M30),\" \",IF(ISBLANK(M34),\" \",(600-SUM(N35:N40))/100))","v":" "}]
["Tested By"]
["Remarks"]
[]
[]
[]
[null,"B action","T action"]
[{"$f":"M6","v":0},{"$f":"A49-0.2","v":-0.2},{"$f":"A49+0.2","v":0.2}]
[null,{"$f":"A49-0.4","v":-0.4},{"$f":"A49+0.4","v":0.4}]

{"sheet":"S2","index":1,"n_rows":44,"n_cols":14,"rows_kept":44,"cut":false,"hidden":true,"merged":[[43,8,45,9],[43,10,45,11],[43,12,45,13],[43,0,45,1],[43,2,45,3],[43,4,45,5],[43,6,45,7],[42,10,42,11],[42,12,42,13],[42,0,42,1],[42,2,42,3],[42,4,42,5],[41,10,41,11],[41,12,41,13],[41,6,41,7],[41,8,41,9],[42,6,42,7],[42,8,42,9],[27,12,27,13],[28,10,28,11],[31,10,31,11],[31,12,31,13],[23,10,25,11],[23,12,25,13],[28,8,28,9],[11,10,11,11],[11,12,11,13],[12,0,12,1],[22,0,22,1],[22,2,22,3],[22,4,22,5],[22,6,22,7],[22,8,22,9],[21,8,21,9],[21,2,21,3],[23,2,25,3],[23,4,25,5],[23,6,25,7],[22,12,22,13],[21,12,21,13],[22,10,22,11],[21,10,21,11],[28,12,28,13],[27,10,27,11],[28,6,28,7],[10,0,10,1],[29,0,29,1],[30,0,30,1],[23,0,25,1],[27,4,27,5],[27,6,27,7],[27,8,27,9],[28,0,28,1],[28,2,28,3],[28,4,28,5],[21,4,21,5],[21,6,21,7],[11,0,11,1],[11,2,11,3],[11,4,11,5],[11,6,11,7],[23,8,25,9],[8,12,8,13],[8,6,8,7],[5,10,5,11],[5,12,5,13],[8,8,8,9],[9,0,9,1],[8,0,8,1],[8,2,8,3],[8,4,8,5],[8,10,8,11],[0,0,3,1],[1,10,1,11],[1,12,1,13],[2,10,2,11],[2,12,2,13],[3,10,3,11],[3,12,3,13],[7,0,7,1],[7,2,7,3],[7,4,7,5],[7,6,7,7],[4,10,4,11],[4,0,4,1],[4,12,4,13],[5,3,5,8],[7,8,7,9],[7,10,7,11],[0,8,3,9],[1,2,1,7],[2,2,2,7],[3,2,3,7],[7,12,7,13],[41,2,41,3],[41,4,41,5],[31,2,31,3],[31,4,31,5],[27,0,27,1],[27,2,27,3],[11,8,11,9],[31,6,31,7],[31,8,31,9],[31,0,31,1],[32,0,32,1]]}
[]
[null,null,"COMMONWEALTH OF PENNSYLVANIA",null,null,null,null,null,null,null,"DISTRICT",null,{"$f":"IF(ISBLANK('S1'!M2),\" \",'S1'!M2)","v":" "}]
[null,null,"DEPARTMENT OF TRANSPORTATION",null,null,null,null,null,null,null,"PLANT CODE",null,{"$f":"IF(ISBLANK('S1'!M3),\" \",'S1'!M3)","v":" "}]
[null,null,"PENNSYLVANIA TURNPIKE COMMISSION",null,null,null,null,null,null,null,"AGG SIZE",null,{"$f":"IF(ISBLANK('S1'!M4),\" \",'S1'!M4)","v":"Type A"}]
[{"$f":"'S1'!A5","v":"Concrete 2023"},null,null,null,null,null,null,null,null,null,"FM TARGET VALUE",null,{"$f":"IF(ISBLANK('S1'!M5),\" \",'S1'!M5)","v":" "}]
[null,null,null,"Material Test Results for Type A Fine Aggregate"]
[]
["Sample No."]
["Date"]
["St. Wt. Before Wash",null,null,"% Loss",null,"% Loss",null,"% Loss",null,"% Loss",null,"% Loss",null,"% Loss"]
["Dry Wt. After Wash",null,null,{"$f":"IF(ISBLANK(C11),\" \",IF(ISBLANK(C14),\" \",(C11-C14)/C11*100))","v":" "},null,{"$f":"IF(ISBLANK(E11),\" \",IF(ISBLANK(E14),\" \",(E11-E14)/E11*100))","v":" "},null,{"$f":"IF(ISBLANK(G11),\" \",IF(ISBLANK(G14),\" \",(G11-G14)/G11*100))","v":" "},null,{"$f":"IF(ISBLANK(I11),\" \",IF(ISBLANK(I14),\" \",(I11-I14)/I11*100))","v":" "},null,{"$f":"IF(ISBLANK(K11),\" \",IF(ISBLANK(K14),\" \",(K11-K14)/K11*100))","v":" "},null,{"$f":"IF(ISBLANK(M11),\" \",IF(ISBLANK(M14),\" \",(M11-M14)/M11*100))","v":" "}]
["Wt. Loss",null,{"$f":"IF(ISBLANK(C10),\" \",IF(ISBLANK(C11),\" \",C10-C11))","v":" "},null,{"$f":"IF(ISBLANK(E10),\" \",IF(ISBLANK(E11),\" \",E10-E11))","v":" "},null,{"$f":"IF(ISBLANK(G10),\" \",IF(ISBLANK(G11),\" \",G10-G11))","v":" "},null,{"$f":"IF(ISBLANK(I10),\" \",IF(ISBLANK(I11),\" \",I10-I11))","v":" "},null,{"$f":"IF(ISBLANK(K10),\" \",IF(ISBLANK(K11),\" \",K10-K11))","v":" "},null,{"$f":"IF(ISBLANK(M10),\" \",IF(ISBLANK(M11),\" \",M10-M11))","v":" "}]
[null,null,"Wt","% Passing","Wt","% Passing","Wt","% Passing","Wt","% Passing","Wt","% Passing","Wt","% Passing"]
[100,0.375,null,{"$f":"IF(ISBLANK(C$10),\"  \",IF(ISBLANK(C$11),\" \",IF(ISBLANK(C14),\" \",ROUND((C14+C$12)/C$10*100,1))))","v":"  "},null,{"$f":"IF(ISBLANK(E$10),\"  \",IF(ISBLANK(E$11),\" \",IF(ISBLANK(E14),\" \",ROUND((E14+E$12)/E$10*100,1))))","v":"  "},null,{"$f":"IF(ISBLANK(G$10),\"  \",IF(ISBLANK(G$11),\" \",IF(ISBLANK(G14),\" \",ROUND((G14+G$12)/G$10*100,1))))","v":"  "},null,{"$f":"IF(ISBLANK(I$10),\"  \",IF(ISBLANK(I$11),\" \",IF(ISBLANK(I14),\" \",ROUND((I14+I$12)/I$10*100,1))))","v":"  "},null,{"$f":"IF(ISBLANK(K$10),\"  \",IF(ISBLANK(K$11),\" \",IF(ISBLANK(K14),\" \",ROUND((K14+K$12)/K$10*100,1))))","v":"  "},null,{"$f":"IF(ISBLANK(M$10),\"  \",IF(ISBLANK(M$11),\" \",IF(ISBLANK(M14),\" \",ROUND((M14+M$12)/M$10*100,1))))","v":"  "}]
["95-100",4,null,{"$f":"IF(ISBLANK(C$10),\"  \",IF(ISBLANK(C$11),\" \",IF(ISBLANK(C15),\" \",ROUND((C15+C$12)/C$10*100,0))))","v":"  "},null,{"$f":"IF(ISBLANK(E$10),\"  \",IF(ISBLANK(E$11),\" \",IF(ISBLANK(E15),\" \",ROUND((E15+E$12)/E$10*100,0))))","v":"  "},null,{"$f":"IF(ISBLANK(G$10),\"  \",IF(ISBLANK(G$11),\" \",IF(ISBLANK(G15),\" \",ROUND((G15+G$12)/G$10*100,0))))","v":"  "},null,{"$f":"IF(ISBLANK(I$10),\"  \",IF(ISBLANK(I$11),\" \",IF(ISBLANK(I15),\" \",ROUND((I15+I$12)/I$10*100,0))))","v":"  "},null,{"$f":"IF(ISBLANK(K$10),\"  \",IF(ISBLANK(K$11),\" \",IF(ISBLANK(K15),\" \",ROUND((K15+K$12)/K$10*100,0))))","v":"  "},null,{"$f":"IF(ISBLANK(M$10),\"  \",IF(ISBLANK(M$11),\" \",IF(ISBLANK(M15),\" \",ROUND((M15+M$12)/M$10*100,0))))","v":"  "}]
["70-100",8,null,"  ",null,"  ",null,"  ",null,"  ",null,"  ",null,"  "]
["45-85",16,null,"  ",null,"  ",null,"  ",null,"  ",null,"  ",null,"  "]
["25-65",30,null,"  ",null,"  ",null,"  ",null,"  ",null,"  ",null,"  "]
["10-30",50,null,"  ",null,"  ",null,"  ",null,"  ",null,"  ",null,"  "]
["0-10",100,null,"  ",null,"  ",null,"  ",null,"  ",null,"  ",null,"  "]
[3,200,null,{"$f":"IF(ISBLANK(C$10),\"  \",IF(ISBLANK(C$11),\" \",IF(ISBLANK(C21),\" \",ROUND((C21+C$12)/C$10*100,2))))","v":"  "},null,{"$f":"IF(ISBLANK(E$10),\"  \",IF(ISBLANK(E$11),\" \",IF(ISBLANK(E21),\" \",ROUND((E21+E$12)/E$10*100,2))))","v":"  "},null,{"$f":"IF(ISBLANK(G$10),\"  \",IF(ISBLANK(G$11),\" \",IF(ISBLANK(G21),\" \",ROUND((G21+G$12)/G$10*100,2))))","v":"  "},null,{"$f":"IF(ISBLANK(I$10),\"  \",IF(ISBLANK(I$11),\" \",IF(ISBLANK(I21),\" \",ROUND((I21+I$12)/I$10*100,2))))","v":"  "},null,{"$f":"IF(ISBLANK(K$10),\"  \",IF(ISBLANK(K$11),\" \",IF(ISBLANK(K21),\" \",ROUND((K21+K$12)/K$10*100,2))))","v":"  "},null,{"$f":"IF(ISBLANK(M$10),\"  \",IF(ISBLANK(M$11),\" \",IF(ISBLANK(M21),\" \",ROUND((M21+M$12)/M$10*100,2))))","v":"  "}]
["2.30-3.15","FM",{"$f":"IF(ISBLANK(C10),\" \",IF(ISBLANK(C14),\" \",(600-SUM(D15:D20))/100))","v":" "},null,{"$f":"IF(ISBLANK(E10),\" \",IF(ISBLANK(E14),\" \",(600-SUM(F15:F20))/100))","v":" "},null,{"$f":"IF(ISBLANK(G10),\" \",IF(ISBLANK(G14),\" \",(600-SUM(H15:H20))/100))","v":" "},null,{"$f":"IF(ISBLANK(I10),\" \",IF(ISBLANK(I14),\" \",(600-SUM(J15:J20))/100))","v":" "},null,{"$f":"IF(ISBLANK(K10),\" \",IF(ISBLANK(K14),\" \",(600-SUM(L15:L20))/100))","v":" "},null,{"$f":"IF(ISBLANK(M10),\" \",IF(ISBLANK(M14),\" \",(600-SUM(N15:N20))/100))","v":" "}]
["Tested By"]
["Remarks"]
[]
[]
[]
["Sample No."]
["Date"]
["St. Wt. Before Wash",null,null,"% Loss",null,"% Loss",null,"% Loss",null,"% Loss",null,"% Loss",null,"% Loss"]
["Dry Wt. After Wash",null,null,{"$f":"IF(ISBLANK(C31),\" \",IF(ISBLANK(C34),\" \",(C31-C34)/C31*100))","v":" "},null,{"$f":"IF(ISBLANK(E31),\" \",IF(ISBLANK(E34),\" \",(E31-E34)/E31*100))","v":" "},null,{"$f":"IF(ISBLANK(G31),\" \",IF(ISBLANK(G34),\" \",(G31-G34)/G31*100))","v":" "},null,{"$f":"IF(ISBLANK(I31),\" \",IF(ISBLANK(I34),\" \",(I31-I34)/I31*100))","v":" "},null,{"$f":"IF(ISBLANK(K31),\" \",IF(ISBLANK(K34),\" \",(K31-K34)/K31*100))","v":" "},null,{"$f":"IF(ISBLANK(M31),\" \",IF(ISBLANK(M34),\" \",(M31-M34)/M31*100))","v":" "}]
["Wt. Loss",null,{"$f":"IF(ISBLANK(C30),\" \",IF(ISBLANK(C31),\" \",C30-C31))","v":" "},null,{"$f":"IF(ISBLANK(E30),\" \",IF(ISBLANK(E31),\" \",E30-E31))","v":" "},null,{"$f":"IF(ISBLANK(G30),\" \",IF(ISBLANK(G31),\" \",G30-G31))","v":" "},null,{"$f":"IF(ISBLANK(I30),\" \",IF(ISBLANK(I31),\" \",I30-I31))","v":" "},null,{"$f":"IF(ISBLANK(K30),\" \",IF(ISBLANK(K31),\" \",K30-K31))","v":" "},null,{"$f":"IF(ISBLANK(M30),\" \",IF(ISBLANK(M31),\" \",M30-M31))","v":" "}]
[null,null,"Wt","% Passing","Wt","% Passing","Wt","% Passing","Wt","% Passing","Wt","% Passing","Wt","% Passing"]
[100,0.375,null,{"$f":"IF(ISBLANK(C$30),\"  \",IF(ISBLANK(C$31),\" \",IF(ISBLANK(C34),\" \",ROUND((C34+C$32)/C$30*100,1))))","v":"  "},null,{"$f":"IF(ISBLANK(E$30),\"  \",IF(ISBLANK(E$31),\" \",IF(ISBLANK(E34),\" \",ROUND((E34+E$32)/E$30*100,1))))","v":"  "},null,{"$f":"IF(ISBLANK(G$30),\"  \",IF(ISBLANK(G$31),\" \",IF(ISBLANK(G34),\" \",ROUND((G34+G$32)/G$30*100,1))))","v":"  "},null,{"$f":"IF(ISBLANK(I$30),\"  \",IF(ISBLANK(I$31),\" \",IF(ISBLANK(I34),\" \",ROUND((I34+I$32)/I$30*100,1))))","v":"  "},null,{"$f":"IF(ISBLANK(K$30),\"  \",IF(ISBLANK(K$31),\" \",IF(ISBLANK(K34),\" \",ROUND((K34+K$32)/K$30*100,1))))","v":"  "},null,{"$f":"IF(ISBLANK(M$30),\"  \",IF(ISBLANK(M$31),\" \",IF(ISBLANK(M34),\" \",ROUND((M34+M$32)/M$30*100,1))))","v":"  "}]
["95-100",4,null,{"$f":"IF(ISBLANK(C$30),\"  \",IF(ISBLANK(C$31),\" \",IF(ISBLANK(C35),\" \",ROUND((C35+C$32)/C$30*100,0))))","v":"  "},null,{"$f":"IF(ISBLANK(E$30),\"  \",IF(ISBLANK(E$31),\" \",IF(ISBLANK(E35),\" \",ROUND((E35+E$32)/E$30*100,0))))","v":"  "},null,{"$f":"IF(ISBLANK(G$30),\"  \",IF(ISBLANK(G$31),\" \",IF(ISBLANK(G35),\" \",ROUND((G35+G$32)/G$30*100,0))))","v":"  "},null,{"$f":"IF(ISBLANK(I$30),\"  \",IF(ISBLANK(I$31),\" \",IF(ISBLANK(I35),\" \",ROUND((I35+I$32)/I$30*100,0))))","v":"  "},null,{"$f":"IF(ISBLANK(K$30),\"  \",IF(ISBLANK(K$31),\" \",IF(ISBLANK(K35),\" \",ROUND((K35+K$32)/K$30*100,0))))","v":"  "},null,{"$f":"IF(ISBLANK(M$30),\"  \",IF(ISBLANK(M$31),\" \",IF(ISBLANK(M35),\" \",ROUND((M35+M$32)/M$30*100,0))))","v":"  "}]
["70-100",8,null,"  ",null,"  ",null,"  ",null,"  ",null,"  ",null,"  "]
["45-85",16,null,"  ",null,"  ",null,"  ",null,"  ",null,"  ",null,"  "]
["25-65",30,null,"  ",null,"  ",null,"  ",null,"  ",null,"  ",null,"  "]
["10-30",50,null,"  ",null,"  ",null,"  ",null,"  ",null,"  ",null,"  "]
["0-10",100,null,"  ",null,"  ",null,"  ",null,"  ",null,"  ",null,"  "]
[3,200,null,{"$f":"IF(ISBLANK(C$30),\"  \",IF(ISBLANK(C$31),\" \",IF(ISBLANK(C41),\" \",ROUND((C41+C$32)/C$30*100,2))))","v":"  "},null,{"$f":"IF(ISBLANK(E$30),\"  \",IF(ISBLANK(E$31),\" \",IF(ISBLANK(E41),\" \",ROUND((E41+E$32)/E$30*100,2))))","v":"  "},null,{"$f":"IF(ISBLANK(G$30),\"  \",IF(ISBLANK(G$31),\" \",IF(ISBLANK(G41),\" \",ROUND((G41+G$32)/G$30*100,2))))","v":"  "},null,{"$f":"IF(ISBLANK(I$30),\"  \",IF(ISBLANK(I$31),\" \",IF(ISBLANK(I41),\" \",ROUND((I41+I$32)/I$30*100,2))))","v":"  "},null,{"$f":"IF(ISBLANK(K$30),\"  \",IF(ISBLANK(K$31),\" \",IF(ISBLANK(K41),\" \",ROUND((K41+K$32)/K$30*100,2))))","v":"  "},null,{"$f":"IF(ISBLANK(M$30),\"  \",IF(ISBLANK(M$31),\" \",IF(ISBLANK(M41),\" \",ROUND((M41+M$32)/M$30*100,2))))","v":"  "}]
["2.30-3.15","FM",{"$f":"IF(ISBLANK(C30),\" \",IF(ISBLANK(C34),\" \",(600-SUM(D35:D40))/100))","v":" "},null,{"$f":"IF(ISBLANK(E30),\" \",IF(ISBLANK(E34),\" \",(600-SUM(F35:F40))/100))","v":" "},null,{"$f":"IF(ISBLANK(G30),\" \",IF(ISBLANK(G34),\" \",(600-SUM(H35:H40))/100))","v":" "},null,{"$f":"IF(ISBLANK(I30),\" \",IF(ISBLANK(I34),\" \",(600-SUM(J35:J40))/100))","v":" "},null,{"$f":"IF(ISBLANK(K30),\" \",IF(ISBLANK(K34),\" \",(600-SUM(L35:L40))/100))","v":" "},null,{"$f":"IF(ISBLANK(M30),\" \",IF(ISBLANK(M34),\" \",(600-SUM(N35:N40))/100))","v":" "}]
["Tested By"]
["Remarks"]

{"sheet":"S3","index":2,"n_rows":44,"n_cols":14,"rows_kept":44,"cut":false,"hidden":true,"merged":[[43,0,45,1],[43,2,45,3],[43,4,45,5],[43,6,45,7],[43,8,45,9],[43,10,45,11],[43,12,45,13],[42,4,42,5],[42,6,42,7],[42,0,42,1],[42,2,42,3],[1,12,1,13],[2,10,2,11],[2,12,2,13],[3,10,3,11],[3,12,3,13],[42,8,42,9],[42,10,42,11],[22,12,22,13],[23,0,25,1],[23,2,25,3],[23,4,25,5],[23,6,25,7],[23,8,25,9],[23,10,25,11],[42,12,42,13],[7,12,7,13],[8,0,8,1],[8,2,8,3],[8,4,8,5],[8,6,8,7],[8,8,8,9],[8,10,8,11],[7,0,7,1],[4,12,4,13],[8,12,8,13],[5,3,5,8],[7,8,7,9],[5,10,5,11],[5,12,5,13],[7,2,7,3],[7,4,7,5],[7,6,7,7],[4,10,4,11],[31,0,31,1],[31,2,31,3],[41,2,41,3],[32,0,32,1],[22,10,22,11],[29,0,29,1],[28,0,28,1],[28,2,28,3],[27,0,27,1],[27,4,27,5],[27,6,27,7],[22,6,22,7],[22,8,22,9],[31,12,31,13],[41,12,41,13],[11,12,11,13],[28,8,28,9],[28,6,28,7],[27,2,27,3],[11,2,11,3],[11,4,11,5],[11,6,11,7],[21,2,21,3],[21,12,21,13],[28,12,28,13],[27,12,27,13],[23,12,25,13],[28,4,28,5],[22,2,22,3],[22,4,22,5],[21,8,21,9],[21,4,21,5],[21,6,21,7],[21,10,21,11],[11,8,11,9],[11,10,11,11],[28,10,28,11],[0,8,3,9],[1,2,1,7],[2,2,2,7],[3,2,3,7],[4,0,4,1],[41,8,41,9],[41,10,41,11],[27,10,27,11],[27,8,27,9],[31,8,31,9],[31,10,31,11],[10,0,10,1],[12,0,12,1],[22,0,22,1],[9,0,9,1],[7,10,7,11],[0,0,3,1],[1,10,1,11],[11,0,11,1],[31,4,31,5],[31,6,31,7],[41,4,41,5],[41,6,41,7],[30,0,30,1]]}
[]
[null,null,"COMMONWEALTH OF PENNSYLVANIA",null,null,null,null,null,null,null,"DISTRICT",null,{"$f":"IF(ISBLANK('S1'!M2),\" \",'S1'!M2)","v":" "}]
[null,null,"DEPARTMENT OF TRANSPORTATION",null,null,null,null,null,null,null,"PLANT CODE",null,{"$f":"IF(ISBLANK('S1'!M3),\" \",'S1'!M3)","v":" "}]
[null,null,"PENNSYLVANIA TURNPIKE COMMISSION",null,null,null,null,null,null,null,"AGG SIZE",null,{"$f":"IF(ISBLANK('S1'!M4),\" \",'S1'!M4)","v":"Type A"}]
[{"$f":"'S1'!A5","v":"Concrete 2023"},null,null,null,null,null,null,null,null,null,"FM TARGET VALUE",null,{"$f":"IF(ISBLANK('S1'!M5),\" \",'S1'!M5)","v":" "}]
[null,null,null,"Material Test Results for Type A Fine Aggregate"]
[]
["Sample No."]
["Date"]
["St. Wt. Before Wash",null,null,"% Loss",null,"% Loss",null,"% Loss",null,"% Loss",null,"% Loss",null,"% Loss"]
["Dry Wt. After Wash",null,null,{"$f":"IF(ISBLANK(C11),\" \",IF(ISBLANK(C14),\" \",(C11-C14)/C11*100))","v":" "},null,{"$f":"IF(ISBLANK(E11),\" \",IF(ISBLANK(E14),\" \",(E11-E14)/E11*100))","v":" "},null,{"$f":"IF(ISBLANK(G11),\" \",IF(ISBLANK(G14),\" \",(G11-G14)/G11*100))","v":" "},null,{"$f":"IF(ISBLANK(I11),\" \",IF(ISBLANK(I14),\" \",(I11-I14)/I11*100))","v":" "},null,{"$f":"IF(ISBLANK(K11),\" \",IF(ISBLANK(K14),\" \",(K11-K14)/K11*100))","v":" "},null,{"$f":"IF(ISBLANK(M11),\" \",IF(ISBLANK(M14),\" \",(M11-M14)/M11*100))","v":" "}]
["Wt. Loss",null,{"$f":"IF(ISBLANK(C10),\" \",IF(ISBLANK(C11),\" \",C10-C11))","v":" "},null,{"$f":"IF(ISBLANK(E10),\" \",IF(ISBLANK(E11),\" \",E10-E11))","v":" "},null,{"$f":"IF(ISBLANK(G10),\" \",IF(ISBLANK(G11),\" \",G10-G11))","v":" "},null,{"$f":"IF(ISBLANK(I10),\" \",IF(ISBLANK(I11),\" \",I10-I11))","v":" "},null,{"$f":"IF(ISBLANK(K10),\" \",IF(ISBLANK(K11),\" \",K10-K11))","v":" "},null,{"$f":"IF(ISBLANK(M10),\" \",IF(ISBLANK(M11),\" \",M10-M11))","v":" "}]
[null,null,"Wt","% Passing","Wt","% Passing","Wt","% Passing","Wt","% Passing","Wt","% Passing","Wt","% Passing"]
[100,0.375,null,{"$f":"IF(ISBLANK(C$10),\"  \",IF(ISBLANK(C$11),\" \",IF(ISBLANK(C14),\" \",ROUND((C14+C$12)/C$10*100,1))))","v":"  "},null,{"$f":"IF(ISBLANK(E$10),\"  \",IF(ISBLANK(E$11),\" \",IF(ISBLANK(E14),\" \",ROUND((E14+E$12)/E$10*100,1))))","v":"  "},null,{"$f":"IF(ISBLANK(G$10),\"  \",IF(ISBLANK(G$11),\" \",IF(ISBLANK(G14),\" \",ROUND((G14+G$12)/G$10*100,1))))","v":"  "},null,{"$f":"IF(ISBLANK(I$10),\"  \",IF(ISBLANK(I$11),\" \",IF(ISBLANK(I14),\" \",ROUND((I14+I$12)/I$10*100,1))))","v":"  "},null,{"$f":"IF(ISBLANK(K$10),\"  \",IF(ISBLANK(K$11),\" \",IF(ISBLANK(K14),\" \",ROUND((K14+K$12)/K$10*100,1))))","v":"  "},null,{"$f":"IF(ISBLANK(M$10),\"  \",IF(ISBLANK(M$11),\" \",IF(ISBLANK(M14),\" \",ROUND((M14+M$12)/M$10*100,1))))","v":"  "}]
["95-100",4,null,{"$f":"IF(ISBLANK(C$10),\"  \",IF(ISBLANK(C$11),\" \",IF(ISBLANK(C15),\" \",ROUND((C15+C$12)/C$10*100,0))))","v":"  "},null,{"$f":"IF(ISBLANK(E$10),\"  \",IF(ISBLANK(E$11),\" \",IF(ISBLANK(E15),\" \",ROUND((E15+E$12)/E$10*100,0))))","v":"  "},null,{"$f":"IF(ISBLANK(G$10),\"  \",IF(ISBLANK(G$11),\" \",IF(ISBLANK(G15),\" \",ROUND((G15+G$12)/G$10*100,0))))","v":"  "},null,{"$f":"IF(ISBLANK(I$10),\"  \",IF(ISBLANK(I$11),\" \",IF(ISBLANK(I15),\" \",ROUND((I15+I$12)/I$10*100,0))))","v":"  "},null,{"$f":"IF(ISBLANK(K$10),\"  \",IF(ISBLANK(K$11),\" \",IF(ISBLANK(K15),\" \",ROUND((K15+K$12)/K$10*100,0))))","v":"  "},null,{"$f":"IF(ISBLANK(M$10),\"  \",IF(ISBLANK(M$11),\" \",IF(ISBLANK(M15),\" \",ROUND((M15+M$12)/M$10*100,0))))","v":"  "}]
["70-100",8,null,"  ",null,"  ",null,"  ",null,"  ",null,"  ",null,"  "]
["45-85",16,null,"  ",null,"  ",null,"  ",null,"  ",null,"  ",null,"  "]
["25-65",30,null,"  ",null,"  ",null,"  ",null,"  ",null,"  ",null,"  "]
["10-30",50,null,"  ",null,"  ",null,"  ",null,"  ",null,"  ",null,"  "]
["0-10",100,null,"  ",null,"  ",null,"  ",null,"  ",null,"  ",null,"  "]
[3,200,null,{"$f":"IF(ISBLANK(C$10),\"  \",IF(ISBLANK(C$11),\" \",IF(ISBLANK(C21),\" \",ROUND((C21+C$12)/C$10*100,2))))","v":"  "},null,{"$f":"IF(ISBLANK(E$10),\"  \",IF(ISBLANK(E$11),\" \",IF(ISBLANK(E21),\" \",ROUND((E21+E$12)/E$10*100,2))))","v":"  "},null,{"$f":"IF(ISBLANK(G$10),\"  \",IF(ISBLANK(G$11),\" \",IF(ISBLANK(G21),\" \",ROUND((G21+G$12)/G$10*100,2))))","v":"  "},null,{"$f":"IF(ISBLANK(I$10),\"  \",IF(ISBLANK(I$11),\" \",IF(ISBLANK(I21),\" \",ROUND((I21+I$12)/I$10*100,2))))","v":"  "},null,{"$f":"IF(ISBLANK(K$10),\"  \",IF(ISBLANK(K$11),\" \",IF(ISBLANK(K21),\" \",ROUND((K21+K$12)/K$10*100,2))))","v":"  "},null,{"$f":"IF(ISBLANK(M$10),\"  \",IF(ISBLANK(M$11),\" \",IF(ISBLANK(M21),\" \",ROUND((M21+M$12)/M$10*100,2))))","v":"  "}]
["2.30-3.15","FM",{"$f":"IF(ISBLANK(C10),\" \",IF(ISBLANK(C14),\" \",(600-SUM(D15:D20))/100))","v":" "},null,{"$f":"IF(ISBLANK(E10),\" \",IF(ISBLANK(E14),\" \",(600-SUM(F15:F20))/100))","v":" "},null,{"$f":"IF(ISBLANK(G10),\" \",IF(ISBLANK(G14),\" \",(600-SUM(H15:H20))/100))","v":" "},null,{"$f":"IF(ISBLANK(I10),\" \",IF(ISBLANK(I14),\" \",(600-SUM(J15:J20))/100))","v":" "},null,{"$f":"IF(ISBLANK(K10),\" \",IF(ISBLANK(K14),\" \",(600-SUM(L15:L20))/100))","v":" "},null,{"$f":"IF(ISBLANK(M10),\" \",IF(ISBLANK(M14),\" \",(600-SUM(N15:N20))/100))","v":" "}]
["Tested By"]
["Remarks"]
[]
[]
[]
["Sample No."]
["Date"]
["St. Wt. Before Wash",null,null,"% Loss",null,"% Loss",null,"% Loss",null,"% Loss",null,"% Loss",null,"% Loss"]
["Dry Wt. After Wash",null,null,{"$f":"IF(ISBLANK(C31),\" \",IF(ISBLANK(C34),\" \",(C31-C34)/C31*100))","v":" "},null,{"$f":"IF(ISBLANK(E31),\" \",IF(ISBLANK(E34),\" \",(E31-E34)/E31*100))","v":" "},null,{"$f":"IF(ISBLANK(G31),\" \",IF(ISBLANK(G34),\" \",(G31-G34)/G31*100))","v":" "},null,{"$f":"IF(ISBLANK(I31),\" \",IF(ISBLANK(I34),\" \",(I31-I34)/I31*100))","v":" "},null,{"$f":"IF(ISBLANK(K31),\" \",IF(ISBLANK(K34),\" \",(K31-K34)/K31*100))","v":" "},null,{"$f":"IF(ISBLANK(M31),\" \",IF(ISBLANK(M34),\" \",(M31-M34)/M31*100))","v":" "}]
["Wt. Loss",null,{"$f":"IF(ISBLANK(C30),\" \",IF(ISBLANK(C31),\" \",C30-C31))","v":" "},null,{"$f":"IF(ISBLANK(E30),\" \",IF(ISBLANK(E31),\" \",E30-E31))","v":" "},null,{"$f":"IF(ISBLANK(G30),\" \",IF(ISBLANK(G31),\" \",G30-G31))","v":" "},null,{"$f":"IF(ISBLANK(I30),\" \",IF(ISBLANK(I31),\" \",I30-I31))","v":" "},null,{"$f":"IF(ISBLANK(K30),\" \",IF(ISBLANK(K31),\" \",K30-K31))","v":" "},null,{"$f":"IF(ISBLANK(M30),\" \",IF(ISBLANK(M31),\" \",M30-M31))","v":" "}]
[null,null,"Wt","% Passing","Wt","% Passing","Wt","% Passing","Wt","% Passing","Wt","% Passing","Wt","% Passing"]
[100,0.375,null,{"$f":"IF(ISBLANK(C$30),\"  \",IF(ISBLANK(C$31),\" \",IF(ISBLANK(C34),\" \",ROUND((C34+C$32)/C$30*100,1))))","v":"  "},null,{"$f":"IF(ISBLANK(E$30),\"  \",IF(ISBLANK(E$31),\" \",IF(ISBLANK(E34),\" \",ROUND((E34+E$32)/E$30*100,1))))","v":"  "},null,{"$f":"IF(ISBLANK(G$30),\"  \",IF(ISBLANK(G$31),\" \",IF(ISBLANK(G34),\" \",ROUND((G34+G$32)/G$30*100,1))))","v":"  "},null,{"$f":"IF(ISBLANK(I$30),\"  \",IF(ISBLANK(I$31),\" \",IF(ISBLANK(I34),\" \",ROUND((I34+I$32)/I$30*100,1))))","v":"  "},null,{"$f":"IF(ISBLANK(K$30),\"  \",IF(ISBLANK(K$31),\" \",IF(ISBLANK(K34),\" \",ROUND((K34+K$32)/K$30*100,1))))","v":"  "},null,{"$f":"IF(ISBLANK(M$30),\"  \",IF(ISBLANK(M$31),\" \",IF(ISBLANK(M34),\" \",ROUND((M34+M$32)/M$30*100,1))))","v":"  "}]
["95-100",4,null,{"$f":"IF(ISBLANK(C$30),\"  \",IF(ISBLANK(C$31),\" \",IF(ISBLANK(C35),\" \",ROUND((C35+C$32)/C$30*100,0))))","v":"  "},null,{"$f":"IF(ISBLANK(E$30),\"  \",IF(ISBLANK(E$31),\" \",IF(ISBLANK(E35),\" \",ROUND((E35+E$32)/E$30*100,0))))","v":"  "},null,{"$f":"IF(ISBLANK(G$30),\"  \",IF(ISBLANK(G$31),\" \",IF(ISBLANK(G35),\" \",ROUND((G35+G$32)/G$30*100,0))))","v":"  "},null,{"$f":"IF(ISBLANK(I$30),\"  \",IF(ISBLANK(I$31),\" \",IF(ISBLANK(I35),\" \",ROUND((I35+I$32)/I$30*100,0))))","v":"  "},null,{"$f":"IF(ISBLANK(K$30),\"  \",IF(ISBLANK(K$31),\" \",IF(ISBLANK(K35),\" \",ROUND((K35+K$32)/K$30*100,0))))","v":"  "},null,{"$f":"IF(ISBLANK(M$30),\"  \",IF(ISBLANK(M$31),\" \",IF(ISBLANK(M35),\" \",ROUND((M35+M$32)/M$30*100,0))))","v":"  "}]
["70-100",8,null,"  ",null,"  ",null,"  ",null,"  ",null,"  ",null,"  "]
["45-85",16,null,"  ",null,"  ",null,"  ",null,"  ",null,"  ",null,"  "]
["25-65",30,null,"  ",null,"  ",null,"  ",null,"  ",null,"  ",null,"  "]
["10-30",50,null,"  ",null,"  ",null,"  ",null,"  ",null,"  ",null,"  "]
["0-10",100,null,"  ",null,"  ",null,"  ",null,"  ",null,"  ",null,"  "]
[3,200,null,{"$f":"IF(ISBLANK(C$30),\"  \",IF(ISBLANK(C$31),\" \",IF(ISBLANK(C41),\" \",ROUND((C41+C$32)/C$30*100,2))))","v":"  "},null,{"$f":"IF(ISBLANK(E$30),\"  \",IF(ISBLANK(E$31),\" \",IF(ISBLANK(E41),\" \",ROUND((E41+E$32)/E$30*100,2))))","v":"  "},null,{"$f":"IF(ISBLANK(G$30),\"  \",IF(ISBLANK(G$31),\" \",IF(ISBLANK(G41),\" \",ROUND((G41+G$32)/G$30*100,2))))","v":"  "},null,{"$f":"IF(ISBLANK(I$30),\"  \",IF(ISBLANK(I$31),\" \",IF(ISBLANK(I41),\" \",ROUND((I41+I$32)/I$30*100,2))))","v":"  "},null,{"$f":"IF(ISBLANK(K$30),\"  \",IF(ISBLANK(K$31),\" \",IF(ISBLANK(K41),\" \",ROUND((K41+K$32)/K$30*100,2))))","v":"  "},null,{"$f":"IF(ISBLANK(M$30),\"  \",IF(ISBLANK(M$31),\" \",IF(ISBLANK(M41),\" \",ROUND((M41+M$32)/M$30*100,2))))","v":"  "}]
["2.30-3.15","FM",{"$f":"IF(ISBLANK(C30),\" \",IF(ISBLANK(C34),\" \",(600-SUM(D35:D40))/100))","v":" "},null,{"$f":"IF(ISBLANK(E30),\" \",IF(ISBLANK(E34),\" \",(600-SUM(F35:F40))/100))","v":" "},null,{"$f":"IF(ISBLANK(G30),\" \",IF(ISBLANK(G34),\" \",(600-SUM(H35:H40))/100))","v":" "},null,{"$f":"IF(ISBLANK(I30),\" \",IF(ISBLANK(I34),\" \",(600-SUM(J35:J40))/100))","v":" "},null,{"$f":"IF(ISBLANK(K30),\" \",IF(ISBLANK(K34),\" \",(600-SUM(L35:L40))/100))","v":" "},null,{"$f":"IF(ISBLANK(M30),\" \",IF(ISBLANK(M34),\" \",(600-SUM(N35:N40))/100))","v":" "}]
["Tested By"]
["Remarks"]

{"sheet":"S4","index":3,"n_rows":44,"n_cols":14,"rows_kept":44,"cut":false,"hidden":true,"merged":[[43,0,45,1],[43,2,45,3],[43,4,45,5],[43,6,45,7],[43,8,45,9],[43,10,45,11],[43,12,45,13],[42,4,42,5],[42,6,42,7],[42,0,42,1],[42,2,42,3],[1,12,1,13],[2,10,2,11],[2,12,2,13],[3,10,3,11],[3,12,3,13],[42,8,42,9],[42,10,42,11],[22,12,22,13],[23,0,25,1],[23,2,25,3],[23,4,25,5],[23,6,25,7],[23,8,25,9],[23,10,25,11],[42,12,42,13],[7,12,7,13],[8,0,8,1],[8,2,8,3],[8,4,8,5],[8,6,8,7],[8,8,8,9],[8,10,8,11],[7,0,7,1],[4,12,4,13],[8,12,8,13],[5,3,5,8],[7,8,7,9],[5,10,5,11],[5,12,5,13],[7,2,7,3],[7,4,7,5],[7,6,7,7],[4,10,4,11],[31,0,31,1],[31,2,31,3],[41,2,41,3],[32,0,32,1],[22,10,22,11],[29,0,29,1],[28,0,28,1],[28,2,28,3],[27,0,27,1],[27,4,27,5],[27,6,27,7],[22,6,22,7],[22,8,22,9],[31,12,31,13],[41,12,41,13],[11,12,11,13],[28,8,28,9],[28,6,28,7],[27,2,27,3],[11,2,11,3],[11,4,11,5],[11,6,11,7],[21,2,21,3],[21,12,21,13],[28,12,28,13],[27,12,27,13],[23,12,25,13],[28,4,28,5],[22,2,22,3],[22,4,22,5],[21,8,21,9],[21,4,21,5],[21,6,21,7],[21,10,21,11],[11,8,11,9],[11,10,11,11],[28,10,28,11],[0,8,3,9],[1,2,1,7],[2,2,2,7],[3,2,3,7],[4,0,4,1],[41,8,41,9],[41,10,41,11],[27,10,27,11],[27,8,27,9],[31,8,31,9],[31,10,31,11],[10,0,10,1],[12,0,12,1],[22,0,22,1],[9,0,9,1],[7,10,7,11],[0,0,3,1],[1,10,1,11],[11,0,11,1],[31,4,31,5],[31,6,31,7],[41,4,41,5],[41,6,41,7],[30,0,30,1]]}
[]
[null,null,"COMMONWEALTH OF PENNSYLVANIA",null,null,null,null,null,null,null,"DISTRICT",null,{"$f":"IF(ISBLANK('S1'!M2),\" \",'S1'!M2)","v":" "}]
[null,null,"DEPARTMENT OF TRANSPORTATION",null,null,null,null,null,null,null,"PLANT CODE",null,{"$f":"IF(ISBLANK('S1'!M3),\" \",'S1'!M3)","v":" "}]
[null,null,"PENNSYLVANIA TURNPIKE COMMISSION",null,null,null,null,null,null,null,"AGG SIZE",null,{"$f":"IF(ISBLANK('S1'!M4),\" \",'S1'!M4)","v":"Type A"}]
[{"$f":"'S1'!A5","v":"Concrete 2023"},null,null,null,null,null,null,null,null,null,"FM TARGET VALUE",null,{"$f":"IF(ISBLANK('S1'!M5),\" \",'S1'!M5)","v":" "}]
[null,null,null,"Material Test Results for Type A Fine Aggregate"]
[]
["Sample No."]
["Date"]
["St. Wt. Before Wash",null,null,"% Loss",null,"% Loss",null,"% Loss",null,"% Loss",null,"% Loss",null,"% Loss"]
["Dry Wt. After Wash",null,null,{"$f":"IF(ISBLANK(C11),\" \",IF(ISBLANK(C14),\" \",(C11-C14)/C11*100))","v":" "},null,{"$f":"IF(ISBLANK(E11),\" \",IF(ISBLANK(E14),\" \",(E11-E14)/E11*100))","v":" "},null,{"$f":"IF(ISBLANK(G11),\" \",IF(ISBLANK(G14),\" \",(G11-G14)/G11*100))","v":" "},null,{"$f":"IF(ISBLANK(I11),\" \",IF(ISBLANK(I14),\" \",(I11-I14)/I11*100))","v":" "},null,{"$f":"IF(ISBLANK(K11),\" \",IF(ISBLANK(K14),\" \",(K11-K14)/K11*100))","v":" "},null,{"$f":"IF(ISBLANK(M11),\" \",IF(ISBLANK(M14),\" \",(M11-M14)/M11*100))","v":" "}]
["Wt. Loss",null,{"$f":"IF(ISBLANK(C10),\" \",IF(ISBLANK(C11),\" \",C10-C11))","v":" "},null,{"$f":"IF(ISBLANK(E10),\" \",IF(ISBLANK(E11),\" \",E10-E11))","v":" "},null,{"$f":"IF(ISBLANK(G10),\" \",IF(ISBLANK(G11),\" \",G10-G11))","v":" "},null,{"$f":"IF(ISBLANK(I10),\" \",IF(ISBLANK(I11),\" \",I10-I11))","v":" "},null,{"$f":"IF(ISBLANK(K10),\" \",IF(ISBLANK(K11),\" \",K10-K11))","v":" "},null,{"$f":"IF(ISBLANK(M10),\" \",IF(ISBLANK(M11),\" \",M10-M11))","v":" "}]
[null,null,"Wt","% Passing","Wt","% Passing","Wt","% Passing","Wt","% Passing","Wt","% Passing","Wt","% Passing"]
[100,0.375,null,{"$f":"IF(ISBLANK(C$10),\"  \",IF(ISBLANK(C$11),\" \",IF(ISBLANK(C14),\" \",ROUND((C14+C$12)/C$10*100,1))))","v":"  "},null,{"$f":"IF(ISBLANK(E$10),\"  \",IF(ISBLANK(E$11),\" \",IF(ISBLANK(E14),\" \",ROUND((E14+E$12)/E$10*100,1))))","v":"  "},null,{"$f":"IF(ISBLANK(G$10),\"  \",IF(ISBLANK(G$11),\" \",IF(ISBLANK(G14),\" \",ROUND((G14+G$12)/G$10*100,1))))","v":"  "},null,{"$f":"IF(ISBLANK(I$10),\"  \",IF(ISBLANK(I$11),\" \",IF(ISBLANK(I14),\" \",ROUND((I14+I$12)/I$10*100,1))))","v":"  "},null,{"$f":"IF(ISBLANK(K$10),\"  \",IF(ISBLANK(K$11),\" \",IF(ISBLANK(K14),\" \",ROUND((K14+K$12)/K$10*100,1))))","v":"  "},null,{"$f":"IF(ISBLANK(M$10),\"  \",IF(ISBLANK(M$11),\" \",IF(ISBLANK(M14),\" \",ROUND((M14+M$12)/M$10*100,1))))","v":"  "}]
["95-100",4,null,{"$f":"IF(ISBLANK(C$10),\"  \",IF(ISBLANK(C$11),\" \",IF(ISBLANK(C15),\" \",ROUND((C15+C$12)/C$10*100,0))))","v":"  "},null,{"$f":"IF(ISBLANK(E$10),\"  \",IF(ISBLANK(E$11),\" \",IF(ISBLANK(E15),\" \",ROUND((E15+E$12)/E$10*100,0))))","v":"  "},null,{"$f":"IF(ISBLANK(G$10),\"  \",IF(ISBLANK(G$11),\" \",IF(ISBLANK(G15),\" \",ROUND((G15+G$12)/G$10*100,0))))","v":"  "},null,{"$f":"IF(ISBLANK(I$10),\"  \",IF(ISBLANK(I$11),\" \",IF(ISBLANK(I15),\" \",ROUND((I15+I$12)/I$10*100,0))))","v":"  "},null,{"$f":"IF(ISBLANK(K$10),\"  \",IF(ISBLANK(K$11),\" \",IF(ISBLANK(K15),\" \",ROUND((K15+K$12)/K$10*100,0))))","v":"  "},null,{"$f":"IF(ISBLANK(M$10),\"  \",IF(ISBLANK(M$11),\" \",IF(ISBLANK(M15),\" \",ROUND((M15+M$12)/M$10*100,0))))","v":"  "}]
["70-100",8,null,"  ",null,"  ",null,"  ",null,"  ",null,"  ",null,"  "]
["45-85",16,null,"  ",null,"  ",null,"  ",null,"  ",null,"  ",null,"  "]
["25-65",30,null,"  ",null,"  ",null,"  ",null,"  ",null,"  ",null,"  "]
["10-30",50,null,"  ",null,"  ",null,"  ",null,"  ",null,"  ",null,"  "]
["0-10",100,null,"  ",null,"  ",null,"  ",null,"  ",null,"  ",null,"  "]
[3,200,null,{"$f":"IF(ISBLANK(C$10),\"  \",IF(ISBLANK(C$11),\" \",IF(ISBLANK(C21),\" \",ROUND((C21+C$12)/C$10*100,2))))","v":"  "},null,{"$f":"IF(ISBLANK(E$10),\"  \",IF(ISBLANK(E$11),\" \",IF(ISBLANK(E21),\" \",ROUND((E21+E$12)/E$10*100,2))))","v":"  "},null,{"$f":"IF(ISBLANK(G$10),\"  \",IF(ISBLANK(G$11),\" \",IF(ISBLANK(G21),\" \",ROUND((G21+G$12)/G$10*100,2))))","v":"  "},null,{"$f":"IF(ISBLANK(I$10),\"  \",IF(ISBLANK(I$11),\" \",IF(ISBLANK(I21),\" \",ROUND((I21+I$12)/I$10*100,2))))","v":"  "},null,{"$f":"IF(ISBLANK(K$10),\"  \",IF(ISBLANK(K$11),\" \",IF(ISBLANK(K21),\" \",ROUND((K21+K$12)/K$10*100,2))))","v":"  "},null,{"$f":"IF(ISBLANK(M$10),\"  \",IF(ISBLANK(M$11),\" \",IF(ISBLANK(M21),\" \",ROUND((M21+M$12)/M$10*100,2))))","v":"  "}]
["2.30-3.15","FM",{"$f":"IF(ISBLANK(C10),\" \",IF(ISBLANK(C14),\" \",(600-SUM(D15:D20))/100))","v":" "},null,{"$f":"IF(ISBLANK(E10),\" \",IF(ISBLANK(E14),\" \",(600-SUM(F15:F20))/100))","v":" "},null,{"$f":"IF(ISBLANK(G10),\" \",IF(ISBLANK(G14),\" \",(600-SUM(H15:H20))/100))","v":" "},null,{"$f":"IF(ISBLANK(I10),\" \",IF(ISBLANK(I14),\" \",(600-SUM(J15:J20))/100))","v":" "},null,{"$f":"IF(ISBLANK(K10),\" \",IF(ISBLANK(K14),\" \",(600-SUM(L15:L20))/100))","v":" "},null,{"$f":"IF(ISBLANK(M10),\" \",IF(ISBLANK(M14),\" \",(600-SUM(N15:N20))/100))","v":" "}]
["Tested By"]
["Remarks"]
[]
[]
[]
["Sample No."]
["Date"]
["St. Wt. Before Wash",null,null,"% Loss",null,"% Loss",null,"% Loss",null,"% Loss",null,"% Loss",null,"% Loss"]
["Dry Wt. After Wash",null,null,{"$f":"IF(ISBLANK(C31),\" \",IF(ISBLANK(C34),\" \",(C31-C34)/C31*100))","v":" "},null,{"$f":"IF(ISBLANK(E31),\" \",IF(ISBLANK(E34),\" \",(E31-E34)/E31*100))","v":" "},null,{"$f":"IF(ISBLANK(G31),\" \",IF(ISBLANK(G34),\" \",(G31-G34)/G31*100))","v":" "},null,{"$f":"IF(ISBLANK(I31),\" \",IF(ISBLANK(I34),\" \",(I31-I34)/I31*100))","v":" "},null,{"$f":"IF(ISBLANK(K31),\" \",IF(ISBLANK(K34),\" \",(K31-K34)/K31*100))","v":" "},null,{"$f":"IF(ISBLANK(M31),\" \",IF(ISBLANK(M34),\" \",(M31-M34)/M31*100))","v":" "}]
["Wt. Loss",null,{"$f":"IF(ISBLANK(C30),\" \",IF(ISBLANK(C31),\" \",C30-C31))","v":" "},null,{"$f":"IF(ISBLANK(E30),\" \",IF(ISBLANK(E31),\" \",E30-E31))","v":" "},null,{"$f":"IF(ISBLANK(G30),\" \",IF(ISBLANK(G31),\" \",G30-G31))","v":" "},null,{"$f":"IF(ISBLANK(I30),\" \",IF(ISBLANK(I31),\" \",I30-I31))","v":" "},null,{"$f":"IF(ISBLANK(K30),\" \",IF(ISBLANK(K31),\" \",K30-K31))","v":" "},null,{"$f":"IF(ISBLANK(M30),\" \",IF(ISBLANK(M31),\" \",M30-M31))","v":" "}]
[null,null,"Wt","% Passing","Wt","% Passing","Wt","% Passing","Wt","% Passing","Wt","% Passing","Wt","% Passing"]
[100,0.375,null,{"$f":"IF(ISBLANK(C$30),\"  \",IF(ISBLANK(C$31),\" \",IF(ISBLANK(C34),\" \",ROUND((C34+C$32)/C$30*100,1))))","v":"  "},null,{"$f":"IF(ISBLANK(E$30),\"  \",IF(ISBLANK(E$31),\" \",IF(ISBLANK(E34),\" \",ROUND((E34+E$32)/E$30*100,1))))","v":"  "},null,{"$f":"IF(ISBLANK(G$30),\"  \",IF(ISBLANK(G$31),\" \",IF(ISBLANK(G34),\" \",ROUND((G34+G$32)/G$30*100,1))))","v":"  "},null,{"$f":"IF(ISBLANK(I$30),\"  \",IF(ISBLANK(I$31),\" \",IF(ISBLANK(I34),\" \",ROUND((I34+I$32)/I$30*100,1))))","v":"  "},null,{"$f":"IF(ISBLANK(K$30),\"  \",IF(ISBLANK(K$31),\" \",IF(ISBLANK(K34),\" \",ROUND((K34+K$32)/K$30*100,1))))","v":"  "},null,{"$f":"IF(ISBLANK(M$30),\"  \",IF(ISBLANK(M$31),\" \",IF(ISBLANK(M34),\" \",ROUND((M34+M$32)/M$30*100,1))))","v":"  "}]
["95-100",4,null,{"$f":"IF(ISBLANK(C$30),\"  \",IF(ISBLANK(C$31),\" \",IF(ISBLANK(C35),\" \",ROUND((C35+C$32)/C$30*100,0))))","v":"  "},null,{"$f":"IF(ISBLANK(E$30),\"  \",IF(ISBLANK(E$31),\" \",IF(ISBLANK(E35),\" \",ROUND((E35+E$32)/E$30*100,0))))","v":"  "},null,{"$f":"IF(ISBLANK(G$30),\"  \",IF(ISBLANK(G$31),\" \",IF(ISBLANK(G35),\" \",ROUND((G35+G$32)/G$30*100,0))))","v":"  "},null,{"$f":"IF(ISBLANK(I$30),\"  \",IF(ISBLANK(I$31),\" \",IF(ISBLANK(I35),\" \",ROUND((I35+I$32)/I$30*100,0))))","v":"  "},null,{"$f":"IF(ISBLANK(K$30),\"  \",IF(ISBLANK(K$31),\" \",IF(ISBLANK(K35),\" \",ROUND((K35+K$32)/K$30*100,0))))","v":"  "},null,{"$f":"IF(ISBLANK(M$30),\"  \",IF(ISBLANK(M$31),\" \",IF(ISBLANK(M35),\" \",ROUND((M35+M$32)/M$30*100,0))))","v":"  "}]
["70-100",8,null,"  ",null,"  ",null,"  ",null,"  ",null,"  ",null,"  "]
["45-85",16,null,"  ",null,"  ",null,"  ",null,"  ",null,"  ",null,"  "]
["25-65",30,null,"  ",null,"  ",null,"  ",null,"  ",null,"  ",null,"  "]
["10-30",50,null,"  ",null,"  ",null,"  ",null,"  ",null,"  ",null,"  "]
["0-10",100,null,"  ",null,"  ",null,"  ",null,"  ",null,"  ",null,"  "]
[3,200,null,{"$f":"IF(ISBLANK(C$30),\"  \",IF(ISBLANK(C$31),\" \",IF(ISBLANK(C41),\" \",ROUND((C41+C$32)/C$30*100,2))))","v":"  "},null,{"$f":"IF(ISBLANK(E$30),\"  \",IF(ISBLANK(E$31),\" \",IF(ISBLANK(E41),\" \",ROUND((E41+E$32)/E$30*100,2))))","v":"  "},null,{"$f":"IF(ISBLANK(G$30),\"  \",IF(ISBLANK(G$31),\" \",IF(ISBLANK(G41),\" \",ROUND((G41+G$32)/G$30*100,2))))","v":"  "},null,{"$f":"IF(ISBLANK(I$30),\"  \",IF(ISBLANK(I$31),\" \",IF(ISBLANK(I41),\" \",ROUND((I41+I$32)/I$30*100,2))))","v":"  "},null,{"$f":"IF(ISBLANK(K$30),\"  \",IF(ISBLANK(K$31),\" \",IF(ISBLANK(K41),\" \",ROUND((K41+K$32)/K$30*100,2))))","v":"  "},null,{"$f":"IF(ISBLANK(M$30),\"  \",IF(ISBLANK(M$31),\" \",IF(ISBLANK(M41),\" \",ROUND((M41+M$32)/M$30*100,2))))","v":"  "}]
["2.30-3.15","FM",{"$f":"IF(ISBLANK(C30),\" \",IF(ISBLANK(C34),\" \",(600-SUM(D35:D40))/100))","v":" "},null,{"$f":"IF(ISBLANK(E30),\" \",IF(ISBLANK(E34),\" \",(600-SUM(F35:F40))/100))","v":" "},null,{"$f":"IF(ISBLANK(G30),\" \",IF(ISBLANK(G34),\" \",(600-SUM(H35:H40))/100))","v":" "},null,{"$f":"IF(ISBLANK(I30),\" \",IF(ISBLANK(I34),\" \",(600-SUM(J35:J40))/100))","v":" "},null,{"$f":"IF(ISBLANK(K30),\" \",IF(ISBLANK(K34),\" \",(600-SUM(L35:L40))/100))","v":" "},null,{"$f":"IF(ISBLANK(M30),\" \",IF(ISBLANK(M34),\" \",(600-SUM(N35:N40))/100))","v":" "}]
["Tested By"]
["Remarks"]

{"sheet":"S5","index":4,"n_rows":44,"n_cols":14,"rows_kept":44,"cut":false,"hidden":true,"merged":[[43,0,45,1],[43,2,45,3],[43,4,45,5],[43,6,45,7],[43,8,45,9],[43,10,45,11],[43,12,45,13],[42,4,42,5],[42,6,42,7],[42,0,42,1],[42,2,42,3],[1,12,1,13],[2,10,2,11],[2,12,2,13],[3,10,3,11],[3,12,3,13],[42,8,42,9],[42,10,42,11],[22,12,22,13],[23,0,25,1],[23,2,25,3],[23,4,25,5],[23,6,25,7],[23,8,25,9],[23,10,25,11],[42,12,42,13],[7,12,7,13],[8,0,8,1],[8,2,8,3],[8,4,8,5],[8,6,8,7],[8,8,8,9],[8,10,8,11],[7,0,7,1],[4,12,4,13],[8,12,8,13],[5,3,5,8],[7,8,7,9],[5,10,5,11],[5,12,5,13],[7,2,7,3],[7,4,7,5],[7,6,7,7],[4,10,4,11],[31,0,31,1],[31,2,31,3],[41,2,41,3],[32,0,32,1],[22,10,22,11],[29,0,29,1],[28,0,28,1],[28,2,28,3],[27,0,27,1],[27,4,27,5],[27,6,27,7],[22,6,22,7],[22,8,22,9],[31,12,31,13],[41,12,41,13],[11,12,11,13],[28,8,28,9],[28,6,28,7],[27,2,27,3],[11,2,11,3],[11,4,11,5],[11,6,11,7],[21,2,21,3],[21,12,21,13],[28,12,28,13],[27,12,27,13],[23,12,25,13],[28,4,28,5],[22,2,22,3],[22,4,22,5],[21,8,21,9],[21,4,21,5],[21,6,21,7],[21,10,21,11],[11,8,11,9],[11,10,11,11],[28,10,28,11],[0,8,3,9],[1,2,1,7],[2,2,2,7],[3,2,3,7],[4,0,4,1],[41,8,41,9],[41,10,41,11],[27,10,27,11],[27,8,27,9],[31,8,31,9],[31,10,31,11],[10,0,10,1],[12,0,12,1],[22,0,22,1],[9,0,9,1],[7,10,7,11],[0,0,3,1],[1,10,1,11],[11,0,11,1],[31,4,31,5],[31,6,31,7],[41,4,41,5],[41,6,41,7],[30,0,30,1]]}
[]
[null,null,"COMMONWEALTH OF PENNSYLVANIA",null,null,null,null,null,null,null,"DISTRICT",null,{"$f":"IF(ISBLANK('S1'!M2),\" \",'S1'!M2)","v":" "}]
[null,null,"DEPARTMENT OF TRANSPORTATION",null,null,null,null,null,null,null,"PLANT CODE",null,{"$f":"IF(ISBLANK('S1'!M3),\" \",'S1'!M3)","v":" "}]
[null,null,"PENNSYLVANIA TURNPIKE COMMISSION",null,null,null,null,null,null,null,"AGG SIZE",null,{"$f":"IF(ISBLANK('S1'!M4),\" \",'S1'!M4)","v":"Type A"}]
[{"$f":"'S1'!A5","v":"Concrete 2023"},null,null,null,null,null,null,null,null,null,"FM TARGET VALUE",null,{"$f":"IF(ISBLANK('S1'!M5),\" \",'S1'!M5)","v":" "}]
[null,null,null,"Material Test Results for Type A Fine Aggregate"]
[]
["Sample No."]
["Date"]
["St. Wt. Before Wash",null,null,"% Loss",null,"% Loss",null,"% Loss",null,"% Loss",null,"% Loss",null,"% Loss"]
["Dry Wt. After Wash",null,null,{"$f":"IF(ISBLANK(C11),\" \",IF(ISBLANK(C14),\" \",(C11-C14)/C11*100))","v":" "},null,{"$f":"IF(ISBLANK(E11),\" \",IF(ISBLANK(E14),\" \",(E11-E14)/E11*100))","v":" "},null,{"$f":"IF(ISBLANK(G11),\" \",IF(ISBLANK(G14),\" \",(G11-G14)/G11*100))","v":" "},null,{"$f":"IF(ISBLANK(I11),\" \",IF(ISBLANK(I14),\" \",(I11-I14)/I11*100))","v":" "},null,{"$f":"IF(ISBLANK(K11),\" \",IF(ISBLANK(K14),\" \",(K11-K14)/K11*100))","v":" "},null,{"$f":"IF(ISBLANK(M11),\" \",IF(ISBLANK(M14),\" \",(M11-M14)/M11*100))","v":" "}]
["Wt. Loss",null,{"$f":"IF(ISBLANK(C10),\" \",IF(ISBLANK(C11),\" \",C10-C11))","v":" "},null,{"$f":"IF(ISBLANK(E10),\" \",IF(ISBLANK(E11),\" \",E10-E11))","v":" "},null,{"$f":"IF(ISBLANK(G10),\" \",IF(ISBLANK(G11),\" \",G10-G11))","v":" "},null,{"$f":"IF(ISBLANK(I10),\" \",IF(ISBLANK(I11),\" \",I10-I11))","v":" "},null,{"$f":"IF(ISBLANK(K10),\" \",IF(ISBLANK(K11),\" \",K10-K11))","v":" "},null,{"$f":"IF(ISBLANK(M10),\" \",IF(ISBLANK(M11),\" \",M10-M11))","v":" "}]
[null,null,"Wt","% Passing","Wt","% Passing","Wt","% Passing","Wt","% Passing","Wt","% Passing","Wt","% Passing"]
[100,0.375,null,{"$f":"IF(ISBLANK(C$10),\"  \",IF(ISBLANK(C$11),\" \",IF(ISBLANK(C14),\" \",ROUND((C14+C$12)/C$10*100,1))))","v":"  "},null,{"$f":"IF(ISBLANK(E$10),\"  \",IF(ISBLANK(E$11),\" \",IF(ISBLANK(E14),\" \",ROUND((E14+E$12)/E$10*100,1))))","v":"  "},null,{"$f":"IF(ISBLANK(G$10),\"  \",IF(ISBLANK(G$11),\" \",IF(ISBLANK(G14),\" \",ROUND((G14+G$12)/G$10*100,1))))","v":"  "},null,{"$f":"IF(ISBLANK(I$10),\"  \",IF(ISBLANK(I$11),\" \",IF(ISBLANK(I14),\" \",ROUND((I14+I$12)/I$10*100,1))))","v":"  "},null,{"$f":"IF(ISBLANK(K$10),\"  \",IF(ISBLANK(K$11),\" \",IF(ISBLANK(K14),\" \",ROUND((K14+K$12)/K$10*100,1))))","v":"  "},null,{"$f":"IF(ISBLANK(M$10),\"  \",IF(ISBLANK(M$11),\" \",IF(ISBLANK(M14),\" \",ROUND((M14+M$12)/M$10*100,1))))","v":"  "}]
["95-100",4,null,{"$f":"IF(ISBLANK(C$10),\"  \",IF(ISBLANK(C$11),\" \",IF(ISBLANK(C15),\" \",ROUND((C15+C$12)/C$10*100,0))))","v":"  "},null,{"$f":"IF(ISBLANK(E$10),\"  \",IF(ISBLANK(E$11),\" \",IF(ISBLANK(E15),\" \",ROUND((E15+E$12)/E$10*100,0))))","v":"  "},null,{"$f":"IF(ISBLANK(G$10),\"  \",IF(ISBLANK(G$11),\" \",IF(ISBLANK(G15),\" \",ROUND((G15+G$12)/G$10*100,0))))","v":"  "},null,{"$f":"IF(ISBLANK(I$10),\"  \",IF(ISBLANK(I$11),\" \",IF(ISBLANK(I15),\" \",ROUND((I15+I$12)/I$10*100,0))))","v":"  "},null,{"$f":"IF(ISBLANK(K$10),\"  \",IF(ISBLANK(K$11),\" \",IF(ISBLANK(K15),\" \",ROUND((K15+K$12)/K$10*100,0))))","v":"  "},null,{"$f":"IF(ISBLANK(M$10),\"  \",IF(ISBLANK(M$11),\" \",IF(ISBLANK(M15),\" \",ROUND((M15+M$12)/M$10*100,0))))","v":"  "}]
["70-100",8,null,"  ",null,"  ",null,"  ",null,"  ",null,"  ",null,"  "]
["45-85",16,null,"  ",null,"  ",null,"  ",null,"  ",null,"  ",null,"  "]
["25-65",30,null,"  ",null,"  ",null,"  ",null,"  ",null,"  ",null,"  "]
["10-30",50,null,"  ",null,"  ",null,"  ",null,"  ",null,"  ",null,"  "]
["0-10",100,null,"  ",null,"  ",null,"  ",null,"  ",null,"  ",null,"  "]
[3,200,null,{"$f":"IF(ISBLANK(C$10),\"  \",IF(ISBLANK(C$11),\" \",IF(ISBLANK(C21),\" \",ROUND((C21+C$12)/C$10*100,2))))","v":"  "},null,{"$f":"IF(ISBLANK(E$10),\"  \",IF(ISBLANK(E$11),\" \",IF(ISBLANK(E21),\" \",ROUND((E21+E$12)/E$10*100,2))))","v":"  "},null,{"$f":"IF(ISBLANK(G$10),\"  \",IF(ISBLANK(G$11),\" \",IF(ISBLANK(G21),\" \",ROUND((G21+G$12)/G$10*100,2))))","v":"  "},null,{"$f":"IF(ISBLANK(I$10),\"  \",IF(ISBLANK(I$11),\" \",IF(ISBLANK(I21),\" \",ROUND((I21+I$12)/I$10*100,2))))","v":"  "},null,{"$f":"IF(ISBLANK(K$10),\"  \",IF(ISBLANK(K$11),\" \",IF(ISBLANK(K21),\" \",ROUND((K21+K$12)/K$10*100,2))))","v":"  "},null,{"$f":"IF(ISBLANK(M$10),\"  \",IF(ISBLANK(M$11),\" \",IF(ISBLANK(M21),\" \",ROUND((M21+M$12)/M$10*100,2))))","v":"  "}]
["2.30-3.15","FM",{"$f":"IF(ISBLANK(C10),\" \",IF(ISBLANK(C14),\" \",(600-SUM(D15:D20))/100))","v":" "},null,{"$f":"IF(ISBLANK(E10),\" \",IF(ISBLANK(E14),\" \",(600-SUM(F15:F20))/100))","v":" "},null,{"$f":"IF(ISBLANK(G10),\" \",IF(ISBLANK(G14),\" \",(600-SUM(H15:H20))/100))","v":" "},null,{"$f":"IF(ISBLANK(I10),\" \",IF(ISBLANK(I14),\" \",(600-SUM(J15:J20))/100))","v":" "},null,{"$f":"IF(ISBLANK(K10),\" \",IF(ISBLANK(K14),\" \",(600-SUM(L15:L20))/100))","v":" "},null,{"$f":"IF(ISBLANK(M10),\" \",IF(ISBLANK(M14),\" \",(600-SUM(N15:N20))/100))","v":" "}]
["Tested By"]
["Remarks"]
[]
[]
[]
["Sample No."]
["Date"]
["St. Wt. Before Wash",null,null,"% Loss",null,"% Loss",null,"% Loss",null,"% Loss",null,"% Loss",null,"% Loss"]
["Dry Wt. After Wash",null,null,{"$f":"IF(ISBLANK(C31),\" \",IF(ISBLANK(C34),\" \",(C31-C34)/C31*100))","v":" "},null,{"$f":"IF(ISBLANK(E31),\" \",IF(ISBLANK(E34),\" \",(E31-E34)/E31*100))","v":" "},null,{"$f":"IF(ISBLANK(G31),\" \",IF(ISBLANK(G34),\" \",(G31-G34)/G31*100))","v":" "},null,{"$f":"IF(ISBLANK(I31),\" \",IF(ISBLANK(I34),\" \",(I31-I34)/I31*100))","v":" "},null,{"$f":"IF(ISBLANK(K31),\" \",IF(ISBLANK(K34),\" \",(K31-K34)/K31*100))","v":" "},null,{"$f":"IF(ISBLANK(M31),\" \",IF(ISBLANK(M34),\" \",(M31-M34)/M31*100))","v":" "}]
["Wt. Loss",null,{"$f":"IF(ISBLANK(C30),\" \",IF(ISBLANK(C31),\" \",C30-C31))","v":" "},null,{"$f":"IF(ISBLANK(E30),\" \",IF(ISBLANK(E31),\" \",E30-E31))","v":" "},null,{"$f":"IF(ISBLANK(G30),\" \",IF(ISBLANK(G31),\" \",G30-G31))","v":" "},null,{"$f":"IF(ISBLANK(I30),\" \",IF(ISBLANK(I31),\" \",I30-I31))","v":" "},null,{"$f":"IF(ISBLANK(K30),\" \",IF(ISBLANK(K31),\" \",K30-K31))","v":" "},null,{"$f":"IF(ISBLANK(M30),\" \",IF(ISBLANK(M31),\" \",M30-M31))","v":" "}]
[null,null,"Wt","% Passing","Wt","% Passing","Wt","% Passing","Wt","% Passing","Wt","% Passing","Wt","% Passing"]
[100,0.375,null,{"$f":"IF(ISBLANK(C$30),\"  \",IF(ISBLANK(C$31),\" \",IF(ISBLANK(C34),\" \",ROUND((C34+C$32)/C$30*100,1))))","v":"  "},null,{"$f":"IF(ISBLANK(E$30),\"  \",IF(ISBLANK(E$31),\" \",IF(ISBLANK(E34),\" \",ROUND((E34+E$32)/E$30*100,1))))","v":"  "},null,{"$f":"IF(ISBLANK(G$30),\"  \",IF(ISBLANK(G$31),\" \",IF(ISBLANK(G34),\" \",ROUND((G34+G$32)/G$30*100,1))))","v":"  "},null,{"$f":"IF(ISBLANK(I$30),\"  \",IF(ISBLANK(I$31),\" \",IF(ISBLANK(I34),\" \",ROUND((I34+I$32)/I$30*100,1))))","v":"  "},null,{"$f":"IF(ISBLANK(K$30),\"  \",IF(ISBLANK(K$31),\" \",IF(ISBLANK(K34),\" \",ROUND((K34+K$32)/K$30*100,1))))","v":"  "},null,{"$f":"IF(ISBLANK(M$30),\"  \",IF(ISBLANK(M$31),\" \",IF(ISBLANK(M34),\" \",ROUND((M34+M$32)/M$30*100,1))))","v":"  "}]
["95-100",4,null,{"$f":"IF(ISBLANK(C$30),\"  \",IF(ISBLANK(C$31),\" \",IF(ISBLANK(C35),\" \",ROUND((C35+C$32)/C$30*100,0))))","v":"  "},null,{"$f":"IF(ISBLANK(E$30),\"  \",IF(ISBLANK(E$31),\" \",IF(ISBLANK(E35),\" \",ROUND((E35+E$32)/E$30*100,0))))","v":"  "},null,{"$f":"IF(ISBLANK(G$30),\"  \",IF(ISBLANK(G$31),\" \",IF(ISBLANK(G35),\" \",ROUND((G35+G$32)/G$30*100,0))))","v":"  "},null,{"$f":"IF(ISBLANK(I$30),\"  \",IF(ISBLANK(I$31),\" \",IF(ISBLANK(I35),\" \",ROUND((I35+I$32)/I$30*100,0))))","v":"  "},null,{"$f":"IF(ISBLANK(K$30),\"  \",IF(ISBLANK(K$31),\" \",IF(ISBLANK(K35),\" \",ROUND((K35+K$32)/K$30*100,0))))","v":"  "},null,{"$f":"IF(ISBLANK(M$30),\"  \",IF(ISBLANK(M$31),\" \",IF(ISBLANK(M35),\" \",ROUND((M35+M$32)/M$30*100,0))))","v":"  "}]
["70-100",8,null,"  ",null,"  ",null,"  ",null,"  ",null,"  ",null,"  "]
["45-85",16,null,"  ",null,"  ",null,"  ",null,"  ",null,"  ",null,"  "]
["25-65",30,null,"  ",null,"  ",null,"  ",null,"  ",null,"  ",null,"  "]
["10-30",50,null,"  ",null,"  ",null,"  ",null,"  ",null,"  ",null,"  "]
["0-10",100,null,"  ",null,"  ",null,"  ",null,"  ",null,"  ",null,"  "]
[3,200,null,{"$f":"IF(ISBLANK(C$30),\"  \",IF(ISBLANK(C$31),\" \",IF(ISBLANK(C41),\" \",ROUND((C41+C$32)/C$30*100,2))))","v":"  "},null,{"$f":"IF(ISBLANK(E$30),\"  \",IF(ISBLANK(E$31),\" \",IF(ISBLANK(E41),\" \",ROUND((E41+E$32)/E$30*100,2))))","v":"  "},null,{"$f":"IF(ISBLANK(G$30),\"  \",IF(ISBLANK(G$31),\" \",IF(ISBLANK(G41),\" \",ROUND((G41+G$32)/G$30*100,2))))","v":"  "},null,{"$f":"IF(ISBLANK(I$30),\"  \",IF(ISBLANK(I$31),\" \",IF(ISBLANK(I41),\" \",ROUND((I41+I$32)/I$30*100,2))))","v":"  "},null,{"$f":"IF(ISBLANK(K$30),\"  \",IF(ISBLANK(K$31),\" \",IF(ISBLANK(K41),\" \",ROUND((K41+K$32)/K$30*100,2))))","v":"  "},null,{"$f":"IF(ISBLANK(M$30),\"  \",IF(ISBLANK(M$31),\" \",IF(ISBLANK(M41),\" \",ROUND((M41+M$32)/M$30*100,2))))","v":"  "}]
["2.30-3.15","FM",{"$f":"IF(ISBLANK(C30),\" \",IF(ISBLANK(C34),\" \",(600-SUM(D35:D40))/100))","v":" "},null,{"$f":"IF(ISBLANK(E30),\" \",IF(ISBLANK(E34),\" \",(600-SUM(F35:F40))/100))","v":" "},null,{"$f":"IF(ISBLANK(G30),\" \",IF(ISBLANK(G34),\" \",(600-SUM(H35:H40))/100))","v":" "},null,{"$f":"IF(ISBLANK(I30),\" \",IF(ISBLANK(I34),\" \",(600-SUM(J35:J40))/100))","v":" "},null,{"$f":"IF(ISBLANK(K30),\" \",IF(ISBLANK(K34),\" \",(600-SUM(L35:L40))/100))","v":" "},null,{"$f":"IF(ISBLANK(M30),\" \",IF(ISBLANK(M34),\" \",(600-SUM(N35:N40))/100))","v":" "}]
["Tested By"]
["Remarks"]

{"sheet":"S6","index":5,"n_rows":44,"n_cols":14,"rows_kept":44,"cut":false,"hidden":true,"merged":[[43,0,45,1],[43,2,45,3],[43,4,45,5],[43,6,45,7],[43,8,45,9],[43,10,45,11],[43,12,45,13],[42,4,42,5],[42,6,42,7],[42,0,42,1],[42,2,42,3],[1,12,1,13],[2,10,2,11],[2,12,2,13],[3,10,3,11],[3,12,3,13],[42,8,42,9],[42,10,42,11],[22,12,22,13],[23,0,25,1],[23,2,25,3],[23,4,25,5],[23,6,25,7],[23,8,25,9],[23,10,25,11],[42,12,42,13],[7,12,7,13],[8,0,8,1],[8,2,8,3],[8,4,8,5],[8,6,8,7],[8,8,8,9],[8,10,8,11],[7,0,7,1],[4,12,4,13],[8,12,8,13],[5,3,5,8],[7,8,7,9],[5,10,5,11],[5,12,5,13],[7,2,7,3],[7,4,7,5],[7,6,7,7],[4,10,4,11],[31,0,31,1],[31,2,31,3],[41,2,41,3],[32,0,32,1],[22,10,22,11],[29,0,29,1],[28,0,28,1],[28,2,28,3],[27,0,27,1],[27,4,27,5],[27,6,27,7],[22,6,22,7],[22,8,22,9],[31,12,31,13],[41,12,41,13],[11,12,11,13],[28,8,28,9],[28,6,28,7],[27,2,27,3],[11,2,11,3],[11,4,11,5],[11,6,11,7],[21,2,21,3],[21,12,21,13],[28,12,28,13],[27,12,27,13],[23,12,25,13],[28,4,28,5],[22,2,22,3],[22,4,22,5],[21,8,21,9],[21,4,21,5],[21,6,21,7],[21,10,21,11],[11,8,11,9],[11,10,11,11],[28,10,28,11],[0,8,3,9],[1,2,1,7],[2,2,2,7],[3,2,3,7],[4,0,4,1],[41,8,41,9],[41,10,41,11],[27,10,27,11],[27,8,27,9],[31,8,31,9],[31,10,31,11],[10,0,10,1],[12,0,12,1],[22,0,22,1],[9,0,9,1],[7,10,7,11],[0,0,3,1],[1,10,1,11],[11,0,11,1],[31,4,31,5],[31,6,31,7],[41,4,41,5],[41,6,41,7],[30,0,30,1]]}
[]
[null,null,"COMMONWEALTH OF PENNSYLVANIA",null,null,null,null,null,null,null,"DISTRICT",null,{"$f":"IF(ISBLANK('S1'!M2),\" \",'S1'!M2)","v":" "}]
[null,null,"DEPARTMENT OF TRANSPORTATION",null,null,null,null,null,null,null,"PLANT CODE",null,{"$f":"IF(ISBLANK('S1'!M3),\" \",'S1'!M3)","v":" "}]
[null,null,"PENNSYLVANIA TURNPIKE COMMISSION",null,null,null,null,null,null,null,"AGG SIZE",null,{"$f":"IF(ISBLANK('S1'!M4),\" \",'S1'!M4)","v":"Type A"}]
[{"$f":"'S1'!A5","v":"Concrete 2023"},null,null,null,null,null,null,null,null,null,"FM TARGET VALUE",null,{"$f":"IF(ISBLANK('S1'!M5),\" \",'S1'!M5)","v":" "}]
[null,null,null,"Material Test Results for Type A Fine Aggregate"]
[]
["Sample No."]
["Date"]
["St. Wt. Before Wash",null,null,"% Loss",null,"% Loss",null,"% Loss",null,"% Loss",null,"% Loss",null,"% Loss"]
["Dry Wt. After Wash",null,null,{"$f":"IF(ISBLANK(C11),\" \",IF(ISBLANK(C14),\" \",(C11-C14)/C11*100))","v":" "},null,{"$f":"IF(ISBLANK(E11),\" \",IF(ISBLANK(E14),\" \",(E11-E14)/E11*100))","v":" "},null,{"$f":"IF(ISBLANK(G11),\" \",IF(ISBLANK(G14),\" \",(G11-G14)/G11*100))","v":" "},null,{"$f":"IF(ISBLANK(I11),\" \",IF(ISBLANK(I14),\" \",(I11-I14)/I11*100))","v":" "},null,{"$f":"IF(ISBLANK(K11),\" \",IF(ISBLANK(K14),\" \",(K11-K14)/K11*100))","v":" "},null,{"$f":"IF(ISBLANK(M11),\" \",IF(ISBLANK(M14),\" \",(M11-M14)/M11*100))","v":" "}]
["Wt. Loss",null,{"$f":"IF(ISBLANK(C10),\" \",IF(ISBLANK(C11),\" \",C10-C11))","v":" "},null,{"$f":"IF(ISBLANK(E10),\" \",IF(ISBLANK(E11),\" \",E10-E11))","v":" "},null,{"$f":"IF(ISBLANK(G10),\" \",IF(ISBLANK(G11),\" \",G10-G11))","v":" "},null,{"$f":"IF(ISBLANK(I10),\" \",IF(ISBLANK(I11),\" \",I10-I11))","v":" "},null,{"$f":"IF(ISBLANK(K10),\" \",IF(ISBLANK(K11),\" \",K10-K11))","v":" "},null,{"$f":"IF(ISBLANK(M10),\" \",IF(ISBLANK(M11),\" \",M10-M11))","v":" "}]
[null,null,"Wt","% Passing","Wt","% Passing","Wt","% Passing","Wt","% Passing","Wt","% Passing","Wt","% Passing"]
[100,0.375,null,{"$f":"IF(ISBLANK(C$10),\"  \",IF(ISBLANK(C$11),\" \",IF(ISBLANK(C14),\" \",ROUND((C14+C$12)/C$10*100,1))))","v":"  "},null,{"$f":"IF(ISBLANK(E$10),\"  \",IF(ISBLANK(E$11),\" \",IF(ISBLANK(E14),\" \",ROUND((E14+E$12)/E$10*100,1))))","v":"  "},null,{"$f":"IF(ISBLANK(G$10),\"  \",IF(ISBLANK(G$11),\" \",IF(ISBLANK(G14),\" \",ROUND((G14+G$12)/G$10*100,1))))","v":"  "},null,{"$f":"IF(ISBLANK(I$10),\"  \",IF(ISBLANK(I$11),\" \",IF(ISBLANK(I14),\" \",ROUND((I14+I$12)/I$10*100,1))))","v":"  "},null,{"$f":"IF(ISBLANK(K$10),\"  \",IF(ISBLANK(K$11),\" \",IF(ISBLANK(K14),\" \",ROUND((K14+K$12)/K$10*100,1))))","v":"  "},null,{"$f":"IF(ISBLANK(M$10),\"  \",IF(ISBLANK(M$11),\" \",IF(ISBLANK(M14),\" \",ROUND((M14+M$12)/M$10*100,1))))","v":"  "}]
["95-100",4,null,{"$f":"IF(ISBLANK(C$10),\"  \",IF(ISBLANK(C$11),\" \",IF(ISBLANK(C15),\" \",ROUND((C15+C$12)/C$10*100,0))))","v":"  "},null,{"$f":"IF(ISBLANK(E$10),\"  \",IF(ISBLANK(E$11),\" \",IF(ISBLANK(E15),\" \",ROUND((E15+E$12)/E$10*100,0))))","v":"  "},null,{"$f":"IF(ISBLANK(G$10),\"  \",IF(ISBLANK(G$11),\" \",IF(ISBLANK(G15),\" \",ROUND((G15+G$12)/G$10*100,0))))","v":"  "},null,{"$f":"IF(ISBLANK(I$10),\"  \",IF(ISBLANK(I$11),\" \",IF(ISBLANK(I15),\" \",ROUND((I15+I$12)/I$10*100,0))))","v":"  "},null,{"$f":"IF(ISBLANK(K$10),\"  \",IF(ISBLANK(K$11),\" \",IF(ISBLANK(K15),\" \",ROUND((K15+K$12)/K$10*100,0))))","v":"  "},null,{"$f":"IF(ISBLANK(M$10),\"  \",IF(ISBLANK(M$11),\" \",IF(ISBLANK(M15),\" \",ROUND((M15+M$12)/M$10*100,0))))","v":"  "}]
["70-100",8,null,"  ",null,"  ",null,"  ",null,"  ",null,"  ",null,"  "]
["45-85",16,null,"  ",null,"  ",null,"  ",null,"  ",null,"  ",null,"  "]
["25-65",30,null,"  ",null,"  ",null,"  ",null,"  ",null,"  ",null,"  "]
["10-30",50,null,"  ",null,"  ",null,"  ",null,"  ",null,"  ",null,"  "]
["0-10",100,null,"  ",null,"  ",null,"  ",null,"  ",null,"  ",null,"  "]
[3,200,null,{"$f":"IF(ISBLANK(C$10),\"  \",IF(ISBLANK(C$11),\" \",IF(ISBLANK(C21),\" \",ROUND((C21+C$12)/C$10*100,2))))","v":"  "},null,{"$f":"IF(ISBLANK(E$10),\"  \",IF(ISBLANK(E$11),\" \",IF(ISBLANK(E21),\" \",ROUND((E21+E$12)/E$10*100,2))))","v":"  "},null,{"$f":"IF(ISBLANK(G$10),\"  \",IF(ISBLANK(G$11),\" \",IF(ISBLANK(G21),\" \",ROUND((G21+G$12)/G$10*100,2))))","v":"  "},null,{"$f":"IF(ISBLANK(I$10),\"  \",IF(ISBLANK(I$11),\" \",IF(ISBLANK(I21),\" \",ROUND((I21+I$12)/I$10*100,2))))","v":"  "},null,{"$f":"IF(ISBLANK(K$10),\"  \",IF(ISBLANK(K$11),\" \",IF(ISBLANK(K21),\" \",ROUND((K21+K$12)/K$10*100,2))))","v":"  "},null,{"$f":"IF(ISBLANK(M$10),\"  \",IF(ISBLANK(M$11),\" \",IF(ISBLANK(M21),\" \",ROUND((M21+M$12)/M$10*100,2))))","v":"  "}]
["2.30-3.15","FM",{"$f":"IF(ISBLANK(C10),\" \",IF(ISBLANK(C14),\" \",(600-SUM(D15:D20))/100))","v":" "},null,{"$f":"IF(ISBLANK(E10),\" \",IF(ISBLANK(E14),\" \",(600-SUM(F15:F20))/100))","v":" "},null,{"$f":"IF(ISBLANK(G10),\" \",IF(ISBLANK(G14),\" \",(600-SUM(H15:H20))/100))","v":" "},null,{"$f":"IF(ISBLANK(I10),\" \",IF(ISBLANK(I14),\" \",(600-SUM(J15:J20))/100))","v":" "},null,{"$f":"IF(ISBLANK(K10),\" \",IF(ISBLANK(K14),\" \",(600-SUM(L15:L20))/100))","v":" "},null,{"$f":"IF(ISBLANK(M10),\" \",IF(ISBLANK(M14),\" \",(600-SUM(N15:N20))/100))","v":" "}]
["Tested By"]
["Remarks"]
[]
[]
[]
["Sample No."]
["Date"]
["St. Wt. Before Wash",null,null,"% Loss",null,"% Loss",null,"% Loss",null,"% Loss",null,"% Loss",null,"% Loss"]
["Dry Wt. After Wash",null,null,{"$f":"IF(ISBLANK(C31),\" \",IF(ISBLANK(C34),\" \",(C31-C34)/C31*100))","v":" "},null,{"$f":"IF(ISBLANK(E31),\" \",IF(ISBLANK(E34),\" \",(E31-E34)/E31*100))","v":" "},null,{"$f":"IF(ISBLANK(G31),\" \",IF(ISBLANK(G34),\" \",(G31-G34)/G31*100))","v":" "},null,{"$f":"IF(ISBLANK(I31),\" \",IF(ISBLANK(I34),\" \",(I31-I34)/I31*100))","v":" "},null,{"$f":"IF(ISBLANK(K31),\" \",IF(ISBLANK(K34),\" \",(K31-K34)/K31*100))","v":" "},null,{"$f":"IF(ISBLANK(M31),\" \",IF(ISBLANK(M34),\" \",(M31-M34)/M31*100))","v":" "}]
["Wt. Loss",null,{"$f":"IF(ISBLANK(C30),\" \",IF(ISBLANK(C31),\" \",C30-C31))","v":" "},null,{"$f":"IF(ISBLANK(E30),\" \",IF(ISBLANK(E31),\" \",E30-E31))","v":" "},null,{"$f":"IF(ISBLANK(G30),\" \",IF(ISBLANK(G31),\" \",G30-G31))","v":" "},null,{"$f":"IF(ISBLANK(I30),\" \",IF(ISBLANK(I31),\" \",I30-I31))","v":" "},null,{"$f":"IF(ISBLANK(K30),\" \",IF(ISBLANK(K31),\" \",K30-K31))","v":" "},null,{"$f":"IF(ISBLANK(M30),\" \",IF(ISBLANK(M31),\" \",M30-M31))","v":" "}]
[null,null,"Wt","% Passing","Wt","% Passing","Wt","% Passing","Wt","% Passing","Wt","% Passing","Wt","% Passing"]
[100,0.375,null,{"$f":"IF(ISBLANK(C$30),\"  \",IF(ISBLANK(C$31),\" \",IF(ISBLANK(C34),\" \",ROUND((C34+C$32)/C$30*100,1))))","v":"  "},null,{"$f":"IF(ISBLANK(E$30),\"  \",IF(ISBLANK(E$31),\" \",IF(ISBLANK(E34),\" \",ROUND((E34+E$32)/E$30*100,1))))","v":"  "},null,{"$f":"IF(ISBLANK(G$30),\"  \",IF(ISBLANK(G$31),\" \",IF(ISBLANK(G34),\" \",ROUND((G34+G$32)/G$30*100,1))))","v":"  "},null,{"$f":"IF(ISBLANK(I$30),\"  \",IF(ISBLANK(I$31),\" \",IF(ISBLANK(I34),\" \",ROUND((I34+I$32)/I$30*100,1))))","v":"  "},null,{"$f":"IF(ISBLANK(K$30),\"  \",IF(ISBLANK(K$31),\" \",IF(ISBLANK(K34),\" \",ROUND((K34+K$32)/K$30*100,1))))","v":"  "},null,{"$f":"IF(ISBLANK(M$30),\"  \",IF(ISBLANK(M$31),\" \",IF(ISBLANK(M34),\" \",ROUND((M34+M$32)/M$30*100,1))))","v":"  "}]
["95-100",4,null,{"$f":"IF(ISBLANK(C$30),\"  \",IF(ISBLANK(C$31),\" \",IF(ISBLANK(C35),\" \",ROUND((C35+C$32)/C$30*100,0))))","v":"  "},null,{"$f":"IF(ISBLANK(E$30),\"  \",IF(ISBLANK(E$31),\" \",IF(ISBLANK(E35),\" \",ROUND((E35+E$32)/E$30*100,0))))","v":"  "},null,{"$f":"IF(ISBLANK(G$30),\"  \",IF(ISBLANK(G$31),\" \",IF(ISBLANK(G35),\" \",ROUND((G35+G$32)/G$30*100,0))))","v":"  "},null,{"$f":"IF(ISBLANK(I$30),\"  \",IF(ISBLANK(I$31),\" \",IF(ISBLANK(I35),\" \",ROUND((I35+I$32)/I$30*100,0))))","v":"  "},null,{"$f":"IF(ISBLANK(K$30),\"  \",IF(ISBLANK(K$31),\" \",IF(ISBLANK(K35),\" \",ROUND((K35+K$32)/K$30*100,0))))","v":"  "},null,{"$f":"IF(ISBLANK(M$30),\"  \",IF(ISBLANK(M$31),\" \",IF(ISBLANK(M35),\" \",ROUND((M35+M$32)/M$30*100,0))))","v":"  "}]
["70-100",8,null,"  ",null,"  ",null,"  ",null,"  ",null,"  ",null,"  "]
["45-85",16,null,"  ",null,"  ",null,"  ",null,"  ",null,"  ",null,"  "]
["25-65",30,null,"  ",null,"  ",null,"  ",null,"  ",null,"  ",null,"  "]
["10-30",50,null,"  ",null,"  ",null,"  ",null,"  ",null,"  ",null,"  "]
["0-10",100,null,"  ",null,"  ",null,"  ",null,"  ",null,"  ",null,"  "]
[3,200,null,{"$f":"IF(ISBLANK(C$30),\"  \",IF(ISBLANK(C$31),\" \",IF(ISBLANK(C41),\" \",ROUND((C41+C$32)/C$30*100,2))))","v":"  "},null,{"$f":"IF(ISBLANK(E$30),\"  \",IF(ISBLANK(E$31),\" \",IF(ISBLANK(E41),\" \",ROUND((E41+E$32)/E$30*100,2))))","v":"  "},null,{"$f":"IF(ISBLANK(G$30),\"  \",IF(ISBLANK(G$31),\" \",IF(ISBLANK(G41),\" \",ROUND((G41+G$32)/G$30*100,2))))","v":"  "},null,{"$f":"IF(ISBLANK(I$30),\"  \",IF(ISBLANK(I$31),\" \",IF(ISBLANK(I41),\" \",ROUND((I41+I$32)/I$30*100,2))))","v":"  "},null,{"$f":"IF(ISBLANK(K$30),\"  \",IF(ISBLANK(K$31),\" \",IF(ISBLANK(K41),\" \",ROUND((K41+K$32)/K$30*100,2))))","v":"  "},null,{"$f":"IF(ISBLANK(M$30),\"  \",IF(ISBLANK(M$31),\" \",IF(ISBLANK(M41),\" \",ROUND((M41+M$32)/M$30*100,2))))","v":"  "}]
["2.30-3.15","FM",{"$f":"IF(ISBLANK(C30),\" \",IF(ISBLANK(C34),\" \",(600-SUM(D35:D40))/100))","v":" "},null,{"$f":"IF(ISBLANK(E30),\" \",IF(ISBLANK(E34),\" \",(600-SUM(F35:F40))/100))","v":" "},null,{"$f":"IF(ISBLANK(G30),\" \",IF(ISBLANK(G34),\" \",(600-SUM(H35:H40))/100))","v":" "},null,{"$f":"IF(ISBLANK(I30),\" \",IF(ISBLANK(I34),\" \",(600-SUM(J35:J40))/100))","v":" "},null,{"$f":"IF(ISBLANK(K30),\" \",IF(ISBLANK(K34),\" \",(600-SUM(L35:L40))/100))","v":" "},null,{"$f":"IF(ISBLANK(M30),\" \",IF(ISBLANK(M34),\" \",(600-SUM(N35:N40))/100))","v":" "}]
["Tested By"]
["Remarks"]

{"sheet":"S7","index":6,"n_rows":44,"n_cols":14,"rows_kept":44,"cut":false,"hidden":true,"merged":[[43,0,45,1],[43,2,45,3],[43,4,45,5],[43,6,45,7],[43,8,45,9],[43,10,45,11],[43,12,45,13],[42,4,42,5],[42,6,42,7],[42,0,42,1],[42,2,42,3],[1,12,1,13],[2,10,2,11],[2,12,2,13],[3,10,3,11],[3,12,3,13],[42,8,42,9],[42,10,42,11],[22,12,22,13],[23,0,25,1],[23,2,25,3],[23,4,25,5],[23,6,25,7],[23,8,25,9],[23,10,25,11],[42,12,42,13],[7,12,7,13],[8,0,8,1],[8,2,8,3],[8,4,8,5],[8,6,8,7],[8,8,8,9],[8,10,8,11],[7,0,7,1],[4,12,4,13],[8,12,8,13],[5,3,5,8],[7,8,7,9],[5,10,5,11],[5,12,5,13],[7,2,7,3],[7,4,7,5],[7,6,7,7],[4,10,4,11],[31,0,31,1],[31,2,31,3],[41,2,41,3],[32,0,32,1],[22,10,22,11],[29,0,29,1],[28,0,28,1],[28,2,28,3],[27,0,27,1],[27,4,27,5],[27,6,27,7],[22,6,22,7],[22,8,22,9],[31,12,31,13],[41,12,41,13],[11,12,11,13],[28,8,28,9],[28,6,28,7],[27,2,27,3],[11,2,11,3],[11,4,11,5],[11,6,11,7],[21,2,21,3],[21,12,21,13],[28,12,28,13],[27,12,27,13],[23,12,25,13],[28,4,28,5],[22,2,22,3],[22,4,22,5],[21,8,21,9],[21,4,21,5],[21,6,21,7],[21,10,21,11],[11,8,11,9],[11,10,11,11],[28,10,28,11],[0,8,3,9],[1,2,1,7],[2,2,2,7],[3,2,3,7],[4,0,4,1],[41,8,41,9],[41,10,41,11],[27,10,27,11],[27,8,27,9],[31,8,31,9],[31,10,31,11],[10,0,10,1],[12,0,12,1],[22,0,22,1],[9,0,9,1],[7,10,7,11],[0,0,3,1],[1,10,1,11],[11,0,11,1],[31,4,31,5],[31,6,31,7],[41,4,41,5],[41,6,41,7],[30,0,30,1]]}
[]
[null,null,"COMMONWEALTH OF PENNSYLVANIA",null,null,null,null,null,null,null,"DISTRICT",null,{"$f":"IF(ISBLANK('S1'!M2),\" \",'S1'!M2)","v":" "}]
[null,null,"DEPARTMENT OF TRANSPORTATION",null,null,null,null,null,null,null,"PLANT CODE",null,{"$f":"IF(ISBLANK('S1'!M3),\" \",'S1'!M3)","v":" "}]
[null,null,"PENNSYLVANIA TURNPIKE COMMISSION",null,null,null,null,null,null,null,"AGG SIZE",null,{"$f":"IF(ISBLANK('S1'!M4),\" \",'S1'!M4)","v":"Type A"}]
[{"$f":"'S1'!A5","v":"Concrete 2023"},null,null,null,null,null,null,null,null,null,"FM TARGET VALUE",null,{"$f":"IF(ISBLANK('S1'!M5),\" \",'S1'!M5)","v":" "}]
[null,null,null,"Material Test Results for Type A Fine Aggregate"]
[]
["Sample No."]
["Date"]
["St. Wt. Before Wash",null,null,"% Loss",null,"% Loss",null,"% Loss",null,"% Loss",null,"% Loss",null,"% Loss"]
["Dry Wt. After Wash",null,null,{"$f":"IF(ISBLANK(C11),\" \",IF(ISBLANK(C14),\" \",(C11-C14)/C11*100))","v":" "},null,{"$f":"IF(ISBLANK(E11),\" \",IF(ISBLANK(E14),\" \",(E11-E14)/E11*100))","v":" "},null,{"$f":"IF(ISBLANK(G11),\" \",IF(ISBLANK(G14),\" \",(G11-G14)/G11*100))","v":" "},null,{"$f":"IF(ISBLANK(I11),\" \",IF(ISBLANK(I14),\" \",(I11-I14)/I11*100))","v":" "},null,{"$f":"IF(ISBLANK(K11),\" \",IF(ISBLANK(K14),\" \",(K11-K14)/K11*100))","v":" "},null,{"$f":"IF(ISBLANK(M11),\" \",IF(ISBLANK(M14),\" \",(M11-M14)/M11*100))","v":" "}]
["Wt. Loss",null,{"$f":"IF(ISBLANK(C10),\" \",IF(ISBLANK(C11),\" \",C10-C11))","v":" "},null,{"$f":"IF(ISBLANK(E10),\" \",IF(ISBLANK(E11),\" \",E10-E11))","v":" "},null,{"$f":"IF(ISBLANK(G10),\" \",IF(ISBLANK(G11),\" \",G10-G11))","v":" "},null,{"$f":"IF(ISBLANK(I10),\" \",IF(ISBLANK(I11),\" \",I10-I11))","v":" "},null,{"$f":"IF(ISBLANK(K10),\" \",IF(ISBLANK(K11),\" \",K10-K11))","v":" "},null,{"$f":"IF(ISBLANK(M10),\" \",IF(ISBLANK(M11),\" \",M10-M11))","v":" "}]
[null,null,"Wt","% Passing","Wt","% Passing","Wt","% Passing","Wt","% Passing","Wt","% Passing","Wt","% Passing"]
[100,0.375,null,{"$f":"IF(ISBLANK(C$10),\"  \",IF(ISBLANK(C$11),\" \",IF(ISBLANK(C14),\" \",ROUND((C14+C$12)/C$10*100,1))))","v":"  "},null,{"$f":"IF(ISBLANK(E$10),\"  \",IF(ISBLANK(E$11),\" \",IF(ISBLANK(E14),\" \",ROUND((E14+E$12)/E$10*100,1))))","v":"  "},null,{"$f":"IF(ISBLANK(G$10),\"  \",IF(ISBLANK(G$11),\" \",IF(ISBLANK(G14),\" \",ROUND((G14+G$12)/G$10*100,1))))","v":"  "},null,{"$f":"IF(ISBLANK(I$10),\"  \",IF(ISBLANK(I$11),\" \",IF(ISBLANK(I14),\" \",ROUND((I14+I$12)/I$10*100,1))))","v":"  "},null,{"$f":"IF(ISBLANK(K$10),\"  \",IF(ISBLANK(K$11),\" \",IF(ISBLANK(K14),\" \",ROUND((K14+K$12)/K$10*100,1))))","v":"  "},null,{"$f":"IF(ISBLANK(M$10),\"  \",IF(ISBLANK(M$11),\" \",IF(ISBLANK(M14),\" \",ROUND((M14+M$12)/M$10*100,1))))","v":"  "}]
["95-100",4,null,{"$f":"IF(ISBLANK(C$10),\"  \",IF(ISBLANK(C$11),\" \",IF(ISBLANK(C15),\" \",ROUND((C15+C$12)/C$10*100,0))))","v":"  "},null,{"$f":"IF(ISBLANK(E$10),\"  \",IF(ISBLANK(E$11),\" \",IF(ISBLANK(E15),\" \",ROUND((E15+E$12)/E$10*100,0))))","v":"  "},null,{"$f":"IF(ISBLANK(G$10),\"  \",IF(ISBLANK(G$11),\" \",IF(ISBLANK(G15),\" \",ROUND((G15+G$12)/G$10*100,0))))","v":"  "},null,{"$f":"IF(ISBLANK(I$10),\"  \",IF(ISBLANK(I$11),\" \",IF(ISBLANK(I15),\" \",ROUND((I15+I$12)/I$10*100,0))))","v":"  "},null,{"$f":"IF(ISBLANK(K$10),\"  \",IF(ISBLANK(K$11),\" \",IF(ISBLANK(K15),\" \",ROUND((K15+K$12)/K$10*100,0))))","v":"  "},null,{"$f":"IF(ISBLANK(M$10),\"  \",IF(ISBLANK(M$11),\" \",IF(ISBLANK(M15),\" \",ROUND((M15+M$12)/M$10*100,0))))","v":"  "}]
["70-100",8,null,"  ",null,"  ",null,"  ",null,"  ",null,"  ",null,"  "]
["45-85",16,null,"  ",null,"  ",null,"  ",null,"  ",null,"  ",null,"  "]
["25-65",30,null,"  ",null,"  ",null,"  ",null,"  ",null,"  ",null,"  "]
["10-30",50,null,"  ",null,"  ",null,"  ",null,"  ",null,"  ",null,"  "]
["0-10",100,null,"  ",null,"  ",null,"  ",null,"  ",null,"  ",null,"  "]
[3,200,null,{"$f":"IF(ISBLANK(C$10),\"  \",IF(ISBLANK(C$11),\" \",IF(ISBLANK(C21),\" \",ROUND((C21+C$12)/C$10*100,2))))","v":"  "},null,{"$f":"IF(ISBLANK(E$10),\"  \",IF(ISBLANK(E$11),\" \",IF(ISBLANK(E21),\" \",ROUND((E21+E$12)/E$10*100,2))))","v":"  "},null,{"$f":"IF(ISBLANK(G$10),\"  \",IF(ISBLANK(G$11),\" \",IF(ISBLANK(G21),\" \",ROUND((G21+G$12)/G$10*100,2))))","v":"  "},null,{"$f":"IF(ISBLANK(I$10),\"  \",IF(ISBLANK(I$11),\" \",IF(ISBLANK(I21),\" \",ROUND((I21+I$12)/I$10*100,2))))","v":"  "},null,{"$f":"IF(ISBLANK(K$10),\"  \",IF(ISBLANK(K$11),\" \",IF(ISBLANK(K21),\" \",ROUND((K21+K$12)/K$10*100,2))))","v":"  "},null,{"$f":"IF(ISBLANK(M$10),\"  \",IF(ISBLANK(M$11),\" \",IF(ISBLANK(M21),\" \",ROUND((M21+M$12)/M$10*100,2))))","v":"  "}]
["2.30-3.15","FM",{"$f":"IF(ISBLANK(C10),\" \",IF(ISBLANK(C14),\" \",(600-SUM(D15:D20))/100))","v":" "},null,{"$f":"IF(ISBLANK(E10),\" \",IF(ISBLANK(E14),\" \",(600-SUM(F15:F20))/100))","v":" "},null,{"$f":"IF(ISBLANK(G10),\" \",IF(ISBLANK(G14),\" \",(600-SUM(H15:H20))/100))","v":" "},null,{"$f":"IF(ISBLANK(I10),\" \",IF(ISBLANK(I14),\" \",(600-SUM(J15:J20))/100))","v":" "},null,{"$f":"IF(ISBLANK(K10),\" \",IF(ISBLANK(K14),\" \",(600-SUM(L15:L20))/100))","v":" "},null,{"$f":"IF(ISBLANK(M10),\" \",IF(ISBLANK(M14),\" \",(600-SUM(N15:N20))/100))","v":" "}]
["Tested By"]
["Remarks"]
[]
[]
[]
["Sample No."]
["Date"]
["St. Wt. Before Wash",null,null,"% Loss",null,"% Loss",null,"% Loss",null,"% Loss",null,"% Loss",null,"% Loss"]
["Dry Wt. After Wash",null,null,{"$f":"IF(ISBLANK(C31),\" \",IF(ISBLANK(C34),\" \",(C31-C34)/C31*100))","v":" "},null,{"$f":"IF(ISBLANK(E31),\" \",IF(ISBLANK(E34),\" \",(E31-E34)/E31*100))","v":" "},null,{"$f":"IF(ISBLANK(G31),\" \",IF(ISBLANK(G34),\" \",(G31-G34)/G31*100))","v":" "},null,{"$f":"IF(ISBLANK(I31),\" \",IF(ISBLANK(I34),\" \",(I31-I34)/I31*100))","v":" "},null,{"$f":"IF(ISBLANK(K31),\" \",IF(ISBLANK(K34),\" \",(K31-K34)/K31*100))","v":" "},null,{"$f":"IF(ISBLANK(M31),\" \",IF(ISBLANK(M34),\" \",(M31-M34)/M31*100))","v":" "}]
["Wt. Loss",null,{"$f":"IF(ISBLANK(C30),\" \",IF(ISBLANK(C31),\" \",C30-C31))","v":" "},null,{"$f":"IF(ISBLANK(E30),\" \",IF(ISBLANK(E31),\" \",E30-E31))","v":" "},null,{"$f":"IF(ISBLANK(G30),\" \",IF(ISBLANK(G31),\" \",G30-G31))","v":" "},null,{"$f":"IF(ISBLANK(I30),\" \",IF(ISBLANK(I31),\" \",I30-I31))","v":" "},null,{"$f":"IF(ISBLANK(K30),\" \",IF(ISBLANK(K31),\" \",K30-K31))","v":" "},null,{"$f":"IF(ISBLANK(M30),\" \",IF(ISBLANK(M31),\" \",M30-M31))","v":" "}]
[null,null,"Wt","% Passing","Wt","% Passing","Wt","% Passing","Wt","% Passing","Wt","% Passing","Wt","% Passing"]
[100,0.375,null,{"$f":"IF(ISBLANK(C$30),\"  \",IF(ISBLANK(C$31),\" \",IF(ISBLANK(C34),\" \",ROUND((C34+C$32)/C$30*100,1))))","v":"  "},null,{"$f":"IF(ISBLANK(E$30),\"  \",IF(ISBLANK(E$31),\" \",IF(ISBLANK(E34),\" \",ROUND((E34+E$32)/E$30*100,1))))","v":"  "},null,{"$f":"IF(ISBLANK(G$30),\"  \",IF(ISBLANK(G$31),\" \",IF(ISBLANK(G34),\" \",ROUND((G34+G$32)/G$30*100,1))))","v":"  "},null,{"$f":"IF(ISBLANK(I$30),\"  \",IF(ISBLANK(I$31),\" \",IF(ISBLANK(I34),\" \",ROUND((I34+I$32)/I$30*100,1))))","v":"  "},null,{"$f":"IF(ISBLANK(K$30),\"  \",IF(ISBLANK(K$31),\" \",IF(ISBLANK(K34),\" \",ROUND((K34+K$32)/K$30*100,1))))","v":"  "},null,{"$f":"IF(ISBLANK(M$30),\"  \",IF(ISBLANK(M$31),\" \",IF(ISBLANK(M34),\" \",ROUND((M34+M$32)/M$30*100,1))))","v":"  "}]
["95-100",4,null,{"$f":"IF(ISBLANK(C$30),\"  \",IF(ISBLANK(C$31),\" \",IF(ISBLANK(C35),\" \",ROUND((C35+C$32)/C$30*100,0))))","v":"  "},null,{"$f":"IF(ISBLANK(E$30),\"  \",IF(ISBLANK(E$31),\" \",IF(ISBLANK(E35),\" \",ROUND((E35+E$32)/E$30*100,0))))","v":"  "},null,{"$f":"IF(ISBLANK(G$30),\"  \",IF(ISBLANK(G$31),\" \",IF(ISBLANK(G35),\" \",ROUND((G35+G$32)/G$30*100,0))))","v":"  "},null,{"$f":"IF(ISBLANK(I$30),\"  \",IF(ISBLANK(I$31),\" \",IF(ISBLANK(I35),\" \",ROUND((I35+I$32)/I$30*100,0))))","v":"  "},null,{"$f":"IF(ISBLANK(K$30),\"  \",IF(ISBLANK(K$31),\" \",IF(ISBLANK(K35),\" \",ROUND((K35+K$32)/K$30*100,0))))","v":"  "},null,{"$f":"IF(ISBLANK(M$30),\"  \",IF(ISBLANK(M$31),\" \",IF(ISBLANK(M35),\" \",ROUND((M35+M$32)/M$30*100,0))))","v":"  "}]
["70-100",8,null,"  ",null,"  ",null,"  ",null,"  ",null,"  ",null,"  "]
["45-85",16,null,"  ",null,"  ",null,"  ",null,"  ",null,"  ",null,"  "]
["25-65",30,null,"  ",null,"  ",null,"  ",null,"  ",null,"  ",null,"  "]
["10-30",50,null,"  ",null,"  ",null,"  ",null,"  ",null,"  ",null,"  "]
["0-10",100,null,"  ",null,"  ",null,"  ",null,"  ",null,"  ",null,"  "]
[3,200,null,{"$f":"IF(ISBLANK(C$30),\"  \",IF(ISBLANK(C$31),\" \",IF(ISBLANK(C41),\" \",ROUND((C41+C$32)/C$30*100,2))))","v":"  "},null,{"$f":"IF(ISBLANK(E$30),\"  \",IF(ISBLANK(E$31),\" \",IF(ISBLANK(E41),\" \",ROUND((E41+E$32)/E$30*100,2))))","v":"  "},null,{"$f":"IF(ISBLANK(G$30),\"  \",IF(ISBLANK(G$31),\" \",IF(ISBLANK(G41),\" \",ROUND((G41+G$32)/G$30*100,2))))","v":"  "},null,{"$f":"IF(ISBLANK(I$30),\"  \",IF(ISBLANK(I$31),\" \",IF(ISBLANK(I41),\" \",ROUND((I41+I$32)/I$30*100,2))))","v":"  "},null,{"$f":"IF(ISBLANK(K$30),\"  \",IF(ISBLANK(K$31),\" \",IF(ISBLANK(K41),\" \",ROUND((K41+K$32)/K$30*100,2))))","v":"  "},null,{"$f":"IF(ISBLANK(M$30),\"  \",IF(ISBLANK(M$31),\" \",IF(ISBLANK(M41),\" \",ROUND((M41+M$32)/M$30*100,2))))","v":"  "}]
["2.30-3.15","FM",{"$f":"IF(ISBLANK(C30),\" \",IF(ISBLANK(C34),\" \",(600-SUM(D35:D40))/100))","v":" "},null,{"$f":"IF(ISBLANK(E30),\" \",IF(ISBLANK(E34),\" \",(600-SUM(F35:F40))/100))","v":" "},null,{"$f":"IF(ISBLANK(G30),\" \",IF(ISBLANK(G34),\" \",(600-SUM(H35:H40))/100))","v":" "},null,{"$f":"IF(ISBLANK(I30),\" \",IF(ISBLANK(I34),\" \",(600-SUM(J35:J40))/100))","v":" "},null,{"$f":"IF(ISBLANK(K30),\" \",IF(ISBLANK(K34),\" \",(600-SUM(L35:L40))/100))","v":" "},null,{"$f":"IF(ISBLANK(M30),\" \",IF(ISBLANK(M34),\" \",(600-SUM(N35:N40))/100))","v":" "}]
["Tested By"]
["Remarks"]

{"sheet":"S8","index":7,"n_rows":44,"n_cols":14,"rows_kept":44,"cut":false,"hidden":true,"merged":[[43,0,45,1],[43,2,45,3],[43,4,45,5],[43,6,45,7],[43,8,45,9],[43,10,45,11],[43,12,45,13],[42,4,42,5],[42,6,42,7],[42,0,42,1],[42,2,42,3],[1,12,1,13],[2,10,2,11],[2,12,2,13],[3,10,3,11],[3,12,3,13],[42,8,42,9],[42,10,42,11],[22,12,22,13],[23,0,25,1],[23,2,25,3],[23,4,25,5],[23,6,25,7],[23,8,25,9],[23,10,25,11],[42,12,42,13],[7,12,7,13],[8,0,8,1],[8,2,8,3],[8,4,8,5],[8,6,8,7],[8,8,8,9],[8,10,8,11],[7,0,7,1],[4,12,4,13],[8,12,8,13],[5,3,5,8],[7,8,7,9],[5,10,5,11],[5,12,5,13],[7,2,7,3],[7,4,7,5],[7,6,7,7],[4,10,4,11],[31,0,31,1],[31,2,31,3],[41,2,41,3],[32,0,32,1],[22,10,22,11],[29,0,29,1],[28,0,28,1],[28,2,28,3],[27,0,27,1],[27,4,27,5],[27,6,27,7],[22,6,22,7],[22,8,22,9],[31,12,31,13],[41,12,41,13],[11,12,11,13],[28,8,28,9],[28,6,28,7],[27,2,27,3],[11,2,11,3],[11,4,11,5],[11,6,11,7],[21,2,21,3],[21,12,21,13],[28,12,28,13],[27,12,27,13],[23,12,25,13],[28,4,28,5],[22,2,22,3],[22,4,22,5],[21,8,21,9],[21,4,21,5],[21,6,21,7],[21,10,21,11],[11,8,11,9],[11,10,11,11],[28,10,28,11],[0,8,3,9],[1,2,1,7],[2,2,2,7],[3,2,3,7],[4,0,4,1],[41,8,41,9],[41,10,41,11],[27,10,27,11],[27,8,27,9],[31,8,31,9],[31,10,31,11],[10,0,10,1],[12,0,12,1],[22,0,22,1],[9,0,9,1],[7,10,7,11],[0,0,3,1],[1,10,1,11],[11,0,11,1],[31,4,31,5],[31,6,31,7],[41,4,41,5],[41,6,41,7],[30,0,30,1]]}
[]
[null,null,"COMMONWEALTH OF PENNSYLVANIA",null,null,null,null,null,null,null,"DISTRICT",null,{"$f":"IF(ISBLANK('S1'!M2),\" \",'S1'!M2)","v":" "}]
[null,null,"DEPARTMENT OF TRANSPORTATION",null,null,null,null,null,null,null,"PLANT CODE",null,{"$f":"IF(ISBLANK('S1'!M3),\" \",'S1'!M3)","v":" "}]
[null,null,"PENNSYLVANIA TURNPIKE COMMISSION",null,null,null,null,null,null,null,"AGG SIZE",null,{"$f":"IF(ISBLANK('S1'!M4),\" \",'S1'!M4)","v":"Type A"}]
[{"$f":"'S1'!A5","v":"Concrete 2023"},null,null,null,null,null,null,null,null,null,"FM TARGET VALUE",null,{"$f":"IF(ISBLANK('S1'!M5),\" \",'S1'!M5)","v":" "}]
[null,null,null,"Material Test Results for Type A Fine Aggregate"]
[]
["Sample No."]
["Date"]
["St. Wt. Before Wash",null,null,"% Loss",null,"% Loss",null,"% Loss",null,"% Loss",null,"% Loss",null,"% Loss"]
["Dry Wt. After Wash",null,null,{"$f":"IF(ISBLANK(C11),\" \",IF(ISBLANK(C14),\" \",(C11-C14)/C11*100))","v":" "},null,{"$f":"IF(ISBLANK(E11),\" \",IF(ISBLANK(E14),\" \",(E11-E14)/E11*100))","v":" "},null,{"$f":"IF(ISBLANK(G11),\" \",IF(ISBLANK(G14),\" \",(G11-G14)/G11*100))","v":" "},null,{"$f":"IF(ISBLANK(I11),\" \",IF(ISBLANK(I14),\" \",(I11-I14)/I11*100))","v":" "},null,{"$f":"IF(ISBLANK(K11),\" \",IF(ISBLANK(K14),\" \",(K11-K14)/K11*100))","v":" "},null,{"$f":"IF(ISBLANK(M11),\" \",IF(ISBLANK(M14),\" \",(M11-M14)/M11*100))","v":" "}]
["Wt. Loss",null,{"$f":"IF(ISBLANK(C10),\" \",IF(ISBLANK(C11),\" \",C10-C11))","v":" "},null,{"$f":"IF(ISBLANK(E10),\" \",IF(ISBLANK(E11),\" \",E10-E11))","v":" "},null,{"$f":"IF(ISBLANK(G10),\" \",IF(ISBLANK(G11),\" \",G10-G11))","v":" "},null,{"$f":"IF(ISBLANK(I10),\" \",IF(ISBLANK(I11),\" \",I10-I11))","v":" "},null,{"$f":"IF(ISBLANK(K10),\" \",IF(ISBLANK(K11),\" \",K10-K11))","v":" "},null,{"$f":"IF(ISBLANK(M10),\" \",IF(ISBLANK(M11),\" \",M10-M11))","v":" "}]
[null,null,"Wt","% Passing","Wt","% Passing","Wt","% Passing","Wt","% Passing","Wt","% Passing","Wt","% Passing"]
[100,0.375,null,{"$f":"IF(ISBLANK(C$10),\"  \",IF(ISBLANK(C$11),\" \",IF(ISBLANK(C14),\" \",ROUND((C14+C$12)/C$10*100,1))))","v":"  "},null,{"$f":"IF(ISBLANK(E$10),\"  \",IF(ISBLANK(E$11),\" \",IF(ISBLANK(E14),\" \",ROUND((E14+E$12)/E$10*100,1))))","v":"  "},null,{"$f":"IF(ISBLANK(G$10),\"  \",IF(ISBLANK(G$11),\" \",IF(ISBLANK(G14),\" \",ROUND((G14+G$12)/G$10*100,1))))","v":"  "},null,{"$f":"IF(ISBLANK(I$10),\"  \",IF(ISBLANK(I$11),\" \",IF(ISBLANK(I14),\" \",ROUND((I14+I$12)/I$10*100,1))))","v":"  "},null,{"$f":"IF(ISBLANK(K$10),\"  \",IF(ISBLANK(K$11),\" \",IF(ISBLANK(K14),\" \",ROUND((K14+K$12)/K$10*100,1))))","v":"  "},null,{"$f":"IF(ISBLANK(M$10),\"  \",IF(ISBLANK(M$11),\" \",IF(ISBLANK(M14),\" \",ROUND((M14+M$12)/M$10*100,1))))","v":"  "}]
["95-100",4,null,{"$f":"IF(ISBLANK(C$10),\"  \",IF(ISBLANK(C$11),\" \",IF(ISBLANK(C15),\" \",ROUND((C15+C$12)/C$10*100,0))))","v":"  "},null,{"$f":"IF(ISBLANK(E$10),\"  \",IF(ISBLANK(E$11),\" \",IF(ISBLANK(E15),\" \",ROUND((E15+E$12)/E$10*100,0))))","v":"  "},null,{"$f":"IF(ISBLANK(G$10),\"  \",IF(ISBLANK(G$11),\" \",IF(ISBLANK(G15),\" \",ROUND((G15+G$12)/G$10*100,0))))","v":"  "},null,{"$f":"IF(ISBLANK(I$10),\"  \",IF(ISBLANK(I$11),\" \",IF(ISBLANK(I15),\" \",ROUND((I15+I$12)/I$10*100,0))))","v":"  "},null,{"$f":"IF(ISBLANK(K$10),\"  \",IF(ISBLANK(K$11),\" \",IF(ISBLANK(K15),\" \",ROUND((K15+K$12)/K$10*100,0))))","v":"  "},null,{"$f":"IF(ISBLANK(M$10),\"  \",IF(ISBLANK(M$11),\" \",IF(ISBLANK(M15),\" \",ROUND((M15+M$12)/M$10*100,0))))","v":"  "}]
["70-100",8,null,"  ",null,"  ",null,"  ",null,"  ",null,"  ",null,"  "]
["45-85",16,null,"  ",null,"  ",null,"  ",null,"  ",null,"  ",null,"  "]
["25-65",30,null,"  ",null,"  ",null,"  ",null,"  ",null,"  ",null,"  "]
["10-30",50,null,"  ",null,"  ",null,"  ",null,"  ",null,"  ",null,"  "]
["0-10",100,null,"  ",null,"  ",null,"  ",null,"  ",null,"  ",null,"  "]
[3,200,null,{"$f":"IF(ISBLANK(C$10),\"  \",IF(ISBLANK(C$11),\" \",IF(ISBLANK(C21),\" \",ROUND((C21+C$12)/C$10*100,2))))","v":"  "},null,{"$f":"IF(ISBLANK(E$10),\"  \",IF(ISBLANK(E$11),\" \",IF(ISBLANK(E21),\" \",ROUND((E21+E$12)/E$10*100,2))))","v":"  "},null,{"$f":"IF(ISBLANK(G$10),\"  \",IF(ISBLANK(G$11),\" \",IF(ISBLANK(G21),\" \",ROUND((G21+G$12)/G$10*100,2))))","v":"  "},null,{"$f":"IF(ISBLANK(I$10),\"  \",IF(ISBLANK(I$11),\" \",IF(ISBLANK(I21),\" \",ROUND((I21+I$12)/I$10*100,2))))","v":"  "},null,{"$f":"IF(ISBLANK(K$10),\"  \",IF(ISBLANK(K$11),\" \",IF(ISBLANK(K21),\" \",ROUND((K21+K$12)/K$10*100,2))))","v":"  "},null,{"$f":"IF(ISBLANK(M$10),\"  \",IF(ISBLANK(M$11),\" \",IF(ISBLANK(M21),\" \",ROUND((M21+M$12)/M$10*100,2))))","v":"  "}]
["2.30-3.15","FM",{"$f":"IF(ISBLANK(C10),\" \",IF(ISBLANK(C14),\" \",(600-SUM(D15:D20))/100))","v":" "},null,{"$f":"IF(ISBLANK(E10),\" \",IF(ISBLANK(E14),\" \",(600-SUM(F15:F20))/100))","v":" "},null,{"$f":"IF(ISBLANK(G10),\" \",IF(ISBLANK(G14),\" \",(600-SUM(H15:H20))/100))","v":" "},null,{"$f":"IF(ISBLANK(I10),\" \",IF(ISBLANK(I14),\" \",(600-SUM(J15:J20))/100))","v":" "},null,{"$f":"IF(ISBLANK(K10),\" \",IF(ISBLANK(K14),\" \",(600-SUM(L15:L20))/100))","v":" "},null,{"$f":"IF(ISBLANK(M10),\" \",IF(ISBLANK(M14),\" \",(600-SUM(N15:N20))/100))","v":" "}]
["Tested By"]
["Remarks"]
[]
[]
[]
["Sample No."]
["Date"]
["St. Wt. Before Wash",null,null,"% Loss",null,"% Loss",null,"% Loss",null,"% Loss",null,"% Loss",null,"% Loss"]
["Dry Wt. After Wash",null,null,{"$f":"IF(ISBLANK(C31),\" \",IF(ISBLANK(C34),\" \",(C31-C34)/C31*100))","v":" "},null,{"$f":"IF(ISBLANK(E31),\" \",IF(ISBLANK(E34),\" \",(E31-E34)/E31*100))","v":" "},null,{"$f":"IF(ISBLANK(G31),\" \",IF(ISBLANK(G34),\" \",(G31-G34)/G31*100))","v":" "},null,{"$f":"IF(ISBLANK(I31),\" \",IF(ISBLANK(I34),\" \",(I31-I34)/I31*100))","v":" "},null,{"$f":"IF(ISBLANK(K31),\" \",IF(ISBLANK(K34),\" \",(K31-K34)/K31*100))","v":" "},null,{"$f":"IF(ISBLANK(M31),\" \",IF(ISBLANK(M34),\" \",(M31-M34)/M31*100))","v":" "}]
["Wt. Loss",null,{"$f":"IF(ISBLANK(C30),\" \",IF(ISBLANK(C31),\" \",C30-C31))","v":" "},null,{"$f":"IF(ISBLANK(E30),\" \",IF(ISBLANK(E31),\" \",E30-E31))","v":" "},null,{"$f":"IF(ISBLANK(G30),\" \",IF(ISBLANK(G31),\" \",G30-G31))","v":" "},null,{"$f":"IF(ISBLANK(I30),\" \",IF(ISBLANK(I31),\" \",I30-I31))","v":" "},null,{"$f":"IF(ISBLANK(K30),\" \",IF(ISBLANK(K31),\" \",K30-K31))","v":" "},null,{"$f":"IF(ISBLANK(M30),\" \",IF(ISBLANK(M31),\" \",M30-M31))","v":" "}]
[null,null,"Wt","% Passing","Wt","% Passing","Wt","% Passing","Wt","% Passing","Wt","% Passing","Wt","% Passing"]
[100,0.375,null,{"$f":"IF(ISBLANK(C$30),\"  \",IF(ISBLANK(C$31),\" \",IF(ISBLANK(C34),\" \",ROUND((C34+C$32)/C$30*100,1))))","v":"  "},null,{"$f":"IF(ISBLANK(E$30),\"  \",IF(ISBLANK(E$31),\" \",IF(ISBLANK(E34),\" \",ROUND((E34+E$32)/E$30*100,1))))","v":"  "},null,{"$f":"IF(ISBLANK(G$30),\"  \",IF(ISBLANK(G$31),\" \",IF(ISBLANK(G34),\" \",ROUND((G34+G$32)/G$30*100,1))))","v":"  "},null,{"$f":"IF(ISBLANK(I$30),\"  \",IF(ISBLANK(I$31),\" \",IF(ISBLANK(I34),\" \",ROUND((I34+I$32)/I$30*100,1))))","v":"  "},null,{"$f":"IF(ISBLANK(K$30),\"  \",IF(ISBLANK(K$31),\" \",IF(ISBLANK(K34),\" \",ROUND((K34+K$32)/K$30*100,1))))","v":"  "},null,{"$f":"IF(ISBLANK(M$30),\"  \",IF(ISBLANK(M$31),\" \",IF(ISBLANK(M34),\" \",ROUND((M34+M$32)/M$30*100,1))))","v":"  "}]
["95-100",4,null,{"$f":"IF(ISBLANK(C$30),\"  \",IF(ISBLANK(C$31),\" \",IF(ISBLANK(C35),\" \",ROUND((C35+C$32)/C$30*100,0))))","v":"  "},null,{"$f":"IF(ISBLANK(E$30),\"  \",IF(ISBLANK(E$31),\" \",IF(ISBLANK(E35),\" \",ROUND((E35+E$32)/E$30*100,0))))","v":"  "},null,{"$f":"IF(ISBLANK(G$30),\"  \",IF(ISBLANK(G$31),\" \",IF(ISBLANK(G35),\" \",ROUND((G35+G$32)/G$30*100,0))))","v":"  "},null,{"$f":"IF(ISBLANK(I$30),\"  \",IF(ISBLANK(I$31),\" \",IF(ISBLANK(I35),\" \",ROUND((I35+I$32)/I$30*100,0))))","v":"  "},null,{"$f":"IF(ISBLANK(K$30),\"  \",IF(ISBLANK(K$31),\" \",IF(ISBLANK(K35),\" \",ROUND((K35+K$32)/K$30*100,0))))","v":"  "},null,{"$f":"IF(ISBLANK(M$30),\"  \",IF(ISBLANK(M$31),\" \",IF(ISBLANK(M35),\" \",ROUND((M35+M$32)/M$30*100,0))))","v":"  "}]
["70-100",8,null,"  ",null,"  ",null,"  ",null,"  ",null,"  ",null,"  "]
["45-85",16,null,"  ",null,"  ",null,"  ",null,"  ",null,"  ",null,"  "]
["25-65",30,null,"  ",null,"  ",null,"  ",null,"  ",null,"  ",null,"  "]
["10-30",50,null,"  ",null,"  ",null,"  ",null,"  ",null,"  ",null,"  "]
["0-10",100,null,"  ",null,"  ",null,"  ",null,"  ",null,"  ",null,"  "]
[3,200,null,{"$f":"IF(ISBLANK(C$30),\"  \",IF(ISBLANK(C$31),\" \",IF(ISBLANK(C41),\" \",ROUND((C41+C$32)/C$30*100,2))))","v":"  "},null,{"$f":"IF(ISBLANK(E$30),\"  \",IF(ISBLANK(E$31),\" \",IF(ISBLANK(E41),\" \",ROUND((E41+E$32)/E$30*100,2))))","v":"  "},null,{"$f":"IF(ISBLANK(G$30),\"  \",IF(ISBLANK(G$31),\" \",IF(ISBLANK(G41),\" \",ROUND((G41+G$32)/G$30*100,2))))","v":"  "},null,{"$f":"IF(ISBLANK(I$30),\"  \",IF(ISBLANK(I$31),\" \",IF(ISBLANK(I41),\" \",ROUND((I41+I$32)/I$30*100,2))))","v":"  "},null,{"$f":"IF(ISBLANK(K$30),\"  \",IF(ISBLANK(K$31),\" \",IF(ISBLANK(K41),\" \",ROUND((K41+K$32)/K$30*100,2))))","v":"  "},null,{"$f":"IF(ISBLANK(M$30),\"  \",IF(ISBLANK(M$31),\" \",IF(ISBLANK(M41),\" \",ROUND((M41+M$32)/M$30*100,2))))","v":"  "}]
["2.30-3.15","FM",{"$f":"IF(ISBLANK(C30),\" \",IF(ISBLANK(C34),\" \",(600-SUM(D35:D40))/100))","v":" "},null,{"$f":"IF(ISBLANK(E30),\" \",IF(ISBLANK(E34),\" \",(600-SUM(F35:F40))/100))","v":" "},null,{"$f":"IF(ISBLANK(G30),\" \",IF(ISBLANK(G34),\" \",(600-SUM(H35:H40))/100))","v":" "},null,{"$f":"IF(ISBLANK(I30),\" \",IF(ISBLANK(I34),\" \",(600-SUM(J35:J40))/100))","v":" "},null,{"$f":"IF(ISBLANK(K30),\" \",IF(ISBLANK(K34),\" \",(600-SUM(L35:L40))/100))","v":" "},null,{"$f":"IF(ISBLANK(M30),\" \",IF(ISBLANK(M34),\" \",(600-SUM(N35:N40))/100))","v":" "}]
["Tested By"]
["Remarks"]

{"sheet":"S9","index":8,"n_rows":44,"n_cols":14,"rows_kept":44,"cut":false,"hidden":true,"merged":[[43,0,45,1],[43,2,45,3],[43,4,45,5],[43,6,45,7],[43,8,45,9],[43,10,45,11],[43,12,45,13],[42,4,42,5],[42,6,42,7],[42,0,42,1],[42,2,42,3],[1,12,1,13],[2,10,2,11],[2,12,2,13],[3,10,3,11],[3,12,3,13],[42,8,42,9],[42,10,42,11],[22,12,22,13],[23,0,25,1],[23,2,25,3],[23,4,25,5],[23,6,25,7],[23,8,25,9],[23,10,25,11],[42,12,42,13],[7,12,7,13],[8,0,8,1],[8,2,8,3],[8,4,8,5],[8,6,8,7],[8,8,8,9],[8,10,8,11],[7,0,7,1],[4,12,4,13],[8,12,8,13],[5,3,5,8],[7,8,7,9],[5,10,5,11],[5,12,5,13],[7,2,7,3],[7,4,7,5],[7,6,7,7],[4,10,4,11],[31,0,31,1],[31,2,31,3],[41,2,41,3],[32,0,32,1],[22,10,22,11],[29,0,29,1],[28,0,28,1],[28,2,28,3],[27,0,27,1],[27,4,27,5],[27,6,27,7],[22,6,22,7],[22,8,22,9],[31,12,31,13],[41,12,41,13],[11,12,11,13],[28,8,28,9],[28,6,28,7],[27,2,27,3],[11,2,11,3],[11,4,11,5],[11,6,11,7],[21,2,21,3],[21,12,21,13],[28,12,28,13],[27,12,27,13],[23,12,25,13],[28,4,28,5],[22,2,22,3],[22,4,22,5],[21,8,21,9],[21,4,21,5],[21,6,21,7],[21,10,21,11],[11,8,11,9],[11,10,11,11],[28,10,28,11],[0,8,3,9],[1,2,1,7],[2,2,2,7],[3,2,3,7],[4,0,4,1],[41,8,41,9],[41,10,41,11],[27,10,27,11],[27,8,27,9],[31,8,31,9],[31,10,31,11],[10,0,10,1],[12,0,12,1],[22,0,22,1],[9,0,9,1],[7,10,7,11],[0,0,3,1],[1,10,1,11],[11,0,11,1],[31,4,31,5],[31,6,31,7],[41,4,41,5],[41,6,41,7],[30,0,30,1]]}
[]
[null,null,"COMMONWEALTH OF PENNSYLVANIA",null,null,null,null,null,null,null,"DISTRICT",null,{"$f":"IF(ISBLANK('S1'!M2),\" \",'S1'!M2)","v":" "}]
[null,null,"DEPARTMENT OF TRANSPORTATION",null,null,null,null,null,null,null,"PLANT CODE",null,{"$f":"IF(ISBLANK('S1'!M3),\" \",'S1'!M3)","v":" "}]
[null,null,"PENNSYLVANIA TURNPIKE COMMISSION",null,null,null,null,null,null,null,"AGG SIZE",null,{"$f":"IF(ISBLANK('S1'!M4),\" \",'S1'!M4)","v":"Type A"}]
[{"$f":"'S1'!A5","v":"Concrete 2023"},null,null,null,null,null,null,null,null,null,"FM TARGET VALUE",null,{"$f":"IF(ISBLANK('S1'!M5),\" \",'S1'!M5)","v":" "}]
[null,null,null,"Material Test Results for Type A Fine Aggregate"]
[]
["Sample No."]
["Date"]
["St. Wt. Before Wash",null,null,"% Loss",null,"% Loss",null,"% Loss",null,"% Loss",null,"% Loss",null,"% Loss"]
["Dry Wt. After Wash",null,null,{"$f":"IF(ISBLANK(C11),\" \",IF(ISBLANK(C14),\" \",(C11-C14)/C11*100))","v":" "},null,{"$f":"IF(ISBLANK(E11),\" \",IF(ISBLANK(E14),\" \",(E11-E14)/E11*100))","v":" "},null,{"$f":"IF(ISBLANK(G11),\" \",IF(ISBLANK(G14),\" \",(G11-G14)/G11*100))","v":" "},null,{"$f":"IF(ISBLANK(I11),\" \",IF(ISBLANK(I14),\" \",(I11-I14)/I11*100))","v":" "},null,{"$f":"IF(ISBLANK(K11),\" \",IF(ISBLANK(K14),\" \",(K11-K14)/K11*100))","v":" "},null,{"$f":"IF(ISBLANK(M11),\" \",IF(ISBLANK(M14),\" \",(M11-M14)/M11*100))","v":" "}]
["Wt. Loss",null,{"$f":"IF(ISBLANK(C10),\" \",IF(ISBLANK(C11),\" \",C10-C11))","v":" "},null,{"$f":"IF(ISBLANK(E10),\" \",IF(ISBLANK(E11),\" \",E10-E11))","v":" "},null,{"$f":"IF(ISBLANK(G10),\" \",IF(ISBLANK(G11),\" \",G10-G11))","v":" "},null,{"$f":"IF(ISBLANK(I10),\" \",IF(ISBLANK(I11),\" \",I10-I11))","v":" "},null,{"$f":"IF(ISBLANK(K10),\" \",IF(ISBLANK(K11),\" \",K10-K11))","v":" "},null,{"$f":"IF(ISBLANK(M10),\" \",IF(ISBLANK(M11),\" \",M10-M11))","v":" "}]
[null,null,"Wt","% Passing","Wt","% Passing","Wt","% Passing","Wt","% Passing","Wt","% Passing","Wt","% Passing"]
[100,0.375,null,{"$f":"IF(ISBLANK(C$10),\"  \",IF(ISBLANK(C$11),\" \",IF(ISBLANK(C14),\" \",ROUND((C14+C$12)/C$10*100,1))))","v":"  "},null,{"$f":"IF(ISBLANK(E$10),\"  \",IF(ISBLANK(E$11),\" \",IF(ISBLANK(E14),\" \",ROUND((E14+E$12)/E$10*100,1))))","v":"  "},null,{"$f":"IF(ISBLANK(G$10),\"  \",IF(ISBLANK(G$11),\" \",IF(ISBLANK(G14),\" \",ROUND((G14+G$12)/G$10*100,1))))","v":"  "},null,{"$f":"IF(ISBLANK(I$10),\"  \",IF(ISBLANK(I$11),\" \",IF(ISBLANK(I14),\" \",ROUND((I14+I$12)/I$10*100,1))))","v":"  "},null,{"$f":"IF(ISBLANK(K$10),\"  \",IF(ISBLANK(K$11),\" \",IF(ISBLANK(K14),\" \",ROUND((K14+K$12)/K$10*100,1))))","v":"  "},null,{"$f":"IF(ISBLANK(M$10),\"  \",IF(ISBLANK(M$11),\" \",IF(ISBLANK(M14),\" \",ROUND((M14+M$12)/M$10*100,1))))","v":"  "}]
["95-100",4,null,{"$f":"IF(ISBLANK(C$10),\"  \",IF(ISBLANK(C$11),\" \",IF(ISBLANK(C15),\" \",ROUND((C15+C$12)/C$10*100,0))))","v":"  "},null,{"$f":"IF(ISBLANK(E$10),\"  \",IF(ISBLANK(E$11),\" \",IF(ISBLANK(E15),\" \",ROUND((E15+E$12)/E$10*100,0))))","v":"  "},null,{"$f":"IF(ISBLANK(G$10),\"  \",IF(ISBLANK(G$11),\" \",IF(ISBLANK(G15),\" \",ROUND((G15+G$12)/G$10*100,0))))","v":"  "},null,{"$f":"IF(ISBLANK(I$10),\"  \",IF(ISBLANK(I$11),\" \",IF(ISBLANK(I15),\" \",ROUND((I15+I$12)/I$10*100,0))))","v":"  "},null,{"$f":"IF(ISBLANK(K$10),\"  \",IF(ISBLANK(K$11),\" \",IF(ISBLANK(K15),\" \",ROUND((K15+K$12)/K$10*100,0))))","v":"  "},null,{"$f":"IF(ISBLANK(M$10),\"  \",IF(ISBLANK(M$11),\" \",IF(ISBLANK(M15),\" \",ROUND((M15+M$12)/M$10*100,0))))","v":"  "}]
["70-100",8,null,"  ",null,"  ",null,"  ",null,"  ",null,"  ",null,"  "]
["45-85",16,null,"  ",null,"  ",null,"  ",null,"  ",null,"  ",null,"  "]
["25-65",30,null,"  ",null,"  ",null,"  ",null,"  ",null,"  ",null,"  "]
["10-30",50,null,"  ",null,"  ",null,"  ",null,"  ",null,"  ",null,"  "]
["0-10",100,null,"  ",null,"  ",null,"  ",null,"  ",null,"  ",null,"  "]
[3,200,null,{"$f":"IF(ISBLANK(C$10),\"  \",IF(ISBLANK(C$11),\" \",IF(ISBLANK(C21),\" \",ROUND((C21+C$12)/C$10*100,2))))","v":"  "},null,{"$f":"IF(ISBLANK(E$10),\"  \",IF(ISBLANK(E$11),\" \",IF(ISBLANK(E21),\" \",ROUND((E21+E$12)/E$10*100,2))))","v":"  "},null,{"$f":"IF(ISBLANK(G$10),\"  \",IF(ISBLANK(G$11),\" \",IF(ISBLANK(G21),\" \",ROUND((G21+G$12)/G$10*100,2))))","v":"  "},null,{"$f":"IF(ISBLANK(I$10),\"  \",IF(ISBLANK(I$11),\" \",IF(ISBLANK(I21),\" \",ROUND((I21+I$12)/I$10*100,2))))","v":"  "},null,{"$f":"IF(ISBLANK(K$10),\"  \",IF(ISBLANK(K$11),\" \",IF(ISBLANK(K21),\" \",ROUND((K21+K$12)/K$10*100,2))))","v":"  "},null,{"$f":"IF(ISBLANK(M$10),\"  \",IF(ISBLANK(M$11),\" \",IF(ISBLANK(M21),\" \",ROUND((M21+M$12)/M$10*100,2))))","v":"  "}]
["2.30-3.15","FM",{"$f":"IF(ISBLANK(C10),\" \",IF(ISBLANK(C14),\" \",(600-SUM(D15:D20))/100))","v":" "},null,{"$f":"IF(ISBLANK(E10),\" \",IF(ISBLANK(E14),\" \",(600-SUM(F15:F20))/100))","v":" "},null,{"$f":"IF(ISBLANK(G10),\" \",IF(ISBLANK(G14),\" \",(600-SUM(H15:H20))/100))","v":" "},null,{"$f":"IF(ISBLANK(I10),\" \",IF(ISBLANK(I14),\" \",(600-SUM(J15:J20))/100))","v":" "},null,{"$f":"IF(ISBLANK(K10),\" \",IF(ISBLANK(K14),\" \",(600-SUM(L15:L20))/100))","v":" "},null,{"$f":"IF(ISBLANK(M10),\" \",IF(ISBLANK(M14),\" \",(600-SUM(N15:N20))/100))","v":" "}]
["Tested By"]
["Remarks"]
[]
[]
[]
["Sample No."]
["Date"]
["St. Wt. Before Wash",null,null,"% Loss",null,"% Loss",null,"% Loss",null,"% Loss",null,"% Loss",null,"% Loss"]
["Dry Wt. After Wash",null,null,{"$f":"IF(ISBLANK(C31),\" \",IF(ISBLANK(C34),\" \",(C31-C34)/C31*100))","v":" "},null,{"$f":"IF(ISBLANK(E31),\" \",IF(ISBLANK(E34),\" \",(E31-E34)/E31*100))","v":" "},null,{"$f":"IF(ISBLANK(G31),\" \",IF(ISBLANK(G34),\" \",(G31-G34)/G31*100))","v":" "},null,{"$f":"IF(ISBLANK(I31),\" \",IF(ISBLANK(I34),\" \",(I31-I34)/I31*100))","v":" "},null,{"$f":"IF(ISBLANK(K31),\" \",IF(ISBLANK(K34),\" \",(K31-K34)/K31*100))","v":" "},null,{"$f":"IF(ISBLANK(M31),\" \",IF(ISBLANK(M34),\" \",(M31-M34)/M31*100))","v":" "}]
["Wt. Loss",null,{"$f":"IF(ISBLANK(C30),\" \",IF(ISBLANK(C31),\" \",C30-C31))","v":" "},null,{"$f":"IF(ISBLANK(E30),\" \",IF(ISBLANK(E31),\" \",E30-E31))","v":" "},null,{"$f":"IF(ISBLANK(G30),\" \",IF(ISBLANK(G31),\" \",G30-G31))","v":" "},null,{"$f":"IF(ISBLANK(I30),\" \",IF(ISBLANK(I31),\" \",I30-I31))","v":" "},null,{"$f":"IF(ISBLANK(K30),\" \",IF(ISBLANK(K31),\" \",K30-K31))","v":" "},null,{"$f":"IF(ISBLANK(M30),\" \",IF(ISBLANK(M31),\" \",M30-M31))","v":" "}]
[null,null,"Wt","% Passing","Wt","% Passing","Wt","% Passing","Wt","% Passing","Wt","% Passing","Wt","% Passing"]
[100,0.375,null,{"$f":"IF(ISBLANK(C$30),\"  \",IF(ISBLANK(C$31),\" \",IF(ISBLANK(C34),\" \",ROUND((C34+C$32)/C$30*100,1))))","v":"  "},null,{"$f":"IF(ISBLANK(E$30),\"  \",IF(ISBLANK(E$31),\" \",IF(ISBLANK(E34),\" \",ROUND((E34+E$32)/E$30*100,1))))","v":"  "},null,{"$f":"IF(ISBLANK(G$30),\"  \",IF(ISBLANK(G$31),\" \",IF(ISBLANK(G34),\" \",ROUND((G34+G$32)/G$30*100,1))))","v":"  "},null,{"$f":"IF(ISBLANK(I$30),\"  \",IF(ISBLANK(I$31),\" \",IF(ISBLANK(I34),\" \",ROUND((I34+I$32)/I$30*100,1))))","v":"  "},null,{"$f":"IF(ISBLANK(K$30),\"  \",IF(ISBLANK(K$31),\" \",IF(ISBLANK(K34),\" \",ROUND((K34+K$32)/K$30*100,1))))","v":"  "},null,{"$f":"IF(ISBLANK(M$30),\"  \",IF(ISBLANK(M$31),\" \",IF(ISBLANK(M34),\" \",ROUND((M34+M$32)/M$30*100,1))))","v":"  "}]
["95-100",4,null,{"$f":"IF(ISBLANK(C$30),\"  \",IF(ISBLANK(C$31),\" \",IF(ISBLANK(C35),\" \",ROUND((C35+C$32)/C$30*100,0))))","v":"  "},null,{"$f":"IF(ISBLANK(E$30),\"  \",IF(ISBLANK(E$31),\" \",IF(ISBLANK(E35),\" \",ROUND((E35+E$32)/E$30*100,0))))","v":"  "},null,{"$f":"IF(ISBLANK(G$30),\"  \",IF(ISBLANK(G$31),\" \",IF(ISBLANK(G35),\" \",ROUND((G35+G$32)/G$30*100,0))))","v":"  "},null,{"$f":"IF(ISBLANK(I$30),\"  \",IF(ISBLANK(I$31),\" \",IF(ISBLANK(I35),\" \",ROUND((I35+I$32)/I$30*100,0))))","v":"  "},null,{"$f":"IF(ISBLANK(K$30),\"  \",IF(ISBLANK(K$31),\" \",IF(ISBLANK(K35),\" \",ROUND((K35+K$32)/K$30*100,0))))","v":"  "},null,{"$f":"IF(ISBLANK(M$30),\"  \",IF(ISBLANK(M$31),\" \",IF(ISBLANK(M35),\" \",ROUND((M35+M$32)/M$30*100,0))))","v":"  "}]
["70-100",8,null,"  ",null,"  ",null,"  ",null,"  ",null,"  ",null,"  "]
["45-85",16,null,"  ",null,"  ",null,"  ",null,"  ",null,"  ",null,"  "]
["25-65",30,null,"  ",null,"  ",null,"  ",null,"  ",null,"  ",null,"  "]
["10-30",50,null,"  ",null,"  ",null,"  ",null,"  ",null,"  ",null,"  "]
["0-10",100,null,"  ",null,"  ",null,"  ",null,"  ",null,"  ",null,"  "]
[3,200,null,{"$f":"IF(ISBLANK(C$30),\"  \",IF(ISBLANK(C$31),\" \",IF(ISBLANK(C41),\" \",ROUND((C41+C$32)/C$30*100,2))))","v":"  "},null,{"$f":"IF(ISBLANK(E$30),\"  \",IF(ISBLANK(E$31),\" \",IF(ISBLANK(E41),\" \",ROUND((E41+E$32)/E$30*100,2))))","v":"  "},null,{"$f":"IF(ISBLANK(G$30),\"  \",IF(ISBLANK(G$31),\" \",IF(ISBLANK(G41),\" \",ROUND((G41+G$32)/G$30*100,2))))","v":"  "},null,{"$f":"IF(ISBLANK(I$30),\"  \",IF(ISBLANK(I$31),\" \",IF(ISBLANK(I41),\" \",ROUND((I41+I$32)/I$30*100,2))))","v":"  "},null,{"$f":"IF(ISBLANK(K$30),\"  \",IF(ISBLANK(K$31),\" \",IF(ISBLANK(K41),\" \",ROUND((K41+K$32)/K$30*100,2))))","v":"  "},null,{"$f":"IF(ISBLANK(M$30),\"  \",IF(ISBLANK(M$31),\" \",IF(ISBLANK(M41),\" \",ROUND((M41+M$32)/M$30*100,2))))","v":"  "}]
["2.30-3.15","FM",{"$f":"IF(ISBLANK(C30),\" \",IF(ISBLANK(C34),\" \",(600-SUM(D35:D40))/100))","v":" "},null,{"$f":"IF(ISBLANK(E30),\" \",IF(ISBLANK(E34),\" \",(600-SUM(F35:F40))/100))","v":" "},null,{"$f":"IF(ISBLANK(G30),\" \",IF(ISBLANK(G34),\" \",(600-SUM(H35:H40))/100))","v":" "},null,{"$f":"IF(ISBLANK(I30),\" \",IF(ISBLANK(I34),\" \",(600-SUM(J35:J40))/100))","v":" "},null,{"$f":"IF(ISBLANK(K30),\" \",IF(ISBLANK(K34),\" \",(600-SUM(L35:L40))/100))","v":" "},null,{"$f":"IF(ISBLANK(M30),\" \",IF(ISBLANK(M34),\" \",(600-SUM(N35:N40))/100))","v":" "}]
["Tested By"]
["Remarks"]

{"sheet":"S10","index":9,"n_rows":44,"n_cols":14,"rows_kept":44,"cut":false,"hidden":true,"merged":[[43,0,45,1],[43,2,45,3],[43,4,45,5],[43,6,45,7],[43,8,45,9],[43,10,45,11],[43,12,45,13],[42,4,42,5],[42,6,42,7],[42,0,42,1],[42,2,42,3],[1,12,1,13],[2,10,2,11],[2,12,2,13],[3,10,3,11],[3,12,3,13],[42,8,42,9],[42,10,42,11],[22,12,22,13],[23,0,25,1],[23,2,25,3],[23,4,25,5],[23,6,25,7],[23,8,25,9],[23,10,25,11],[42,12,42,13],[7,12,7,13],[8,0,8,1],[8,2,8,3],[8,4,8,5],[8,6,8,7],[8,8,8,9],[8,10,8,11],[7,0,7,1],[4,12,4,13],[8,12,8,13],[5,3,5,8],[7,8,7,9],[5,10,5,11],[5,12,5,13],[7,2,7,3],[7,4,7,5],[7,6,7,7],[4,10,4,11],[31,0,31,1],[31,2,31,3],[41,2,41,3],[32,0,32,1],[22,10,22,11],[29,0,29,1],[28,0,28,1],[28,2,28,3],[27,0,27,1],[27,4,27,5],[27,6,27,7],[22,6,22,7],[22,8,22,9],[31,12,31,13],[41,12,41,13],[11,12,11,13],[28,8,28,9],[28,6,28,7],[27,2,27,3],[11,2,11,3],[11,4,11,5],[11,6,11,7],[21,2,21,3],[21,12,21,13],[28,12,28,13],[27,12,27,13],[23,12,25,13],[28,4,28,5],[22,2,22,3],[22,4,22,5],[21,8,21,9],[21,4,21,5],[21,6,21,7],[21,10,21,11],[11,8,11,9],[11,10,11,11],[28,10,28,11],[0,8,3,9],[1,2,1,7],[2,2,2,7],[3,2,3,7],[4,0,4,1],[41,8,41,9],[41,10,41,11],[27,10,27,11],[27,8,27,9],[31,8,31,9],[31,10,31,11],[10,0,10,1],[12,0,12,1],[22,0,22,1],[9,0,9,1],[7,10,7,11],[0,0,3,1],[1,10,1,11],[11,0,11,1],[31,4,31,5],[31,6,31,7],[41,4,41,5],[41,6,41,7],[30,0,30,1]]}
[]
[null,null,"COMMONWEALTH OF PENNSYLVANIA",null,null,null,null,null,null,null,"DISTRICT",null,{"$f":"IF(ISBLANK('S1'!M2),\" \",'S1'!M2)","v":" "}]
[null,null,"DEPARTMENT OF TRANSPORTATION",null,null,null,null,null,null,null,"PLANT CODE",null,{"$f":"IF(ISBLANK('S1'!M3),\" \",'S1'!M3)","v":" "}]
[null,null,"PENNSYLVANIA TURNPIKE COMMISSION",null,null,null,null,null,null,null,"AGG SIZE",null,{"$f":"IF(ISBLANK('S1'!M4),\" \",'S1'!M4)","v":"Type A"}]
[{"$f":"'S1'!A5","v":"Concrete 2023"},null,null,null,null,null,null,null,null,null,"FM TARGET VALUE",null,{"$f":"IF(ISBLANK('S1'!M5),\" \",'S1'!M5)","v":" "}]
[null,null,null,"Material Test Results for Type A Fine Aggregate"]
[]
["Sample No."]
["Date"]
["St. Wt. Before Wash",null,null,"% Loss",null,"% Loss",null,"% Loss",null,"% Loss",null,"% Loss",null,"% Loss"]
["Dry Wt. After Wash",null,null,{"$f":"IF(ISBLANK(C11),\" \",IF(ISBLANK(C14),\" \",(C11-C14)/C11*100))","v":" "},null,{"$f":"IF(ISBLANK(E11),\" \",IF(ISBLANK(E14),\" \",(E11-E14)/E11*100))","v":" "},null,{"$f":"IF(ISBLANK(G11),\" \",IF(ISBLANK(G14),\" \",(G11-G14)/G11*100))","v":" "},null,{"$f":"IF(ISBLANK(I11),\" \",IF(ISBLANK(I14),\" \",(I11-I14)/I11*100))","v":" "},null,{"$f":"IF(ISBLANK(K11),\" \",IF(ISBLANK(K14),\" \",(K11-K14)/K11*100))","v":" "},null,{"$f":"IF(ISBLANK(M11),\" \",IF(ISBLANK(M14),\" \",(M11-M14)/M11*100))","v":" "}]
["Wt. Loss",null,{"$f":"IF(ISBLANK(C10),\" \",IF(ISBLANK(C11),\" \",C10-C11))","v":" "},null,{"$f":"IF(ISBLANK(E10),\" \",IF(ISBLANK(E11),\" \",E10-E11))","v":" "},null,{"$f":"IF(ISBLANK(G10),\" \",IF(ISBLANK(G11),\" \",G10-G11))","v":" "},null,{"$f":"IF(ISBLANK(I10),\" \",IF(ISBLANK(I11),\" \",I10-I11))","v":" "},null,{"$f":"IF(ISBLANK(K10),\" \",IF(ISBLANK(K11),\" \",K10-K11))","v":" "},null,{"$f":"IF(ISBLANK(M10),\" \",IF(ISBLANK(M11),\" \",M10-M11))","v":" "}]
[null,null,"Wt","% Passing","Wt","% Passing","Wt","% Passing","Wt","% Passing","Wt","% Passing","Wt","% Passing"]
[100,0.375,null,{"$f":"IF(ISBLANK(C$10),\"  \",IF(ISBLANK(C$11),\" \",IF(ISBLANK(C14),\" \",ROUND((C14+C$12)/C$10*100,1))))","v":"  "},null,{"$f":"IF(ISBLANK(E$10),\"  \",IF(ISBLANK(E$11),\" \",IF(ISBLANK(E14),\" \",ROUND((E14+E$12)/E$10*100,1))))","v":"  "},null,{"$f":"IF(ISBLANK(G$10),\"  \",IF(ISBLANK(G$11),\" \",IF(ISBLANK(G14),\" \",ROUND((G14+G$12)/G$10*100,1))))","v":"  "},null,{"$f":"IF(ISBLANK(I$10),\"  \",IF(ISBLANK(I$11),\" \",IF(ISBLANK(I14),\" \",ROUND((I14+I$12)/I$10*100,1))))","v":"  "},null,{"$f":"IF(ISBLANK(K$10),\"  \",IF(ISBLANK(K$11),\" \",IF(ISBLANK(K14),\" \",ROUND((K14+K$12)/K$10*100,1))))","v":"  "},null,{"$f":"IF(ISBLANK(M$10),\"  \",IF(ISBLANK(M$11),\" \",IF(ISBLANK(M14),\" \",ROUND((M14+M$12)/M$10*100,1))))","v":"  "}]
["95-100",4,null,{"$f":"IF(ISBLANK(C$10),\"  \",IF(ISBLANK(C$11),\" \",IF(ISBLANK(C15),\" \",ROUND((C15+C$12)/C$10*100,0))))","v":"  "},null,{"$f":"IF(ISBLANK(E$10),\"  \",IF(ISBLANK(E$11),\" \",IF(ISBLANK(E15),\" \",ROUND((E15+E$12)/E$10*100,0))))","v":"  "},null,{"$f":"IF(ISBLANK(G$10),\"  \",IF(ISBLANK(G$11),\" \",IF(ISBLANK(G15),\" \",ROUND((G15+G$12)/G$10*100,0))))","v":"  "},null,{"$f":"IF(ISBLANK(I$10),\"  \",IF(ISBLANK(I$11),\" \",IF(ISBLANK(I15),\" \",ROUND((I15+I$12)/I$10*100,0))))","v":"  "},null,{"$f":"IF(ISBLANK(K$10),\"  \",IF(ISBLANK(K$11),\" \",IF(ISBLANK(K15),\" \",ROUND((K15+K$12)/K$10*100,0))))","v":"  "},null,{"$f":"IF(ISBLANK(M$10),\"  \",IF(ISBLANK(M$11),\" \",IF(ISBLANK(M15),\" \",ROUND((M15+M$12)/M$10*100,0))))","v":"  "}]
["70-100",8,null,"  ",null,"  ",null,"  ",null,"  ",null,"  ",null,"  "]
["45-85",16,null,"  ",null,"  ",null,"  ",null,"  ",null,"  ",null,"  "]
["25-65",30,null,"  ",null,"  ",null,"  ",null,"  ",null,"  ",null,"  "]
["10-30",50,null,"  ",null,"  ",null,"  ",null,"  ",null,"  ",null,"  "]
["0-10",100,null,"  ",null,"  ",null,"  ",null,"  ",null,"  ",null,"  "]
[3,200,null,{"$f":"IF(ISBLANK(C$10),\"  \",IF(ISBLANK(C$11),\" \",IF(ISBLANK(C21),\" \",ROUND((C21+C$12)/C$10*100,2))))","v":"  "},null,{"$f":"IF(ISBLANK(E$10),\"  \",IF(ISBLANK(E$11),\" \",IF(ISBLANK(E21),\" \",ROUND((E21+E$12)/E$10*100,2))))","v":"  "},null,{"$f":"IF(ISBLANK(G$10),\"  \",IF(ISBLANK(G$11),\" \",IF(ISBLANK(G21),\" \",ROUND((G21+G$12)/G$10*100,2))))","v":"  "},null,{"$f":"IF(ISBLANK(I$10),\"  \",IF(ISBLANK(I$11),\" \",IF(ISBLANK(I21),\" \",ROUND((I21+I$12)/I$10*100,2))))","v":"  "},null,{"$f":"IF(ISBLANK(K$10),\"  \",IF(ISBLANK(K$11),\" \",IF(ISBLANK(K21),\" \",ROUND((K21+K$12)/K$10*100,2))))","v":"  "},null,{"$f":"IF(ISBLANK(M$10),\"  \",IF(ISBLANK(M$11),\" \",IF(ISBLANK(M21),\" \",ROUND((M21+M$12)/M$10*100,2))))","v":"  "}]
["2.30-3.15","FM",{"$f":"IF(ISBLANK(C10),\" \",IF(ISBLANK(C14),\" \",(600-SUM(D15:D20))/100))","v":" "},null,{"$f":"IF(ISBLANK(E10),\" \",IF(ISBLANK(E14),\" \",(600-SUM(F15:F20))/100))","v":" "},null,{"$f":"IF(ISBLANK(G10),\" \",IF(ISBLANK(G14),\" \",(600-SUM(H15:H20))/100))","v":" "},null,{"$f":"IF(ISBLANK(I10),\" \",IF(ISBLANK(I14),\" \",(600-SUM(J15:J20))/100))","v":" "},null,{"$f":"IF(ISBLANK(K10),\" \",IF(ISBLANK(K14),\" \",(600-SUM(L15:L20))/100))","v":" "},null,{"$f":"IF(ISBLANK(M10),\" \",IF(ISBLANK(M14),\" \",(600-SUM(N15:N20))/100))","v":" "}]
["Tested By"]
["Remarks"]
[]
[]
[]
["Sample No."]
["Date"]
["St. Wt. Before Wash",null,null,"% Loss",null,"% Loss",null,"% Loss",null,"% Loss",null,"% Loss",null,"% Loss"]
["Dry Wt. After Wash",null,null,{"$f":"IF(ISBLANK(C31),\" \",IF(ISBLANK(C34),\" \",(C31-C34)/C31*100))","v":" "},null,{"$f":"IF(ISBLANK(E31),\" \",IF(ISBLANK(E34),\" \",(E31-E34)/E31*100))","v":" "},null,{"$f":"IF(ISBLANK(G31),\" \",IF(ISBLANK(G34),\" \",(G31-G34)/G31*100))","v":" "},null,{"$f":"IF(ISBLANK(I31),\" \",IF(ISBLANK(I34),\" \",(I31-I34)/I31*100))","v":" "},null,{"$f":"IF(ISBLANK(K31),\" \",IF(ISBLANK(K34),\" \",(K31-K34)/K31*100))","v":" "},null,{"$f":"IF(ISBLANK(M31),\" \",IF(ISBLANK(M34),\" \",(M31-M34)/M31*100))","v":" "}]
["Wt. Loss",null,{"$f":"IF(ISBLANK(C30),\" \",IF(ISBLANK(C31),\" \",C30-C31))","v":" "},null,{"$f":"IF(ISBLANK(E30),\" \",IF(ISBLANK(E31),\" \",E30-E31))","v":" "},null,{"$f":"IF(ISBLANK(G30),\" \",IF(ISBLANK(G31),\" \",G30-G31))","v":" "},null,{"$f":"IF(ISBLANK(I30),\" \",IF(ISBLANK(I31),\" \",I30-I31))","v":" "},null,{"$f":"IF(ISBLANK(K30),\" \",IF(ISBLANK(K31),\" \",K30-K31))","v":" "},null,{"$f":"IF(ISBLANK(M30),\" \",IF(ISBLANK(M31),\" \",M30-M31))","v":" "}]
[null,null,"Wt","% Passing","Wt","% Passing","Wt","% Passing","Wt","% Passing","Wt","% Passing","Wt","% Passing"]
[100,0.375,null,{"$f":"IF(ISBLANK(C$30),\"  \",IF(ISBLANK(C$31),\" \",IF(ISBLANK(C34),\" \",ROUND((C34+C$32)/C$30*100,1))))","v":"  "},null,{"$f":"IF(ISBLANK(E$30),\"  \",IF(ISBLANK(E$31),\" \",IF(ISBLANK(E34),\" \",ROUND((E34+E$32)/E$30*100,1))))","v":"  "},null,{"$f":"IF(ISBLANK(G$30),\"  \",IF(ISBLANK(G$31),\" \",IF(ISBLANK(G34),\" \",ROUND((G34+G$32)/G$30*100,1))))","v":"  "},null,{"$f":"IF(ISBLANK(I$30),\"  \",IF(ISBLANK(I$31),\" \",IF(ISBLANK(I34),\" \",ROUND((I34+I$32)/I$30*100,1))))","v":"  "},null,{"$f":"IF(ISBLANK(K$30),\"  \",IF(ISBLANK(K$31),\" \",IF(ISBLANK(K34),\" \",ROUND((K34+K$32)/K$30*100,1))))","v":"  "},null,{"$f":"IF(ISBLANK(M$30),\"  \",IF(ISBLANK(M$31),\" \",IF(ISBLANK(M34),\" \",ROUND((M34+M$32)/M$30*100,1))))","v":"  "}]
["95-100",4,null,{"$f":"IF(ISBLANK(C$30),\"  \",IF(ISBLANK(C$31),\" \",IF(ISBLANK(C35),\" \",ROUND((C35+C$32)/C$30*100,0))))","v":"  "},null,{"$f":"IF(ISBLANK(E$30),\"  \",IF(ISBLANK(E$31),\" \",IF(ISBLANK(E35),\" \",ROUND((E35+E$32)/E$30*100,0))))","v":"  "},null,{"$f":"IF(ISBLANK(G$30),\"  \",IF(ISBLANK(G$31),\" \",IF(ISBLANK(G35),\" \",ROUND((G35+G$32)/G$30*100,0))))","v":"  "},null,{"$f":"IF(ISBLANK(I$30),\"  \",IF(ISBLANK(I$31),\" \",IF(ISBLANK(I35),\" \",ROUND((I35+I$32)/I$30*100,0))))","v":"  "},null,{"$f":"IF(ISBLANK(K$30),\"  \",IF(ISBLANK(K$31),\" \",IF(ISBLANK(K35),\" \",ROUND((K35+K$32)/K$30*100,0))))","v":"  "},null,{"$f":"IF(ISBLANK(M$30),\"  \",IF(ISBLANK(M$31),\" \",IF(ISBLANK(M35),\" \",ROUND((M35+M$32)/M$30*100,0))))","v":"  "}]
["70-100",8,null,"  ",null,"  ",null,"  ",null,"  ",null,"  ",null,"  "]
["45-85",16,null,"  ",null,"  ",null,"  ",null,"  ",null,"  ",null,"  "]
["25-65",30,null,"  ",null,"  ",null,"  ",null,"  ",null,"  ",null,"  "]
["10-30",50,null,"  ",null,"  ",null,"  ",null,"  ",null,"  ",null,"  "]
["0-10",100,null,"  ",null,"  ",null,"  ",null,"  ",null,"  ",null,"  "]
[3,200,null,{"$f":"IF(ISBLANK(C$30),\"  \",IF(ISBLANK(C$31),\" \",IF(ISBLANK(C41),\" \",ROUND((C41+C$32)/C$30*100,2))))","v":"  "},null,{"$f":"IF(ISBLANK(E$30),\"  \",IF(ISBLANK(E$31),\" \",IF(ISBLANK(E41),\" \",ROUND((E41+E$32)/E$30*100,2))))","v":"  "},null,{"$f":"IF(ISBLANK(G$30),\"  \",IF(ISBLANK(G$31),\" \",IF(ISBLANK(G41),\" \",ROUND((G41+G$32)/G$30*100,2))))","v":"  "},null,{"$f":"IF(ISBLANK(I$30),\"  \",IF(ISBLANK(I$31),\" \",IF(ISBLANK(I41),\" \",ROUND((I41+I$32)/I$30*100,2))))","v":"  "},null,{"$f":"IF(ISBLANK(K$30),\"  \",IF(ISBLANK(K$31),\" \",IF(ISBLANK(K41),\" \",ROUND((K41+K$32)/K$30*100,2))))","v":"  "},null,{"$f":"IF(ISBLANK(M$30),\"  \",IF(ISBLANK(M$31),\" \",IF(ISBLANK(M41),\" \",ROUND((M41+M$32)/M$30*100,2))))","v":"  "}]
["2.30-3.15","FM",{"$f":"IF(ISBLANK(C30),\" \",IF(ISBLANK(C34),\" \",(600-SUM(D35:D40))/100))","v":" "},null,{"$f":"IF(ISBLANK(E30),\" \",IF(ISBLANK(E34),\" \",(600-SUM(F35:F40))/100))","v":" "},null,{"$f":"IF(ISBLANK(G30),\" \",IF(ISBLANK(G34),\" \",(600-SUM(H35:H40))/100))","v":" "},null,{"$f":"IF(ISBLANK(I30),\" \",IF(ISBLANK(I34),\" \",(600-SUM(J35:J40))/100))","v":" "},null,{"$f":"IF(ISBLANK(K30),\" \",IF(ISBLANK(K34),\" \",(600-SUM(L35:L40))/100))","v":" "},null,{"$f":"IF(ISBLANK(M30),\" \",IF(ISBLANK(M34),\" \",(600-SUM(N35:N40))/100))","v":" "}]
["Tested By"]
["Remarks"]

{"sheet":"S11","index":10,"n_rows":44,"n_cols":14,"rows_kept":44,"cut":false,"hidden":true,"merged":[[43,0,45,1],[43,2,45,3],[43,4,45,5],[43,6,45,7],[43,8,45,9],[43,10,45,11],[43,12,45,13],[42,4,42,5],[42,6,42,7],[42,0,42,1],[42,2,42,3],[1,12,1,13],[2,10,2,11],[2,12,2,13],[3,10,3,11],[3,12,3,13],[42,8,42,9],[42,10,42,11],[22,12,22,13],[23,0,25,1],[23,2,25,3],[23,4,25,5],[23,6,25,7],[23,8,25,9],[23,10,25,11],[42,12,42,13],[7,12,7,13],[8,0,8,1],[8,2,8,3],[8,4,8,5],[8,6,8,7],[8,8,8,9],[8,10,8,11],[7,0,7,1],[4,12,4,13],[8,12,8,13],[5,3,5,8],[7,8,7,9],[5,10,5,11],[5,12,5,13],[7,2,7,3],[7,4,7,5],[7,6,7,7],[4,10,4,11],[31,0,31,1],[31,2,31,3],[41,2,41,3],[32,0,32,1],[22,10,22,11],[29,0,29,1],[28,0,28,1],[28,2,28,3],[27,0,27,1],[27,4,27,5],[27,6,27,7],[22,6,22,7],[22,8,22,9],[31,12,31,13],[41,12,41,13],[11,12,11,13],[28,8,28,9],[28,6,28,7],[27,2,27,3],[11,2,11,3],[11,4,11,5],[11,6,11,7],[21,2,21,3],[21,12,21,13],[28,12,28,13],[27,12,27,13],[23,12,25,13],[28,4,28,5],[22,2,22,3],[22,4,22,5],[21,8,21,9],[21,4,21,5],[21,6,21,7],[21,10,21,11],[11,8,11,9],[11,10,11,11],[28,10,28,11],[0,8,3,9],[1,2,1,7],[2,2,2,7],[3,2,3,7],[4,0,4,1],[41,8,41,9],[41,10,41,11],[27,10,27,11],[27,8,27,9],[31,8,31,9],[31,10,31,11],[10,0,10,1],[12,0,12,1],[22,0,22,1],[9,0,9,1],[7,10,7,11],[0,0,3,1],[1,10,1,11],[11,0,11,1],[31,4,31,5],[31,6,31,7],[41,4,41,5],[41,6,41,7],[30,0,30,1]]}
[]
[null,null,"COMMONWEALTH OF PENNSYLVANIA",null,null,null,null,null,null,null,"DISTRICT",null,{"$f":"IF(ISBLANK('S1'!M2),\" \",'S1'!M2)","v":" "}]
[null,null,"DEPARTMENT OF TRANSPORTATION",null,null,null,null,null,null,null,"PLANT CODE",null,{"$f":"IF(ISBLANK('S1'!M3),\" \",'S1'!M3)","v":" "}]
[null,null,"PENNSYLVANIA TURNPIKE COMMISSION",null,null,null,null,null,null,null,"AGG SIZE",null,{"$f":"IF(ISBLANK('S1'!M4),\" \",'S1'!M4)","v":"Type A"}]
[{"$f":"'S1'!A5","v":"Concrete 2023"},null,null,null,null,null,null,null,null,null,"FM TARGET VALUE",null,{"$f":"IF(ISBLANK('S1'!M5),\" \",'S1'!M5)","v":" "}]
[null,null,null,"Material Test Results for Type A Fine Aggregate"]
[]
["Sample No."]
["Date"]
["St. Wt. Before Wash",null,null,"% Loss",null,"% Loss",null,"% Loss",null,"% Loss",null,"% Loss",null,"% Loss"]
["Dry Wt. After Wash",null,null,{"$f":"IF(ISBLANK(C11),\" \",IF(ISBLANK(C14),\" \",(C11-C14)/C11*100))","v":" "},null,{"$f":"IF(ISBLANK(E11),\" \",IF(ISBLANK(E14),\" \",(E11-E14)/E11*100))","v":" "},null,{"$f":"IF(ISBLANK(G11),\" \",IF(ISBLANK(G14),\" \",(G11-G14)/G11*100))","v":" "},null,{"$f":"IF(ISBLANK(I11),\" \",IF(ISBLANK(I14),\" \",(I11-I14)/I11*100))","v":" "},null,{"$f":"IF(ISBLANK(K11),\" \",IF(ISBLANK(K14),\" \",(K11-K14)/K11*100))","v":" "},null,{"$f":"IF(ISBLANK(M11),\" \",IF(ISBLANK(M14),\" \",(M11-M14)/M11*100))","v":" "}]
["Wt. Loss",null,{"$f":"IF(ISBLANK(C10),\" \",IF(ISBLANK(C11),\" \",C10-C11))","v":" "},null,{"$f":"IF(ISBLANK(E10),\" \",IF(ISBLANK(E11),\" \",E10-E11))","v":" "},null,{"$f":"IF(ISBLANK(G10),\" \",IF(ISBLANK(G11),\" \",G10-G11))","v":" "},null,{"$f":"IF(ISBLANK(I10),\" \",IF(ISBLANK(I11),\" \",I10-I11))","v":" "},null,{"$f":"IF(ISBLANK(K10),\" \",IF(ISBLANK(K11),\" \",K10-K11))","v":" "},null,{"$f":"IF(ISBLANK(M10),\" \",IF(ISBLANK(M11),\" \",M10-M11))","v":" "}]
[null,null,"Wt","% Passing","Wt","% Passing","Wt","% Passing","Wt","% Passing","Wt","% Passing","Wt","% Passing"]
[100,0.375,null,{"$f":"IF(ISBLANK(C$10),\"  \",IF(ISBLANK(C$11),\" \",IF(ISBLANK(C14),\" \",ROUND((C14+C$12)/C$10*100,1))))","v":"  "},null,{"$f":"IF(ISBLANK(E$10),\"  \",IF(ISBLANK(E$11),\" \",IF(ISBLANK(E14),\" \",ROUND((E14+E$12)/E$10*100,1))))","v":"  "},null,{"$f":"IF(ISBLANK(G$10),\"  \",IF(ISBLANK(G$11),\" \",IF(ISBLANK(G14),\" \",ROUND((G14+G$12)/G$10*100,1))))","v":"  "},null,{"$f":"IF(ISBLANK(I$10),\"  \",IF(ISBLANK(I$11),\" \",IF(ISBLANK(I14),\" \",ROUND((I14+I$12)/I$10*100,1))))","v":"  "},null,{"$f":"IF(ISBLANK(K$10),\"  \",IF(ISBLANK(K$11),\" \",IF(ISBLANK(K14),\" \",ROUND((K14+K$12)/K$10*100,1))))","v":"  "},null,{"$f":"IF(ISBLANK(M$10),\"  \",IF(ISBLANK(M$11),\" \",IF(ISBLANK(M14),\" \",ROUND((M14+M$12)/M$10*100,1))))","v":"  "}]
["95-100",4,null,{"$f":"IF(ISBLANK(C$10),\"  \",IF(ISBLANK(C$11),\" \",IF(ISBLANK(C15),\" \",ROUND((C15+C$12)/C$10*100,0))))","v":"  "},null,{"$f":"IF(ISBLANK(E$10),\"  \",IF(ISBLANK(E$11),\" \",IF(ISBLANK(E15),\" \",ROUND((E15+E$12)/E$10*100,0))))","v":"  "},null,{"$f":"IF(ISBLANK(G$10),\"  \",IF(ISBLANK(G$11),\" \",IF(ISBLANK(G15),\" \",ROUND((G15+G$12)/G$10*100,0))))","v":"  "},null,{"$f":"IF(ISBLANK(I$10),\"  \",IF(ISBLANK(I$11),\" \",IF(ISBLANK(I15),\" \",ROUND((I15+I$12)/I$10*100,0))))","v":"  "},null,{"$f":"IF(ISBLANK(K$10),\"  \",IF(ISBLANK(K$11),\" \",IF(ISBLANK(K15),\" \",ROUND((K15+K$12)/K$10*100,0))))","v":"  "},null,{"$f":"IF(ISBLANK(M$10),\"  \",IF(ISBLANK(M$11),\" \",IF(ISBLANK(M15),\" \",ROUND((M15+M$12)/M$10*100,0))))","v":"  "}]
["70-100",8,null,"  ",null,"  ",null,"  ",null,"  ",null,"  ",null,"  "]
["45-85",16,null,"  ",null,"  ",null,"  ",null,"  ",null,"  ",null,"  "]
["25-65",30,null,"  ",null,"  ",null,"  ",null,"  ",null,"  ",null,"  "]
["10-30",50,null,"  ",null,"  ",null,"  ",null,"  ",null,"  ",null,"  "]
["0-10",100,null,"  ",null,"  ",null,"  ",null,"  ",null,"  ",null,"  "]
[3,200,null,{"$f":"IF(ISBLANK(C$10),\"  \",IF(ISBLANK(C$11),\" \",IF(ISBLANK(C21),\" \",ROUND((C21+C$12)/C$10*100,2))))","v":"  "},null,{"$f":"IF(ISBLANK(E$10),\"  \",IF(ISBLANK(E$11),\" \",IF(ISBLANK(E21),\" \",ROUND((E21+E$12)/E$10*100,2))))","v":"  "},null,{"$f":"IF(ISBLANK(G$10),\"  \",IF(ISBLANK(G$11),\" \",IF(ISBLANK(G21),\" \",ROUND((G21+G$12)/G$10*100,2))))","v":"  "},null,{"$f":"IF(ISBLANK(I$10),\"  \",IF(ISBLANK(I$11),\" \",IF(ISBLANK(I21),\" \",ROUND((I21+I$12)/I$10*100,2))))","v":"  "},null,{"$f":"IF(ISBLANK(K$10),\"  \",IF(ISBLANK(K$11),\" \",IF(ISBLANK(K21),\" \",ROUND((K21+K$12)/K$10*100,2))))","v":"  "},null,{"$f":"IF(ISBLANK(M$10),\"  \",IF(ISBLANK(M$11),\" \",IF(ISBLANK(M21),\" \",ROUND((M21+M$12)/M$10*100,2))))","v":"  "}]
["2.30-3.15","FM",{"$f":"IF(ISBLANK(C10),\" \",IF(ISBLANK(C14),\" \",(600-SUM(D15:D20))/100))","v":" "},null,{"$f":"IF(ISBLANK(E10),\" \",IF(ISBLANK(E14),\" \",(600-SUM(F15:F20))/100))","v":" "},null,{"$f":"IF(ISBLANK(G10),\" \",IF(ISBLANK(G14),\" \",(600-SUM(H15:H20))/100))","v":" "},null,{"$f":"IF(ISBLANK(I10),\" \",IF(ISBLANK(I14),\" \",(600-SUM(J15:J20))/100))","v":" "},null,{"$f":"IF(ISBLANK(K10),\" \",IF(ISBLANK(K14),\" \",(600-SUM(L15:L20))/100))","v":" "},null,{"$f":"IF(ISBLANK(M10),\" \",IF(ISBLANK(M14),\" \",(600-SUM(N15:N20))/100))","v":" "}]
["Tested By"]
["Remarks"]
[]
[]
[]
["Sample No."]
["Date"]
["St. Wt. Before Wash",null,null,"% Loss",null,"% Loss",null,"% Loss",null,"% Loss",null,"% Loss",null,"% Loss"]
["Dry Wt. After Wash",null,null,{"$f":"IF(ISBLANK(C31),\" \",IF(ISBLANK(C34),\" \",(C31-C34)/C31*100))","v":" "},null,{"$f":"IF(ISBLANK(E31),\" \",IF(ISBLANK(E34),\" \",(E31-E34)/E31*100))","v":" "},null,{"$f":"IF(ISBLANK(G31),\" \",IF(ISBLANK(G34),\" \",(G31-G34)/G31*100))","v":" "},null,{"$f":"IF(ISBLANK(I31),\" \",IF(ISBLANK(I34),\" \",(I31-I34)/I31*100))","v":" "},null,{"$f":"IF(ISBLANK(K31),\" \",IF(ISBLANK(K34),\" \",(K31-K34)/K31*100))","v":" "},null,{"$f":"IF(ISBLANK(M31),\" \",IF(ISBLANK(M34),\" \",(M31-M34)/M31*100))","v":" "}]
["Wt. Loss",null,{"$f":"IF(ISBLANK(C30),\" \",IF(ISBLANK(C31),\" \",C30-C31))","v":" "},null,{"$f":"IF(ISBLANK(E30),\" \",IF(ISBLANK(E31),\" \",E30-E31))","v":" "},null,{"$f":"IF(ISBLANK(G30),\" \",IF(ISBLANK(G31),\" \",G30-G31))","v":" "},null,{"$f":"IF(ISBLANK(I30),\" \",IF(ISBLANK(I31),\" \",I30-I31))","v":" "},null,{"$f":"IF(ISBLANK(K30),\" \",IF(ISBLANK(K31),\" \",K30-K31))","v":" "},null,{"$f":"IF(ISBLANK(M30),\" \",IF(ISBLANK(M31),\" \",M30-M31))","v":" "}]
[null,null,"Wt","% Passing","Wt","% Passing","Wt","% Passing","Wt","% Passing","Wt","% Passing","Wt","% Passing"]
[100,0.375,null,{"$f":"IF(ISBLANK(C$30),\"  \",IF(ISBLANK(C$31),\" \",IF(ISBLANK(C34),\" \",ROUND((C34+C$32)/C$30*100,1))))","v":"  "},null,{"$f":"IF(ISBLANK(E$30),\"  \",IF(ISBLANK(E$31),\" \",IF(ISBLANK(E34),\" \",ROUND((E34+E$32)/E$30*100,1))))","v":"  "},null,{"$f":"IF(ISBLANK(G$30),\"  \",IF(ISBLANK(G$31),\" \",IF(ISBLANK(G34),\" \",ROUND((G34+G$32)/G$30*100,1))))","v":"  "},null,{"$f":"IF(ISBLANK(I$30),\"  \",IF(ISBLANK(I$31),\" \",IF(ISBLANK(I34),\" \",ROUND((I34+I$32)/I$30*100,1))))","v":"  "},null,{"$f":"IF(ISBLANK(K$30),\"  \",IF(ISBLANK(K$31),\" \",IF(ISBLANK(K34),\" \",ROUND((K34+K$32)/K$30*100,1))))","v":"  "},null,{"$f":"IF(ISBLANK(M$30),\"  \",IF(ISBLANK(M$31),\" \",IF(ISBLANK(M34),\" \",ROUND((M34+M$32)/M$30*100,1))))","v":"  "}]
["95-100",4,null,{"$f":"IF(ISBLANK(C$30),\"  \",IF(ISBLANK(C$31),\" \",IF(ISBLANK(C35),\" \",ROUND((C35+C$32)/C$30*100,0))))","v":"  "},null,{"$f":"IF(ISBLANK(E$30),\"  \",IF(ISBLANK(E$31),\" \",IF(ISBLANK(E35),\" \",ROUND((E35+E$32)/E$30*100,0))))","v":"  "},null,{"$f":"IF(ISBLANK(G$30),\"  \",IF(ISBLANK(G$31),\" \",IF(ISBLANK(G35),\" \",ROUND((G35+G$32)/G$30*100,0))))","v":"  "},null,{"$f":"IF(ISBLANK(I$30),\"  \",IF(ISBLANK(I$31),\" \",IF(ISBLANK(I35),\" \",ROUND((I35+I$32)/I$30*100,0))))","v":"  "},null,{"$f":"IF(ISBLANK(K$30),\"  \",IF(ISBLANK(K$31),\" \",IF(ISBLANK(K35),\" \",ROUND((K35+K$32)/K$30*100,0))))","v":"  "},null,{"$f":"IF(ISBLANK(M$30),\"  \",IF(ISBLANK(M$31),\" \",IF(ISBLANK(M35),\" \",ROUND((M35+M$32)/M$30*100,0))))","v":"  "}]
["70-100",8,null,"  ",null,"  ",null,"  ",null,"  ",null,"  ",null,"  "]
["45-85",16,null,"  ",null,"  ",null,"  ",null,"  ",null,"  ",null,"  "]
["25-65",30,null,"  ",null,"  ",null,"  ",null,"  ",null,"  ",null,"  "]
["10-30",50,null,"  ",null,"  ",null,"  ",null,"  ",null,"  ",null,"  "]
["0-10",100,null,"  ",null,"  ",null,"  ",null,"  ",null,"  ",null,"  "]
[3,200,null,{"$f":"IF(ISBLANK(C$30),\"  \",IF(ISBLANK(C$31),\" \",IF(ISBLANK(C41),\" \",ROUND((C41+C$32)/C$30*100,2))))","v":"  "},null,{"$f":"IF(ISBLANK(E$30),\"  \",IF(ISBLANK(E$31),\" \",IF(ISBLANK(E41),\" \",ROUND((E41+E$32)/E$30*100,2))))","v":"  "},null,{"$f":"IF(ISBLANK(G$30),\"  \",IF(ISBLANK(G$31),\" \",IF(ISBLANK(G41),\" \",ROUND((G41+G$32)/G$30*100,2))))","v":"  "},null,{"$f":"IF(ISBLANK(I$30),\"  \",IF(ISBLANK(I$31),\" \",IF(ISBLANK(I41),\" \",ROUND((I41+I$32)/I$30*100,2))))","v":"  "},null,{"$f":"IF(ISBLANK(K$30),\"  \",IF(ISBLANK(K$31),\" \",IF(ISBLANK(K41),\" \",ROUND((K41+K$32)/K$30*100,2))))","v":"  "},null,{"$f":"IF(ISBLANK(M$30),\"  \",IF(ISBLANK(M$31),\" \",IF(ISBLANK(M41),\" \",ROUND((M41+M$32)/M$30*100,2))))","v":"  "}]
["2.30-3.15","FM",{"$f":"IF(ISBLANK(C30),\" \",IF(ISBLANK(C34),\" \",(600-SUM(D35:D40))/100))","v":" "},null,{"$f":"IF(ISBLANK(E30),\" \",IF(ISBLANK(E34),\" \",(600-SUM(F35:F40))/100))","v":" "},null,{"$f":"IF(ISBLANK(G30),\" \",IF(ISBLANK(G34),\" \",(600-SUM(H35:H40))/100))","v":" "},null,{"$f":"IF(ISBLANK(I30),\" \",IF(ISBLANK(I34),\" \",(600-SUM(J35:J40))/100))","v":" "},null,{"$f":"IF(ISBLANK(K30),\" \",IF(ISBLANK(K34),\" \",(600-SUM(L35:L40))/100))","v":" "},null,{"$f":"IF(ISBLANK(M30),\" \",IF(ISBLANK(M34),\" \",(600-SUM(N35:N40))/100))","v":" "}]
["Tested By"]
["Remarks"]

{"sheet":"S12","index":11,"n_rows":44,"n_cols":14,"rows_kept":44,"cut":false,"hidden":true,"merged":[[43,0,45,1],[43,2,45,3],[43,4,45,5],[43,6,45,7],[42,6,42,7],[42,8,42,9],[42,0,42,1],[42,2,42,3],[42,4,42,5],[42,10,42,11],[42,12,42,13],[43,8,45,9],[43,10,45,11],[43,12,45,13],[23,10,25,11],[23,12,25,13],[31,10,31,11],[27,8,27,9],[27,10,27,11],[32,0,32,1],[28,12,28,13],[28,0,28,1],[28,2,28,3],[28,4,28,5],[28,6,28,7],[28,8,28,9],[28,10,28,11],[31,12,31,13],[31,8,31,9],[31,0,31,1],[31,2,31,3],[30,0,30,1],[29,0,29,1],[0,0,3,1],[7,8,7,9],[0,8,3,9],[1,2,1,7],[2,2,2,7],[1,10,1,11],[1,12,1,13],[2,10,2,11],[2,12,2,13],[3,10,3,11],[3,12,3,13],[3,2,3,7],[4,0,4,1],[41,2,41,3],[41,4,41,5],[41,6,41,7],[41,8,41,9],[41,10,41,11],[41,12,41,13],[5,10,5,11],[5,12,5,13],[8,4,8,5],[8,6,8,7],[8,8,8,9],[8,10,8,11],[7,2,7,3],[7,4,7,5],[7,6,7,7],[22,2,22,3],[22,4,22,5],[21,2,21,3],[23,8,25,9],[21,8,21,9],[23,2,25,3],[23,4,25,5],[31,4,31,5],[31,6,31,7],[23,6,25,7],[10,0,10,1],[9,0,9,1],[12,0,12,1],[22,0,22,1],[23,0,25,1],[27,12,27,13],[27,2,27,3],[27,6,27,7],[27,0,27,1],[27,4,27,5],[21,12,21,13],[22,6,22,7],[22,8,22,9],[22,10,22,11],[22,12,22,13],[21,10,21,11],[11,10,11,11],[11,12,11,13],[11,0,11,1],[11,2,11,3],[11,4,11,5],[11,6,11,7],[11,8,11,9],[21,4,21,5],[21,6,21,7],[8,0,8,1],[8,2,8,3],[4,12,4,13],[7,10,7,11],[7,12,7,13],[4,10,4,11],[8,12,8,13],[5,3,5,8],[7,0,7,1]]}
[]
[null,null,"COMMONWEALTH OF PENNSYLVANIA",null,null,null,null,null,null,null,"DISTRICT",null,{"$f":"IF(ISBLANK('S1'!M2),\" \",'S1'!M2)","v":" "}]
[null,null,"DEPARTMENT OF TRANSPORTATION",null,null,null,null,null,null,null,"PLANT CODE",null,{"$f":"IF(ISBLANK('S1'!M3),\" \",'S1'!M3)","v":" "}]
[null,null,"PENNSYLVANIA TURNPIKE COMMISSION",null,null,null,null,null,null,null,"AGG SIZE",null,{"$f":"IF(ISBLANK('S1'!M4),\" \",'S1'!M4)","v":"Type A"}]
[{"$f":"'S1'!A5","v":"Concrete 2023"},null,null,null,null,null,null,null,null,null,"FM TARGET VALUE",null,{"$f":"IF(ISBLANK('S1'!M5),\" \",'S1'!M5)","v":" "}]
[null,null,null,"Material Test Results for Type A Fine Aggregate"]
[]
["Sample No."]
["Date"]
["St. Wt. Before Wash",null,null,"% Loss",null,"% Loss",null,"% Loss",null,"% Loss",null,"% Loss",null,"% Loss"]
["Dry Wt. After Wash",null,null,{"$f":"IF(ISBLANK(C11),\" \",IF(ISBLANK(C14),\" \",(C11-C14)/C11*100))","v":" "},null,{"$f":"IF(ISBLANK(E11),\" \",IF(ISBLANK(E14),\" \",(E11-E14)/E11*100))","v":" "},null,{"$f":"IF(ISBLANK(G11),\" \",IF(ISBLANK(G14),\" \",(G11-G14)/G11*100))","v":" "},null,{"$f":"IF(ISBLANK(I11),\" \",IF(ISBLANK(I14),\" \",(I11-I14)/I11*100))","v":" "},null,{"$f":"IF(ISBLANK(K11),\" \",IF(ISBLANK(K14),\" \",(K11-K14)/K11*100))","v":" "},null,{"$f":"IF(ISBLANK(M11),\" \",IF(ISBLANK(M14),\" \",(M11-M14)/M11*100))","v":" "}]
["Wt. Loss",null,{"$f":"IF(ISBLANK(C10),\" \",IF(ISBLANK(C11),\" \",C10-C11))","v":" "},null,{"$f":"IF(ISBLANK(E10),\" \",IF(ISBLANK(E11),\" \",E10-E11))","v":" "},null,{"$f":"IF(ISBLANK(G10),\" \",IF(ISBLANK(G11),\" \",G10-G11))","v":" "},null,{"$f":"IF(ISBLANK(I10),\" \",IF(ISBLANK(I11),\" \",I10-I11))","v":" "},null,{"$f":"IF(ISBLANK(K10),\" \",IF(ISBLANK(K11),\" \",K10-K11))","v":" "},null,{"$f":"IF(ISBLANK(M10),\" \",IF(ISBLANK(M11),\" \",M10-M11))","v":" "}]
[null,null,"Wt","% Passing","Wt","% Passing","Wt","% Passing","Wt","% Passing","Wt","% Passing","Wt","% Passing"]
[100,0.375,null,{"$f":"IF(ISBLANK(C$10),\"  \",IF(ISBLANK(C$11),\" \",IF(ISBLANK(C14),\" \",ROUND((C14+C$12)/C$10*100,1))))","v":"  "},null,{"$f":"IF(ISBLANK(E$10),\"  \",IF(ISBLANK(E$11),\" \",IF(ISBLANK(E14),\" \",ROUND((E14+E$12)/E$10*100,1))))","v":"  "},null,{"$f":"IF(ISBLANK(G$10),\"  \",IF(ISBLANK(G$11),\" \",IF(ISBLANK(G14),\" \",ROUND((G14+G$12)/G$10*100,1))))","v":"  "},null,{"$f":"IF(ISBLANK(I$10),\"  \",IF(ISBLANK(I$11),\" \",IF(ISBLANK(I14),\" \",ROUND((I14+I$12)/I$10*100,1))))","v":"  "},null,{"$f":"IF(ISBLANK(K$10),\"  \",IF(ISBLANK(K$11),\" \",IF(ISBLANK(K14),\" \",ROUND((K14+K$12)/K$10*100,1))))","v":"  "},null,{"$f":"IF(ISBLANK(M$10),\"  \",IF(ISBLANK(M$11),\" \",IF(ISBLANK(M14),\" \",ROUND((M14+M$12)/M$10*100,1))))","v":"  "}]
["95-100",4,null,{"$f":"IF(ISBLANK(C$10),\"  \",IF(ISBLANK(C$11),\" \",IF(ISBLANK(C15),\" \",ROUND((C15+C$12)/C$10*100,0))))","v":"  "},null,{"$f":"IF(ISBLANK(E$10),\"  \",IF(ISBLANK(E$11),\" \",IF(ISBLANK(E15),\" \",ROUND((E15+E$12)/E$10*100,0))))","v":"  "},null,{"$f":"IF(ISBLANK(G$10),\"  \",IF(ISBLANK(G$11),\" \",IF(ISBLANK(G15),\" \",ROUND((G15+G$12)/G$10*100,0))))","v":"  "},null,{"$f":"IF(ISBLANK(I$10),\"  \",IF(ISBLANK(I$11),\" \",IF(ISBLANK(I15),\" \",ROUND((I15+I$12)/I$10*100,0))))","v":"  "},null,{"$f":"IF(ISBLANK(K$10),\"  \",IF(ISBLANK(K$11),\" \",IF(ISBLANK(K15),\" \",ROUND((K15+K$12)/K$10*100,0))))","v":"  "},null,{"$f":"IF(ISBLANK(M$10),\"  \",IF(ISBLANK(M$11),\" \",IF(ISBLANK(M15),\" \",ROUND((M15+M$12)/M$10*100,0))))","v":"  "}]
["70-100",8,null,"  ",null,"  ",null,"  ",null,"  ",null,"  ",null,"  "]
["45-85",16,null,"  ",null,"  ",null,"  ",null,"  ",null,"  ",null,"  "]
["25-65",30,null,"  ",null,"  ",null,"  ",null,"  ",null,"  ",null,"  "]
["10-30",50,null,"  ",null,"  ",null,"  ",null,"  ",null,"  ",null,"  "]
["0-10",100,null,"  ",null,"  ",null,"  ",null,"  ",null,"  ",null,"  "]
[3,200,null,{"$f":"IF(ISBLANK(C$10),\"  \",IF(ISBLANK(C$11),\" \",IF(ISBLANK(C21),\" \",ROUND((C21+C$12)/C$10*100,2))))","v":"  "},null,{"$f":"IF(ISBLANK(E$10),\"  \",IF(ISBLANK(E$11),\" \",IF(ISBLANK(E21),\" \",ROUND((E21+E$12)/E$10*100,2))))","v":"  "},null,{"$f":"IF(ISBLANK(G$10),\"  \",IF(ISBLANK(G$11),\" \",IF(ISBLANK(G21),\" \",ROUND((G21+G$12)/G$10*100,2))))","v":"  "},null,{"$f":"IF(ISBLANK(I$10),\"  \",IF(ISBLANK(I$11),\" \",IF(ISBLANK(I21),\" \",ROUND((I21+I$12)/I$10*100,2))))","v":"  "},null,{"$f":"IF(ISBLANK(K$10),\"  \",IF(ISBLANK(K$11),\" \",IF(ISBLANK(K21),\" \",ROUND((K21+K$12)/K$10*100,2))))","v":"  "},null,{"$f":"IF(ISBLANK(M$10),\"  \",IF(ISBLANK(M$11),\" \",IF(ISBLANK(M21),\" \",ROUND((M21+M$12)/M$10*100,2))))","v":"  "}]
["2.30-3.15","FM",{"$f":"IF(ISBLANK(C10),\" \",IF(ISBLANK(C14),\" \",(600-SUM(D15:D20))/100))","v":" "},null,{"$f":"IF(ISBLANK(E10),\" \",IF(ISBLANK(E14),\" \",(600-SUM(F15:F20))/100))","v":" "},null,{"$f":"IF(ISBLANK(G10),\" \",IF(ISBLANK(G14),\" \",(600-SUM(H15:H20))/100))","v":" "},null,{"$f":"IF(ISBLANK(I10),\" \",IF(ISBLANK(I14),\" \",(600-SUM(J15:J20))/100))","v":" "},null,{"$f":"IF(ISBLANK(K10),\" \",IF(ISBLANK(K14),\" \",(600-SUM(L15:L20))/100))","v":" "},null,{"$f":"IF(ISBLANK(M10),\" \",IF(ISBLANK(M14),\" \",(600-SUM(N15:N20))/100))","v":" "}]
["Tested By"]
["Remarks"]
[]
[]
[]
["Sample No."]
["Date"]
["St. Wt. Before Wash",null,null,"% Loss",null,"% Loss",null,"% Loss",null,"% Loss",null,"% Loss",null,"% Loss"]
["Dry Wt. After Wash",null,null,{"$f":"IF(ISBLANK(C31),\" \",IF(ISBLANK(C34),\" \",(C31-C34)/C31*100))","v":" "},null,{"$f":"IF(ISBLANK(E31),\" \",IF(ISBLANK(E34),\" \",(E31-E34)/E31*100))","v":" "},null,{"$f":"IF(ISBLANK(G31),\" \",IF(ISBLANK(G34),\" \",(G31-G34)/G31*100))","v":" "},null,{"$f":"IF(ISBLANK(I31),\" \",IF(ISBLANK(I34),\" \",(I31-I34)/I31*100))","v":" "},null,{"$f":"IF(ISBLANK(K31),\" \",IF(ISBLANK(K34),\" \",(K31-K34)/K31*100))","v":" "},null,{"$f":"IF(ISBLANK(M31),\" \",IF(ISBLANK(M34),\" \",(M31-M34)/M31*100))","v":" "}]
["Wt. Loss",null,{"$f":"IF(ISBLANK(C30),\" \",IF(ISBLANK(C31),\" \",C30-C31))","v":" "},null,{"$f":"IF(ISBLANK(E30),\" \",IF(ISBLANK(E31),\" \",E30-E31))","v":" "},null,{"$f":"IF(ISBLANK(G30),\" \",IF(ISBLANK(G31),\" \",G30-G31))","v":" "},null,{"$f":"IF(ISBLANK(I30),\" \",IF(ISBLANK(I31),\" \",I30-I31))","v":" "},null,{"$f":"IF(ISBLANK(K30),\" \",IF(ISBLANK(K31),\" \",K30-K31))","v":" "},null,{"$f":"IF(ISBLANK(M30),\" \",IF(ISBLANK(M31),\" \",M30-M31))","v":" "}]
[null,null,"Wt","% Passing","Wt","% Passing","Wt","% Passing","Wt","% Passing","Wt","% Passing","Wt","% Passing"]
[100,0.375,null,{"$f":"IF(ISBLANK(C$30),\"  \",IF(ISBLANK(C$31),\" \",IF(ISBLANK(C34),\" \",ROUND((C34+C$32)/C$30*100,1))))","v":"  "},null,{"$f":"IF(ISBLANK(E$30),\"  \",IF(ISBLANK(E$31),\" \",IF(ISBLANK(E34),\" \",ROUND((E34+E$32)/E$30*100,1))))","v":"  "},null,{"$f":"IF(ISBLANK(G$30),\"  \",IF(ISBLANK(G$31),\" \",IF(ISBLANK(G34),\" \",ROUND((G34+G$32)/G$30*100,1))))","v":"  "},null,{"$f":"IF(ISBLANK(I$30),\"  \",IF(ISBLANK(I$31),\" \",IF(ISBLANK(I34),\" \",ROUND((I34+I$32)/I$30*100,1))))","v":"  "},null,{"$f":"IF(ISBLANK(K$30),\"  \",IF(ISBLANK(K$31),\" \",IF(ISBLANK(K34),\" \",ROUND((K34+K$32)/K$30*100,1))))","v":"  "},null,{"$f":"IF(ISBLANK(M$30),\"  \",IF(ISBLANK(M$31),\" \",IF(ISBLANK(M34),\" \",ROUND((M34+M$32)/M$30*100,1))))","v":"  "}]
["95-100",4,null,{"$f":"IF(ISBLANK(C$30),\"  \",IF(ISBLANK(C$31),\" \",IF(ISBLANK(C35),\" \",ROUND((C35+C$32)/C$30*100,0))))","v":"  "},null,{"$f":"IF(ISBLANK(E$30),\"  \",IF(ISBLANK(E$31),\" \",IF(ISBLANK(E35),\" \",ROUND((E35+E$32)/E$30*100,0))))","v":"  "},null,{"$f":"IF(ISBLANK(G$30),\"  \",IF(ISBLANK(G$31),\" \",IF(ISBLANK(G35),\" \",ROUND((G35+G$32)/G$30*100,0))))","v":"  "},null,{"$f":"IF(ISBLANK(I$30),\"  \",IF(ISBLANK(I$31),\" \",IF(ISBLANK(I35),\" \",ROUND((I35+I$32)/I$30*100,0))))","v":"  "},null,{"$f":"IF(ISBLANK(K$30),\"  \",IF(ISBLANK(K$31),\" \",IF(ISBLANK(K35),\" \",ROUND((K35+K$32)/K$30*100,0))))","v":"  "},null,{"$f":"IF(ISBLANK(M$30),\"  \",IF(ISBLANK(M$31),\" \",IF(ISBLANK(M35),\" \",ROUND((M35+M$32)/M$30*100,0))))","v":"  "}]
["70-100",8,null,"  ",null,"  ",null,"  ",null,"  ",null,"  ",null,"  "]
["45-85",16,null,"  ",null,"  ",null,"  ",null,"  ",null,"  ",null,"  "]
["25-65",30,null,"  ",null,"  ",null,"  ",null,"  ",null,"  ",null,"  "]
["10-30",50,null,"  ",null,"  ",null,"  ",null,"  ",null,"  ",null,"  "]
["0-10",100,null,"  ",null,"  ",null,"  ",null,"  ",null,"  ",null,"  "]
[3,200,null,{"$f":"IF(ISBLANK(C$30),\"  \",IF(ISBLANK(C$31),\" \",IF(ISBLANK(C41),\" \",ROUND((C41+C$32)/C$30*100,2))))","v":"  "},null,{"$f":"IF(ISBLANK(E$30),\"  \",IF(ISBLANK(E$31),\" \",IF(ISBLANK(E41),\" \",ROUND((E41+E$32)/E$30*100,2))))","v":"  "},null,{"$f":"IF(ISBLANK(G$30),\"  \",IF(ISBLANK(G$31),\" \",IF(ISBLANK(G41),\" \",ROUND((G41+G$32)/G$30*100,2))))","v":"  "},null,{"$f":"IF(ISBLANK(I$30),\"  \",IF(ISBLANK(I$31),\" \",IF(ISBLANK(I41),\" \",ROUND((I41+I$32)/I$30*100,2))))","v":"  "},null,{"$f":"IF(ISBLANK(K$30),\"  \",IF(ISBLANK(K$31),\" \",IF(ISBLANK(K41),\" \",ROUND((K41+K$32)/K$30*100,2))))","v":"  "},null,{"$f":"IF(ISBLANK(M$30),\"  \",IF(ISBLANK(M$31),\" \",IF(ISBLANK(M41),\" \",ROUND((M41+M$32)/M$30*100,2))))","v":"  "}]
["2.30-3.15","FM",{"$f":"IF(ISBLANK(C30),\" \",IF(ISBLANK(C34),\" \",(600-SUM(D35:D40))/100))","v":" "},null,{"$f":"IF(ISBLANK(E30),\" \",IF(ISBLANK(E34),\" \",(600-SUM(F35:F40))/100))","v":" "},null,{"$f":"IF(ISBLANK(G30),\" \",IF(ISBLANK(G34),\" \",(600-SUM(H35:H40))/100))","v":" "},null,{"$f":"IF(ISBLANK(I30),\" \",IF(ISBLANK(I34),\" \",(600-SUM(J35:J40))/100))","v":" "},null,{"$f":"IF(ISBLANK(K30),\" \",IF(ISBLANK(K34),\" \",(600-SUM(L35:L40))/100))","v":" "},null,{"$f":"IF(ISBLANK(M30),\" \",IF(ISBLANK(M34),\" \",(600-SUM(N35:N40))/100))","v":" "}]
["Tested By"]
["Remarks"]

{"sheet":"QA Samples","index":12,"n_rows":44,"n_cols":15,"rows_kept":44,"cut":false,"hidden":false,"merged":[[31,0,31,1],[31,8,31,9],[34,19,34,21],[41,12,41,13],[29,0,29,1],[29,6,30,6],[21,10,21,11],[21,12,21,13],[31,2,31,3],[31,4,31,5],[31,10,31,11],[31,12,31,13],[41,2,41,3],[41,4,41,5],[41,10,41,11],[21,4,21,5],[21,2,21,3],[29,8,29,9],[29,14,30,14],[30,0,30,1],[30,8,30,9],[27,19,27,21],[28,0,28,1],[28,2,28,3],[42,19,42,21],[43,0,45,1],[43,2,45,3],[43,4,45,5],[43,6,45,6],[43,8,45,9],[43,10,45,11],[43,12,45,13],[43,14,45,14],[42,0,42,1],[42,2,42,3],[42,4,42,5],[42,8,42,9],[42,10,42,11],[42,12,42,13],[28,4,28,5],[28,8,28,9],[28,10,28,11],[28,12,28,13],[23,14,25,14],[27,0,27,1],[27,2,27,3],[27,4,27,5],[27,8,27,9],[27,10,27,11],[27,12,27,13],[22,10,22,11],[22,12,22,13],[23,0,25,1],[23,2,25,3],[23,4,25,5],[23,6,25,6],[23,8,25,9],[23,10,25,11],[23,12,25,13],[22,0,22,1],[22,2,22,3],[22,4,22,5],[22,8,22,9],[13,19,13,21],[20,19,20,21],[9,0,9,1],[9,6,10,6],[9,8,9,9],[9,14,10,14],[10,0,10,1],[10,8,10,9],[8,0,8,1],[8,2,8,3],[8,4,8,5],[8,8,8,9],[8,10,8,11],[8,12,8,13],[11,0,11,1],[11,10,11,11],[11,12,11,13],[11,2,11,3],[11,4,11,5],[11,8,11,9],[5,19,5,21],[7,0,7,1],[7,2,7,3],[7,4,7,5],[7,8,7,9],[7,10,7,11],[7,12,7,13],[3,13,3,14],[4,0,4,1],[4,11,4,12],[4,13,4,14],[5,2,5,10],[5,11,5,12],[5,13,5,14],[0,0,3,1],[0,9,3,10],[1,2,1,8],[1,11,1,12],[1,13,1,14],[2,2,2,8],[2,11,2,12],[2,13,2,14],[3,2,3,8],[3,11,3,12]]}
[]
[null,null,"COMMONWEALTH OF PENNSYLVANIA",null,null,null,null,null,null,null,null,"DISTRICT",null,{"$f":"'S1'!M2","v":0}]
[null,null,"DEPARTMENT OF TRANSPORTATION",null,null,null,null,null,null,null,null,"PLANT CODE",null,{"$f":"'S1'!M3","v":0}]
[null,null,"PENNSYLVANIA TURNPIKE COMMISSION",null,null,null,null,null,null,null,null,"AGG SIZE",null,{"$f":"'S1'!M4","v":"Type A"}]
[{"$f":"'S1'!A5:B5","v":"Concrete 2023"},null,null,null,null,null,null,null,null,null,null,"#50 Target Value",null,{"$f":"'S1'!M5","v":0}]
[null,null,"INDEPENDENT ASSURANCE SAMPLES AND CHARTS",null,null,null,null,null,null,null,null,"FM Target Value",null,{"$f":"'S1'!M6","v":0}]
[]
["Tested By:",null,"Producer",null,"Inspector",null,"MTD",null,"Tested By:",null,"Producer",null,"Inspector",null,"MTD"]
["Date",null,null,null,null,null,null,null,"Date"]
["St Wt Before Wash",null,null,"% Loss",null,"% Loss","Enter MTD results",null,"St Wt Before Wash",null,null,"% Loss",null,"% Loss","Enter MTD results"]
["Dry Wt After Wash",null,null,{"$f":"IF(ISBLANK(C10),\" \",IF(ISBLANK(C11),\" \",((C10-C11)/C10)*100))","v":" "},null,{"$f":"IF(ISBLANK(E10),\" \",IF(ISBLANK(E11),\" \",((E10-E11)/E10)*100))","v":" "},null,null,"Dry Wt After Wash",null,null,{"$f":"IF(ISBLANK(K10),\" \",IF(ISBLANK(K11),\" \",((K10-K11)/K10)*100))","v":" "},null,{"$f":"IF(ISBLANK(M10),\" \",IF(ISBLANK(M11),\" \",((M10-M11)/M10)*100))","v":" "}]
["Wt. Loss",null,{"$f":"IF(ISBLANK(C10),\" \",IF(ISBLANK(C11),\" \",C10-C11))","v":" "},null,{"$f":"IF(ISBLANK(E10),\" \",IF(ISBLANK(E11),\" \",E10-E11))","v":" "},null,null,null,"Wt. Loss",null,{"$f":"IF(ISBLANK(K10),\" \",IF(ISBLANK(K11),\" \",K10-K11))","v":" "},null,{"$f":"IF(ISBLANK(M10),\" \",IF(ISBLANK(M11),\" \",M10-M11))","v":" "}]
["Spec","Sieve","Wt.","% Passing","Wt.","% Passing","% Passing",null,"Spec","Sieve","Wt.","% Passing","Wt.","% Passing","% Passing"]
[{"$f":"'S1'!A14","v":100},{"$f":"'S1'!B14","v":0.375},null,{"$f":"IF(ISBLANK(C$10),\"  \",IF(ISBLANK(C$11),\" \",IF(ISBLANK(C14),\" \",ROUND((C14+C$12)/C$10*100,1))))","v":"  "},null,{"$f":"IF(ISBLANK(E$10),\"  \",IF(ISBLANK(E$11),\" \",IF(ISBLANK(E14),\" \",ROUND((E14+E$12)/E$10*100,1))))","v":"  "},null,null,{"$f":"'S1'!A14","v":100},{"$f":"'S1'!B14","v":0.375},null,{"$f":"IF(ISBLANK(K$10),\"  \",IF(ISBLANK(K$11),\" \",IF(ISBLANK(K14),\" \",ROUND((K14+K$12)/K$10*100,1))))","v":"  "},null,{"$f":"IF(ISBLANK(M$10),\"  \",IF(ISBLANK(M$11),\" \",IF(ISBLANK(M14),\" \",ROUND((M14+M$12)/M$10*100,1))))","v":"  "}]
[{"$f":"'S1'!A15","v":"95-100"},{"$f":"'S1'!B15","v":4},null,{"$f":"IF(ISBLANK(C$10),\"  \",IF(ISBLANK(C$11),\" \",IF(ISBLANK(C15),\" \",ROUND((C15+C$12)/C$10*100,0))))","v":"  "},null,"  ",null,null,{"$f":"'S1'!A15","v":"95-100"},{"$f":"'S1'!B15","v":4},null,{"$f":"IF(ISBLANK(K$10),\"  \",IF(ISBLANK(K$11),\" \",IF(ISBLANK(K15),\" \",ROUND((K15+K$12)/K$10*100,0))))","v":"  "},null,{"$f":"IF(ISBLANK(M$10),\"  \",IF(ISBLANK(M$11),\" \",IF(ISBLANK(M15),\" \",ROUND((M15+M$12)/M$10*100,0))))","v":"  "}]
[{"$f":"'S1'!A16","v":"70-100"},{"$f":"'S1'!B16","v":8},null,"  ",null,"  ",null,null,{"$f":"'S1'!A16","v":"70-100"},{"$f":"'S1'!B16","v":8},null,"  ",null,"  "]
[{"$f":"'S1'!A17","v":"45-85"},{"$f":"'S1'!B17","v":16},null,"  ",null,"  ",null,null,{"$f":"'S1'!A17","v":"45-85"},{"$f":"'S1'!B17","v":16},null,"  ",null,"  "]
[{"$f":"'S1'!A18","v":"25-65"},{"$f":"'S1'!B18","v":30},null,"  ",null,"  ",null,null,{"$f":"'S1'!A18","v":"25-65"},{"$f":"'S1'!B18","v":30},null,"  ",null,"  "]
[{"$f":"'S1'!A19","v":"10-30"},{"$f":"'S1'!B19","v":50},null,"  ",null,"  ",null,null,{"$f":"'S1'!A19","v":"10-30"},{"$f":"'S1'!B19","v":50},null,"  ",null,"  "]
[{"$f":"'S1'!A20","v":"0-10"},{"$f":"'S1'!B20","v":100},null,"  ",null,"  ",null,null,{"$f":"'S1'!A20","v":"0-10"},{"$f":"'S1'!B20","v":100},null,"  ",null,"  "]
[{"$f":"'S1'!A21","v":3},{"$f":"'S1'!B21","v":200},null,{"$f":"IF(ISBLANK(C$10),\"  \",IF(ISBLANK(C$11),\" \",IF(ISBLANK(C21),\" \",ROUND((C21+C$12)/C$10*100,2))))","v":"  "},null,{"$f":"IF(ISBLANK(E$10),\"  \",IF(ISBLANK(E$11),\" \",IF(ISBLANK(E21),\" \",ROUND((E21+E$12)/E$10*100,2))))","v":"  "},null,null,{"$f":"'S1'!A21","v":3},{"$f":"'S1'!B21","v":200},null,{"$f":"IF(ISBLANK(K$10),\"  \",IF(ISBLANK(K$11),\" \",IF(ISBLANK(K21),\" \",ROUND((K21+K$12)/K$10*100,2))))","v":"  "},null,{"$f":"IF(ISBLANK(M$10),\"  \",IF(ISBLANK(M$11),\" \",IF(ISBLANK(M21),\" \",ROUND((M21+M$12)/M$10*100,2))))","v":"  "}]
[{"$f":"'S1'!A22","v":"2.30-3.15"},{"$f":"'S1'!B22","v":"FM"},{"$f":"IF(ISBLANK(C10),\" \",IF(ISBLANK(C14),\" \",(600-SUM(D15:D20))/100))","v":" "},null,{"$f":"IF(ISBLANK(E10),\" \",IF(ISBLANK(E14),\" \",(600-SUM(F15:F20))/100))","v":" "},null,null,null,{"$f":"'S1'!A22","v":"2.30-3.15"},{"$f":"'S1'!B22","v":"FM"},{"$f":"IF(ISBLANK(K10),\" \",IF(ISBLANK(K14),\" \",(600-SUM(L15:L20))/100))","v":" "},null,{"$f":"IF(ISBLANK(M10),\" \",IF(ISBLANK(M14),\" \",(600-SUM(N15:N20))/100))","v":" "}]
["Tested By",null,null,null,null,null,"MTD",null,"Tested By",null,null,null,null,null,"MTD"]
["Remarks",null,null,null,null,null,null,null,"Remarks"]
[]
[]
[]
["Tested By:",null,"Producer",null,"Inspector",null,"MTD",null,"Tested By:",null,"Producer",null,"Inspector",null,"MTD"]
["Date",null,null,null,null,null,null,null,"Date"]
["St Wt Before Wash",null,null,"% Loss",null,"% Loss","Enter MTD results",null,"St Wt Before Wash",null,null,"% Loss",null,"% Loss","Enter MTD results"]
["Dry Wt After Wash",null,null,{"$f":"IF(ISBLANK(C30),\" \",IF(ISBLANK(C31),\" \",((C30-C31)/C30)*100))","v":" "},null,{"$f":"IF(ISBLANK(E30),\" \",IF(ISBLANK(E31),\" \",((E30-E31)/E30)*100))","v":" "},null,null,"Dry Wt After Wash",null,null,{"$f":"IF(ISBLANK(K30),\" \",IF(ISBLANK(K31),\" \",((K30-K31)/K30)*100))","v":" "},null,{"$f":"IF(ISBLANK(M30),\" \",IF(ISBLANK(M31),\" \",((M30-M31)/M30)*100))","v":" "}]
["Wt. Loss",null,{"$f":"IF(ISBLANK(C30),\" \",IF(ISBLANK(C31),\" \",C30-C31))","v":" "},null,{"$f":"IF(ISBLANK(E30),\" \",IF(ISBLANK(E31),\" \",E30-E31))","v":" "},null,null,null,"Wt. Loss",null,{"$f":"IF(ISBLANK(K30),\" \",IF(ISBLANK(K31),\" \",K30-K31))","v":" "},null,{"$f":"IF(ISBLANK(M30),\" \",IF(ISBLANK(M31),\" \",M30-M31))","v":" "}]
["Spec","Sieve","Wt.","% Passing","Wt.","% Passing","% Passing",null,"Spec","Sieve","Wt.","% Passing","Wt.","% Passing","% Passing"]
[{"$f":"'S1'!A34","v":100},{"$f":"'S1'!B34","v":0.375},null,{"$f":"IF(ISBLANK(C$10),\"  \",IF(ISBLANK(C$11),\" \",IF(ISBLANK(C34),\" \",ROUND((C34+C$12)/C$10*100,1))))","v":"  "},null,{"$f":"IF(ISBLANK(E$10),\"  \",IF(ISBLANK(E$11),\" \",IF(ISBLANK(E34),\" \",ROUND((E34+E$12)/E$10*100,1))))","v":"  "},null,null,{"$f":"'S1'!A34","v":100},{"$f":"'S1'!B34","v":0.375},null,{"$f":"IF(ISBLANK(K$10),\"  \",IF(ISBLANK(K$11),\" \",IF(ISBLANK(K34),\" \",ROUND((K34+K$12)/K$10*100,1))))","v":"  "},null,{"$f":"IF(ISBLANK(M$10),\"  \",IF(ISBLANK(M$11),\" \",IF(ISBLANK(M34),\" \",ROUND((M34+M$12)/M$10*100,1))))","v":"  "}]
[{"$f":"'S1'!A35","v":"95-100"},{"$f":"'S1'!B35","v":4},null,{"$f":"IF(ISBLANK(C$10),\"  \",IF(ISBLANK(C$11),\" \",IF(ISBLANK(C35),\" \",ROUND((C35+C$12)/C$10*100,0))))","v":"  "},null,{"$f":"IF(ISBLANK(E$10),\"  \",IF(ISBLANK(E$11),\" \",IF(ISBLANK(E35),\" \",ROUND((E35+E$12)/E$10*100,0))))","v":"  "},null,null,{"$f":"'S1'!A35","v":"95-100"},{"$f":"'S1'!B35","v":4},null,{"$f":"IF(ISBLANK(K$10),\"  \",IF(ISBLANK(K$11),\" \",IF(ISBLANK(K35),\" \",ROUND((K35+K$12)/K$10*100,0))))","v":"  "},null,{"$f":"IF(ISBLANK(M$10),\"  \",IF(ISBLANK(M$11),\" \",IF(ISBLANK(M35),\" \",ROUND((M35+M$12)/M$10*100,0))))","v":"  "}]
[{"$f":"'S1'!A36","v":"70-100"},{"$f":"'S1'!B36","v":8},null,"  ",null,"  ",null,null,{"$f":"'S1'!A36","v":"70-100"},{"$f":"'S1'!B36","v":8},null,"  ",null,"  "]
[{"$f":"'S1'!A37","v":"45-85"},{"$f":"'S1'!B37","v":16},null,"  ",null,"  ",null,null,{"$f":"'S1'!A37","v":"45-85"},{"$f":"'S1'!B37","v":16},null,"  ",null,"  "]
[{"$f":"'S1'!A38","v":"25-65"},{"$f":"'S1'!B38","v":30},null,"  ",null,"  ",null,null,{"$f":"'S1'!A38","v":"25-65"},{"$f":"'S1'!B38","v":30},null,"  ",null,"  "]
[{"$f":"'S1'!A39","v":"10-30"},{"$f":"'S1'!B39","v":50},null,"  ",null,"  ",null,null,{"$f":"'S1'!A39","v":"10-30"},{"$f":"'S1'!B39","v":50},null,"  ",null,"  "]
[{"$f":"'S1'!A40","v":"0-10"},{"$f":"'S1'!B40","v":100},null,"  ",null,"  ",null,null,{"$f":"'S1'!A40","v":"0-10"},{"$f":"'S1'!B40","v":100},null,"  ",null,"  "]
[{"$f":"'S1'!A41","v":3},{"$f":"'S1'!B41","v":200},null,{"$f":"IF(ISBLANK(C$10),\"  \",IF(ISBLANK(C$11),\" \",IF(ISBLANK(C41),\" \",ROUND((C41+C$12)/C$10*100,2))))","v":"  "},null,{"$f":"IF(ISBLANK(E$10),\"  \",IF(ISBLANK(E$11),\" \",IF(ISBLANK(E41),\" \",ROUND((E41+E$12)/E$10*100,2))))","v":"  "},null,null,{"$f":"'S1'!A41","v":3},{"$f":"'S1'!B41","v":200},null,{"$f":"IF(ISBLANK(K$10),\"  \",IF(ISBLANK(K$11),\" \",IF(ISBLANK(K41),\" \",ROUND((K41+K$12)/K$10*100,2))))","v":"  "},null,{"$f":"IF(ISBLANK(M$10),\"  \",IF(ISBLANK(M$11),\" \",IF(ISBLANK(M41),\" \",ROUND((M41+M$12)/M$10*100,2))))","v":"  "}]
[{"$f":"'S1'!A42","v":"2.30-3.15"},{"$f":"'S1'!B42","v":"FM"},{"$f":"IF(ISBLANK(C30),\" \",IF(ISBLANK(C34),\" \",(600-SUM(D35:D40))/100))","v":" "},null,{"$f":"IF(ISBLANK(E30),\" \",IF(ISBLANK(E34),\" \",(600-SUM(F35:F40))/100))","v":" "},null,null,null,{"$f":"'S1'!A42","v":"2.30-3.15"},{"$f":"'S1'!B42","v":"FM"},{"$f":"IF(ISBLANK(K30),\" \",IF(ISBLANK(K34),\" \",(600-SUM(L35:L40))/100))","v":" "},null,{"$f":"IF(ISBLANK(M30),\" \",IF(ISBLANK(M34),\" \",(600-SUM(N35:N40))/100))","v":" "}]
["Tested By",null,null,null,null,null,"MTD",null,"Tested By",null,null,null,null,null,"MTD"]
["Remarks",null,null,null,null,null,null,null,"Remarks"]

{"sheet":"Chart 1-24","index":13,"n_rows":6,"n_cols":10,"rows_kept":6,"cut":false,"hidden":false,"merged":[[5,7,5,8],[5,9,5,10],[4,0,4,1],[4,7,4,8],[4,9,4,10],[0,0,2,0],[1,1,1,5],[2,1,2,5],[3,1,3,5],[3,7,3,8],[3,9,3,10],[1,7,1,8],[1,9,1,10],[2,7,2,8],[2,9,2,10]]}
[]
[null,"COMMONWEALTH OF PENNSYLVANIA",null,null,null,null,null,"DISTRICT",null,{"$f":"'S1'!M2","v":0}]
[null,"DEPARTMENT OF TRANSPORTATION",null,null,null,null,null,"PLANT CODE",null,{"$f":"'S1'!M3","v":0}]
[null,"PENNSYLVANIA TURNPIKE COMMISSION",null,null,null,null,null,"AGG SIZE",null,{"$f":"'S1'!M4","v":"Type A"}]
[{"$f":"'S1'!$A$5:$B$5","v":"Concrete 2023"},null,null,null,null,null,null,"FM Target Value",null,{"$f":"'S1'!M5","v":0}]
[null,null,null,null,null,null,null,null,null,{"$f":"'S1'!M6","v":0}]

{"sheet":"Chart 25-48","index":14,"n_rows":6,"n_cols":10,"rows_kept":6,"cut":false,"hidden":true,"merged":[[0,0,2,0],[1,1,1,5],[1,7,1,8],[1,9,1,10],[2,1,2,5],[2,7,2,8],[2,9,2,10],[5,7,5,8],[5,9,5,10],[3,1,3,5],[3,7,3,8],[3,9,3,10],[4,0,4,1],[4,7,4,8],[4,9,4,10]]}
[]
[null,"COMMONWEALTH OF PENNSYLVANIA",null,null,null,null,null,"DISTRICT",null,{"$f":"'S1'!M2","v":0}]
[null,"DEPARTMENT OF TRANSPORTATION",null,null,null,null,null,"PLANT CODE",null,{"$f":"'S1'!M3","v":0}]
[null,"PENNSYLVANIA TURNPIKE COMMISSION",null,null,null,null,null,"AGG SIZE",null,{"$f":"'S1'!M4","v":"Type A"}]
[{"$f":"'S1'!$A$5:$B$5","v":"Concrete 2023"},null,null,null,null,null,null,"#50 Target Value",null,{"$f":"'S1'!M5","v":0}]
[null,null,null,null,null,null,null,"#FM Target Value",null,{"$f":"'S1'!M6","v":0}]

{"sheet":"Chart 49-72","index":15,"n_rows":6,"n_cols":10,"rows_kept":6,"cut":false,"hidden":true,"merged":[[0,0,2,0],[1,1,1,5],[1,7,1,8],[1,9,1,10],[2,1,2,5],[2,7,2,8],[2,9,2,10],[5,7,5,8],[5,9,5,10],[3,1,3,5],[3,7,3,8],[3,9,3,10],[4,0,4,1],[4,7,4,8],[4,9,4,10]]}
[]
[null,"COMMONWEALTH OF PENNSYLVANIA",null,null,null,null,null,"DISTRICT",null,{"$f":"'S1'!M2","v":0}]
[null,"DEPARTMENT OF TRANSPORTATION",null,null,null,null,null,"PLANT CODE",null,{"$f":"'S1'!M3","v":0}]
[null,"PENNSYLVANIA TURNPIKE COMMISSION",null,null,null,null,null,"AGG SIZE",null,{"$f":"'S1'!M4","v":"Type A"}]
[{"$f":"'S1'!$A$5:$B$5","v":"Concrete 2023"},null,null,null,null,null,null,"#50 Target Value",null,{"$f":"'S1'!M5","v":0}]
[null,null,null,null,null,null,null,"#FM Target Value",null,{"$f":"'S1'!M6","v":0}]

{"sheet":"Chart 73-96","index":16,"n_rows":6,"n_cols":10,"rows_kept":6,"cut":false,"hidden":true,"merged":[[0,0,2,0],[1,1,1,5],[1,7,1,8],[1,9,1,10],[2,1,2,5],[2,7,2,8],[2,9,2,10],[5,7,5,8],[5,9,5,10],[3,1,3,5],[3,7,3,8],[3,9,3,10],[4,0,4,1],[4,7,4,8],[4,9,4,10]]}
[]
[null,"COMMONWEALTH OF PENNSYLVANIA",null,null,null,null,null,"DISTRICT",null,{"$f":"'S1'!M2","v":0}]
[null,"DEPARTMENT OF TRANSPORTATION",null,null,null,null,null,"PLANT CODE",null,{"$f":"'S1'!M3","v":0}]
[null,"PENNSYLVANIA TURNPIKE COMMISSION",null,null,null,null,null,"AGG SIZE",null,{"$f":"'S1'!M4","v":"Type A"}]
[{"$f":"'S1'!$A$5:$B$5","v":"Concrete 2023"},null,null,null,null,null,null,"#50 Target Value",null,{"$f":"'S1'!M5","v":0}]
[null,null,null,null,null,null,null,"#FM Target Value",null,{"$f":"'S1'!M6","v":0}]

{"sheet":"Chart 97-120","index":17,"n_rows":6,"n_cols":10,"rows_kept":6,"cut":false,"hidden":true,"merged":[[0,0,2,0],[1,1,1,5],[1,7,1,8],[1,9,1,10],[2,1,2,5],[2,7,2,8],[2,9,2,10],[5,7,5,8],[5,9,5,10],[3,1,3,5],[3,7,3,8],[3,9,3,10],[4,0,4,1],[4,7,4,8],[4,9,4,10]]}
[]
[null,"COMMONWEALTH OF PENNSYLVANIA",null,null,null,null,null,"DISTRICT",null,{"$f":"'S1'!M2","v":0}]
[null,"DEPARTMENT OF TRANSPORTATION",null,null,null,null,null,"PLANT CODE",null,{"$f":"'S1'!M3","v":0}]
[null,"PENNSYLVANIA TURNPIKE COMMISSION",null,null,null,null,null,"AGG SIZE",null,{"$f":"'S1'!M4","v":"Type A"}]
[{"$f":"'S1'!$A$5:$B$5","v":"Concrete 2023"},null,null,null,null,null,null,"#50 Target Value",null,{"$f":"'S1'!M5","v":0}]
[null,null,null,null,null,null,null,"#FM Target Value",null,{"$f":"'S1'!M6","v":0}]

{"sheet":"Chart 121-144","index":18,"n_rows":6,"n_cols":10,"rows_kept":6,"cut":false,"hidden":true,"merged":[[0,0,2,0],[1,1,1,5],[1,7,1,8],[1,9,1,10],[2,1,2,5],[2,7,2,8],[2,9,2,10],[5,7,5,8],[5,9,5,10],[3,1,3,5],[3,7,3,8],[3,9,3,10],[4,0,4,1],[4,7,4,8],[4,9,4,10]]}
[]
[null,"COMMONWEALTH OF PENNSYLVANIA",null,null,null,null,null,"DISTRICT",null,{"$f":"'S1'!M2","v":0}]
[null,"DEPARTMENT OF TRANSPORTATION",null,null,null,null,null,"PLANT CODE",null,{"$f":"'S1'!M3","v":0}]
[null,"PENNSYLVANIA TURNPIKE COMMISSION",null,null,null,null,null,"AGG SIZE",null,{"$f":"'S1'!M4","v":"Type A"}]
[{"$f":"'S1'!$A$5:$B$5","v":"Concrete 2023"},null,null,null,null,null,null,"#50 Target Value",null,{"$f":"'S1'!M5","v":0}]
[null,null,null,null,null,null,null,"#FM Target Value",null,{"$f":"'S1'!M6","v":0}]

{"sheet":"S13","index":19,"n_rows":150,"n_cols":14,"rows_kept":150,"cut":false,"hidden":true,"merged":[[0,6,0,7],[0,8,0,9],[0,12,0,13],[0,10,0,11]]}
["Sam. No.",0.375,4,8,16,30,"#50",null,"#100",null,200,null,"FM"]
[{"$f":"IF(ISBLANK('S1'!C$8),\" \",'S1'!C$8)","v":" "},{"$f":"IF(ISTEXT('S1'!$D$14),NA(),'S1'!$D$14)","v":{"$error":"#N/A"}},{"$f":"IF(ISTEXT('S1'!$D$15),NA(),'S1'!$D$15)","v":{"$error":"#N/A"}},{"$f":"IF(ISTEXT('S1'!$D$16),NA(),'S1'!$D$16)","v":{"$error":"#N/A"}},{"$f":"IF(ISTEXT('S1'!$D$17),NA(),'S1'!$D$17)","v":{"$error":"#N/A"}},{"$f":"IF(ISTEXT('S1'!$D$18),NA(),'S1'!$D$18)","v":{"$error":"#N/A"}},{"$f":"IF(ISTEXT('S1'!$D$19),NA(),'S1'!$D$19)","v":{"$error":"#N/A"}},{"$f":"G2","v":{"$error":"#N/A"}},{"$f":"IF(ISTEXT('S1'!$D$20),NA(),'S1'!$D$20)","v":{"$error":"#N/A"}},{"$f":"I2","v":{"$error":"#N/A"}},{"$f":"IF(ISTEXT('S1'!$D$21),NA(),'S1'!$D$21)","v":{"$error":"#N/A"}},{"$f":"K2","v":{"$error":"#N/A"}},{"$f":"IF(ISTEXT('S1'!$C$22),NA(),'S1'!$C$22)","v":{"$error":"#N/A"}},{"$f":"M2","v":{"$error":"#N/A"}}]
[{"$f":"IF(ISBLANK('S1'!E$8),\" \",'S1'!E$8)","v":" "},{"$f":"IF(ISTEXT('S1'!$F$14),NA(),'S1'!$F$14)","v":{"$error":"#N/A"}},{"$f":"IF(ISTEXT('S1'!$F$15),NA(),'S1'!$F$15)","v":{"$error":"#N/A"}},{"$f":"IF(ISTEXT('S1'!$F$16),NA(),'S1'!$F$16)","v":{"$error":"#N/A"}},{"$f":"IF(ISTEXT('S1'!$F$17),NA(),'S1'!$F$17)","v":{"$error":"#N/A"}},{"$f":"IF(ISTEXT('S1'!$F$18),NA(),'S1'!$F$18)","v":{"$error":"#N/A"}},{"$f":"IF(ISTEXT('S1'!$F$19),NA(),'S1'!$F$19)","v":{"$error":"#N/A"}},{"$f":"ROUND(AVERAGE(G2:G3),0)","v":{"$error":"#N/A"}},{"$f":"IF(ISTEXT('S1'!$F$20),NA(),'S1'!$F$20)","v":{"$error":"#N/A"}},{"$f":"ROUND(AVERAGE(I2:I3),0)","v":{"$error":"#N/A"}},{"$f":"IF(ISTEXT('S1'!$F$21),NA(),'S1'!$F$21)","v":{"$error":"#N/A"}},{"$f":"ROUND(AVERAGE(K2:K3),2)","v":{"$error":"#N/A"}},{"$f":"IF(ISTEXT('S1'!$E$22),NA(),'S1'!$E$22)","v":{"$error":"#N/A"}},{"$f":"ROUND(AVERAGE(M2:M3),2)","v":{"$error":"#N/A"}}]
[{"$f":"IF(ISBLANK('S1'!G$8),\" \",'S1'!G$8)","v":" "},{"$f":"IF(ISTEXT('S1'!$H$14),NA(),'S1'!$H$14)","v":{"$error":"#N/A"}},{"$f":"IF(ISTEXT('S1'!$H$15),NA(),'S1'!$H$15)","v":{"$error":"#N/A"}},{"$f":"IF(ISTEXT('S1'!$H$16),NA(),'S1'!$H$16)","v":{"$error":"#N/A"}},{"$f":"IF(ISTEXT('S1'!$H$17),NA(),'S1'!$H$17)","v":{"$error":"#N/A"}},{"$f":"IF(ISTEXT('S1'!$H$18),NA(),'S1'!$H$18)","v":{"$error":"#N/A"}},{"$f":"IF(ISTEXT('S1'!$H$19),NA(),'S1'!$H$19)","v":{"$error":"#N/A"}},{"$f":"ROUND(AVERAGE(G2:G4),0)","v":{"$error":"#N/A"}},{"$f":"IF(ISTEXT('S1'!$H$20),NA(),'S1'!$H$20)","v":{"$error":"#N/A"}},{"$f":"ROUND(AVERAGE(I2:I4),0)","v":{"$error":"#N/A"}},{"$f":"IF(ISTEXT('S1'!$H$21),NA(),'S1'!$H$21)","v":{"$error":"#N/A"}},{"$f":"ROUND(AVERAGE(K2:K4),2)","v":{"$error":"#N/A"}},{"$f":"IF(ISTEXT('S1'!$G$22),NA(),'S1'!$G$22)","v":{"$error":"#N/A"}},{"$f":"ROUND(AVERAGE(M2:M4),2)","v":{"$error":"#N/A"}}]
[{"$f":"IF(ISBLANK('S1'!I$8),\" \",'S1'!I$8)","v":" "},{"$f":"IF(ISTEXT('S1'!$J$14),NA(),'S1'!$J$14)","v":{"$error":"#N/A"}},{"$f":"IF(ISTEXT('S1'!$J$15),NA(),'S1'!$J$15)","v":{"$error":"#N/A"}},{"$f":"IF(ISTEXT('S1'!$J$16),NA(),'S1'!$J$16)","v":{"$error":"#N/A"}},{"$f":"IF(ISTEXT('S1'!$J$17),NA(),'S1'!$J$17)","v":{"$error":"#N/A"}},{"$f":"IF(ISTEXT('S1'!$J$18),NA(),'S1'!$J$18)","v":{"$error":"#N/A"}},{"$f":"IF(ISTEXT('S1'!$J$19),NA(),'S1'!$J$19)","v":{"$error":"#N/A"}},{"$error":"#N/A"},{"$f":"IF(ISTEXT('S1'!$J$20),NA(),'S1'!$J$20)","v":{"$error":"#N/A"}},{"$error":"#N/A"},{"$f":"IF(ISTEXT('S1'!$J$21),NA(),'S1'!$J$21)","v":{"$error":"#N/A"}},{"$error":"#N/A"},{"$f":"IF(ISTEXT('S1'!$I$22),NA(),'S1'!$I$22)","v":{"$error":"#N/A"}},{"$error":"#N/A"}]
[{"$f":"IF(ISBLANK('S1'!K$8),\" \",'S1'!K$8)","v":" "},{"$f":"IF(ISTEXT('S1'!$L$14),NA(),'S1'!$L$14)","v":{"$error":"#N/A"}},{"$f":"IF(ISTEXT('S1'!$L$15),NA(),'S1'!$L$15)","v":{"$error":"#N/A"}},{"$f":"IF(ISTEXT('S1'!$L$16),NA(),'S1'!$L$16)","v":{"$error":"#N/A"}},{"$f":"IF(ISTEXT('S1'!$L$17),NA(),'S1'!$L$17)","v":{"$error":"#N/A"}},{"$f":"IF(ISTEXT('S1'!$L$18),NA(),'S1'!$L$18)","v":{"$error":"#N/A"}},{"$f":"IF(ISTEXT('S1'!$L$19),NA(),'S1'!$L$19)","v":{"$error":"#N/A"}},{"$error":"#N/A"},{"$f":"IF(ISTEXT('S1'!$L$20),NA(),'S1'!$L$20)","v":{"$error":"#N/A"}},{"$error":"#N/A"},{"$f":"IF(ISTEXT('S1'!$L$21),NA(),'S1'!$L$21)","v":{"$error":"#N/A"}},{"$error":"#N/A"},{"$f":"IF(ISTEXT('S1'!$K$22),NA(),'S1'!$K$22)","v":{"$error":"#N/A"}},{"$error":"#N/A"}]
[{"$f":"IF(ISBLANK('S1'!M$8),\" \",'S1'!M$8)","v":" "},{"$f":"IF(ISTEXT('S1'!$N$14),NA(),'S1'!$N$14)","v":{"$error":"#N/A"}},{"$f":"IF(ISTEXT('S1'!$N$15),NA(),'S1'!$N$15)","v":{"$error":"#N/A"}},{"$f":"IF(ISTEXT('S1'!$N$16),NA(),'S1'!$N$16)","v":{"$error":"#N/A"}},{"$f":"IF(ISTEXT('S1'!$N$17),NA(),'S1'!$N$17)","v":{"$error":"#N/A"}},{"$f":"IF(ISTEXT('S1'!$N$18),NA(),'S1'!$N$18)","v":{"$error":"#N/A"}},{"$f":"IF(ISTEXT('S1'!$N$19),NA(),'S1'!$N$19)","v":{"$error":"#N/A"}},{"$error":"#N/A"},{"$f":"IF(ISTEXT('S1'!$N$20),NA(),'S1'!$N$20)","v":{"$error":"#N/A"}},{"$error":"#N/A"},{"$f":"IF(ISTEXT('S1'!$N$21),NA(),'S1'!$N$21)","v":{"$error":"#N/A"}},{"$error":"#N/A"},{"$f":"IF(ISTEXT('S1'!$M$22),NA(),'S1'!$M$22)","v":{"$error":"#N/A"}},{"$error":"#N/A"}]
[{"$f":"IF(ISBLANK('S1'!C$28),\" \",'S1'!C$28)","v":" "},{"$f":"IF(ISTEXT('S1'!$D$34),NA(),'S1'!$D$34)","v":{"$error":"#N/A"}},{"$f":"IF(ISTEXT('S1'!$D$35),NA(),'S1'!$D$35)","v":{"$error":"#N/A"}},{"$f":"IF(ISTEXT('S1'!$D$36),NA(),'S1'!$D$36)","v":{"$error":"#N/A"}},{"$f":"IF(ISTEXT('S1'!$D$37),NA(),'S1'!$D$37)","v":{"$error":"#N/A"}},{"$f":"IF(ISTEXT('S1'!$D$38),NA(),'S1'!$D$38)","v":{"$error":"#N/A"}},{"$f":"IF(ISTEXT('S1'!$D$39),NA(),'S1'!$D$39)","v":{"$error":"#N/A"}},{"$error":"#N/A"},{"$f":"IF(ISTEXT('S1'!$D$40),NA(),'S1'!$D$40)","v":{"$error":"#N/A"}},{"$error":"#N/A"},{"$f":"IF(ISTEXT('S1'!$D$41),NA(),'S1'!$D$41)","v":{"$error":"#N/A"}},{"$error":"#N/A"},{"$f":"IF(ISTEXT('S1'!$C$42),NA(),'S1'!$C$42)","v":{"$error":"#N/A"}},{"$error":"#N/A"}]
[{"$f":"IF(ISBLANK('S1'!E$28),\" \",'S1'!E$28)","v":" "},{"$f":"IF(ISTEXT('S1'!$F$34),NA(),'S1'!$F$34)","v":{"$error":"#N/A"}},{"$f":"IF(ISTEXT('S1'!$F$35),NA(),'S1'!$F$35)","v":{"$error":"#N/A"}},{"$f":"IF(ISTEXT('S1'!$F$36),NA(),'S1'!$F$36)","v":{"$error":"#N/A"}},{"$f":"IF(ISTEXT('S1'!$F$37),NA(),'S1'!$F$37)","v":{"$error":"#N/A"}},{"$f":"IF(ISTEXT('S1'!$F$38),NA(),'S1'!$F$38)","v":{"$error":"#N/A"}},{"$f":"IF(ISTEXT('S1'!$F$39),NA(),'S1'!$F$39)","v":{"$error":"#N/A"}},{"$error":"#N/A"},{"$f":"IF(ISTEXT('S1'!$F$40),NA(),'S1'!$F$40)","v":{"$error":"#N/A"}},{"$error":"#N/A"},{"$f":"IF(ISTEXT('S1'!$F$41),NA(),'S1'!$F$41)","v":{"$error":"#N/A"}},{"$error":"#N/A"},{"$f":"IF(ISTEXT('S1'!$E$42),NA(),'S1'!$E$42)","v":{"$error":"#N/A"}},{"$error":"#N/A"}]
[{"$f":"IF(ISBLANK('S1'!G$28),\" \",'S1'!G$28)","v":" "},{"$f":"IF(ISTEXT('S1'!$H$34),NA(),'S1'!$H$34)","v":{"$error":"#N/A"}},{"$f":"IF(ISTEXT('S1'!$H$35),NA(),'S1'!$H$35)","v":{"$error":"#N/A"}},{"$f":"IF(ISTEXT('S1'!$H$36),NA(),'S1'!$H$36)","v":{"$error":"#N/A"}},{"$f":"IF(ISTEXT('S1'!$H$37),NA(),'S1'!$H$37)","v":{"$error":"#N/A"}},{"$f":"IF(ISTEXT('S1'!$H$38),NA(),'S1'!$H$38)","v":{"$error":"#N/A"}},{"$f":"IF(ISTEXT('S1'!$H$39),NA(),'S1'!$H$39)","v":{"$error":"#N/A"}},{"$error":"#N/A"},{"$f":"IF(ISTEXT('S1'!$H$40),NA(),'S1'!$H$40)","v":{"$error":"#N/A"}},{"$error":"#N/A"},{"$f":"IF(ISTEXT('S1'!$H$41),NA(),'S1'!$H$41)","v":{"$error":"#N/A"}},{"$error":"#N/A"},{"$f":"IF(ISTEXT('S1'!$G$42),NA(),'S1'!$G$42)","v":{"$error":"#N/A"}},{"$error":"#N/A"}]
[{"$f":"IF(ISBLANK('S1'!I$28),\" \",'S1'!I$28)","v":" "},{"$f":"IF(ISTEXT('S1'!$J$34),NA(),'S1'!$J$34)","v":{"$error":"#N/A"}},{"$f":"IF(ISTEXT('S1'!$J$35),NA(),'S1'!$J$35)","v":{"$error":"#N/A"}},{"$f":"IF(ISTEXT('S1'!$J$36),NA(),'S1'!$J$36)","v":{"$error":"#N/A"}},{"$f":"IF(ISTEXT('S1'!$J$37),NA(),'S1'!$J$37)","v":{"$error":"#N/A"}},{"$f":"IF(ISTEXT('S1'!$J$38),NA(),'S1'!$J$38)","v":{"$error":"#N/A"}},{"$f":"IF(ISTEXT('S1'!$J$39),NA(),'S1'!$J$39)","v":{"$error":"#N/A"}},{"$error":"#N/A"},{"$f":"IF(ISTEXT('S1'!$J$40),NA(),'S1'!$J$40)","v":{"$error":"#N/A"}},{"$error":"#N/A"},{"$f":"IF(ISTEXT('S1'!$J$41),NA(),'S1'!$J$41)","v":{"$error":"#N/A"}},{"$error":"#N/A"},{"$f":"IF(ISTEXT('S1'!$I$42),NA(),'S1'!$I$42)","v":{"$error":"#N/A"}},{"$error":"#N/A"}]
[{"$f":"IF(ISBLANK('S1'!K$28),\" \",'S1'!K$28)","v":" "},{"$f":"IF(ISTEXT('S1'!$L$34),NA(),'S1'!$L$34)","v":{"$error":"#N/A"}},{"$f":"IF(ISTEXT('S1'!$L$35),NA(),'S1'!$L$35)","v":{"$error":"#N/A"}},{"$f":"IF(ISTEXT('S1'!$L$36),NA(),'S1'!$L$36)","v":{"$error":"#N/A"}},{"$f":"IF(ISTEXT('S1'!$L$37),NA(),'S1'!$L$37)","v":{"$error":"#N/A"}},{"$f":"IF(ISTEXT('S1'!$L$38),NA(),'S1'!$L$38)","v":{"$error":"#N/A"}},{"$f":"IF(ISTEXT('S1'!$L$39),NA(),'S1'!$L$39)","v":{"$error":"#N/A"}},{"$f":"ROUND(AVERAGE(G10:G12),0)","v":{"$error":"#N/A"}},{"$f":"IF(ISTEXT('S1'!$L$40),NA(),'S1'!$L$40)","v":{"$error":"#N/A"}},{"$error":"#N/A"},{"$f":"IF(ISTEXT('S1'!$L$41),NA(),'S1'!$L$41)","v":{"$error":"#N/A"}},{"$error":"#N/A"},{"$f":"IF(ISTEXT('S1'!$K$42),NA(),'S1'!$K$42)","v":{"$error":"#N/A"}},{"$error":"#N/A"}]
[{"$f":"IF(ISBLANK('S1'!M$28),\" \",'S1'!M$28)","v":" "},{"$f":"IF(ISTEXT('S1'!$N$34),NA(),'S1'!$N$34)","v":{"$error":"#N/A"}},{"$f":"IF(ISTEXT('S1'!$N$35),NA(),'S1'!$N$35)","v":{"$error":"#N/A"}},{"$f":"IF(ISTEXT('S1'!$N$36),NA(),'S1'!$N$36)","v":{"$error":"#N/A"}},{"$f":"IF(ISTEXT('S1'!$N$37),NA(),'S1'!$N$37)","v":{"$error":"#N/A"}},{"$f":"IF(ISTEXT('S1'!$N$38),NA(),'S1'!$N$38)","v":{"$error":"#N/A"}},{"$f":"IF(ISTEXT('S1'!$N$39),NA(),'S1'!$N$39)","v":{"$error":"#N/A"}},{"$error":"#N/A"},{"$f":"IF(ISTEXT('S1'!$N$40),NA(),'S1'!$N$40)","v":{"$error":"#N/A"}},{"$error":"#N/A"},{"$f":"IF(ISTEXT('S1'!$N$41),NA(),'S1'!$N$41)","v":{"$error":"#N/A"}},{"$error":"#N/A"},{"$f":"IF(ISTEXT('S1'!$M$42),NA(),'S1'!$M$42)","v":{"$error":"#N/A"}},{"$error":"#N/A"}]
[{"$f":"IF(ISBLANK('S2'!C$8),\" \",'S2'!C$8)","v":" "},{"$f":"IF(ISTEXT('S2'!$D$14),NA(),'S2'!$D$14)","v":{"$error":"#N/A"}},{"$f":"IF(ISTEXT('S2'!$D$15),NA(),'S2'!$D$15)","v":{"$error":"#N/A"}},{"$f":"IF(ISTEXT('S2'!$D$16),NA(),'S2'!$D$16)","v":{"$error":"#N/A"}},{"$f":"IF(ISTEXT('S2'!$D$17),NA(),'S2'!$D$17)","v":{"$error":"#N/A"}},{"$f":"IF(ISTEXT('S2'!$D$18),NA(),'S2'!$D$18)","v":{"$error":"#N/A"}},{"$f":"IF(ISTEXT('S2'!$D$19),NA(),'S2'!$D$19)","v":{"$error":"#N/A"}},{"$error":"#N/A"},{"$f":"IF(ISTEXT('S2'!$D$20),NA(),'S2'!$D$20)","v":{"$error":"#N/A"}},{"$error":"#N/A"},{"$f":"IF(ISTEXT('S2'!$D$21),NA(),'S2'!$D$21)","v":{"$error":"#N/A"}},{"$error":"#N/A"},{"$f":"IF(ISTEXT('S2'!$C$22),NA(),'S2'!$C$22)","v":{"$error":"#N/A"}},{"$error":"#N/A"}]
[{"$f":"IF(ISBLANK('S2'!E$8),\" \",'S2'!E$8)","v":" "},{"$f":"IF(ISTEXT('S2'!$F$14),NA(),'S2'!$F$14)","v":{"$error":"#N/A"}},{"$f":"IF(ISTEXT('S2'!$F$15),NA(),'S2'!$F$15)","v":{"$error":"#N/A"}},{"$f":"IF(ISTEXT('S2'!$F$16),NA(),'S2'!$F$16)","v":{"$error":"#N/A"}},{"$f":"IF(ISTEXT('S2'!$F$17),NA(),'S2'!$F$17)","v":{"$error":"#N/A"}},{"$f":"IF(ISTEXT('S2'!$F$18),NA(),'S2'!$F$18)","v":{"$error":"#N/A"}},{"$f":"IF(ISTEXT('S2'!$F$19),NA(),'S2'!$F$19)","v":{"$error":"#N/A"}},{"$error":"#N/A"},{"$f":"IF(ISTEXT('S2'!$F$20),NA(),'S2'!$F$20)","v":{"$error":"#N/A"}},{"$error":"#N/A"},{"$f":"IF(ISTEXT('S2'!$F$21),NA(),'S2'!$F$21)","v":{"$error":"#N/A"}},{"$error":"#N/A"},{"$f":"IF(ISTEXT('S2'!$E$22),NA(),'S2'!$E$22)","v":{"$error":"#N/A"}},{"$error":"#N/A"}]
[{"$f":"IF(ISBLANK('S2'!G$8),\" \",'S2'!G$8)","v":" "},{"$f":"IF(ISTEXT('S2'!$H$14),NA(),'S2'!$H$14)","v":{"$error":"#N/A"}},{"$f":"IF(ISTEXT('S2'!$H$15),NA(),'S2'!$H$15)","v":{"$error":"#N/A"}},{"$f":"IF(ISTEXT('S2'!$H$16),NA(),'S2'!$H$16)","v":{"$error":"#N/A"}},{"$f":"IF(ISTEXT('S2'!$H$17),NA(),'S2'!$H$17)","v":{"$error":"#N/A"}},{"$f":"IF(ISTEXT('S2'!$H$18),NA(),'S2'!$H$18)","v":{"$error":"#N/A"}},{"$f":"IF(ISTEXT('S2'!$H$19),NA(),'S2'!$H$19)","v":{"$error":"#N/A"}},{"$error":"#N/A"},{"$f":"IF(ISTEXT('S2'!$H$20),NA(),'S2'!$H$20)","v":{"$error":"#N/A"}},{"$error":"#N/A"},{"$f":"IF(ISTEXT('S2'!$H$21),NA(),'S2'!$H$21)","v":{"$error":"#N/A"}},{"$error":"#N/A"},{"$f":"IF(ISTEXT('S2'!$G$22),NA(),'S2'!$G$22)","v":{"$error":"#N/A"}},{"$error":"#N/A"}]
[{"$f":"IF(ISBLANK('S2'!I$8),\" \",'S2'!I$8)","v":" "},{"$f":"IF(ISTEXT('S2'!$J$14),NA(),'S2'!$J$14)","v":{"$error":"#N/A"}},{"$f":"IF(ISTEXT('S2'!$J$15),NA(),'S2'!$J$15)","v":{"$error":"#N/A"}},{"$f":"IF(ISTEXT('S2'!$J$16),NA(),'S2'!$J$16)","v":{"$error":"#N/A"}},{"$f":"IF(ISTEXT('S2'!$J$17),NA(),'S2'!$J$17)","v":{"$error":"#N/A"}},{"$f":"IF(ISTEXT('S2'!$J$18),NA(),'S2'!$J$18)","v":{"$error":"#N/A"}},{"$f":"IF(ISTEXT('S2'!$J$19),NA(),'S2'!$J$19)","v":{"$error":"#N/A"}},{"$error":"#N/A"},{"$f":"IF(ISTEXT('S2'!$J$20),NA(),'S2'!$J$20)","v":{"$error":"#N/A"}},{"$error":"#N/A"},{"$f":"IF(ISTEXT('S2'!$J$21),NA(),'S2'!$J$21)","v":{"$error":"#N/A"}},{"$error":"#N/A"},{"$f":"IF(ISTEXT('S2'!$I$22),NA(),'S2'!$I$22)","v":{"$error":"#N/A"}},{"$error":"#N/A"}]
[{"$f":"IF(ISBLANK('S2'!K$8),\" \",'S2'!K$8)","v":" "},{"$f":"IF(ISTEXT('S2'!$L$14),NA(),'S2'!$L$14)","v":{"$error":"#N/A"}},{"$f":"IF(ISTEXT('S2'!$L$15),NA(),'S2'!$L$15)","v":{"$error":"#N/A"}},{"$f":"IF(ISTEXT('S2'!$L$16),NA(),'S2'!$L$16)","v":{"$error":"#N/A"}},{"$f":"IF(ISTEXT('S2'!$L$17),NA(),'S2'!$L$17)","v":{"$error":"#N/A"}},{"$f":"IF(ISTEXT('S2'!$L$18),NA(),'S2'!$L$18)","v":{"$error":"#N/A"}},{"$f":"IF(ISTEXT('S2'!$L$19),NA(),'S2'!$L$19)","v":{"$error":"#N/A"}},{"$error":"#N/A"},{"$f":"IF(ISTEXT('S2'!$L$20),NA(),'S2'!$L$20)","v":{"$error":"#N/A"}},{"$error":"#N/A"},{"$f":"IF(ISTEXT('S2'!$L$21),NA(),'S2'!$L$21)","v":{"$error":"#N/A"}},{"$error":"#N/A"},{"$f":"IF(ISTEXT('S2'!$K$22),NA(),'S2'!$K$22)","v":{"$error":"#N/A"}},{"$error":"#N/A"}]
[{"$f":"IF(ISBLANK('S2'!M$8),\" \",'S2'!M$8)","v":" "},{"$f":"IF(ISTEXT('S2'!$N$14),NA(),'S2'!$N$14)","v":{"$error":"#N/A"}},{"$f":"IF(ISTEXT('S2'!$N$15),NA(),'S2'!$N$15)","v":{"$error":"#N/A"}},{"$f":"IF(ISTEXT('S2'!$N$16),NA(),'S2'!$N$16)","v":{"$error":"#N/A"}},{"$f":"IF(ISTEXT('S2'!$N$17),NA(),'S2'!$N$17)","v":{"$error":"#N/A"}},{"$f":"IF(ISTEXT('S2'!$N$18),NA(),'S2'!$N$18)","v":{"$error":"#N/A"}},{"$f":"IF(ISTEXT('S2'!$N$19),NA(),'S2'!$N$19)","v":{"$error":"#N/A"}},{"$error":"#N/A"},{"$f":"IF(ISTEXT('S2'!$N$20),NA(),'S2'!$N$20)","v":{"$error":"#N/A"}},{"$error":"#N/A"},{"$f":"IF(ISTEXT('S2'!$N$21),NA(),'S2'!$N$21)","v":{"$error":"#N/A"}},{"$error":"#N/A"},{"$f":"IF(ISTEXT('S2'!$M$22),NA(),'S2'!$M$22)","v":{"$error":"#N/A"}},{"$error":"#N/A"}]
[{"$f":"IF(ISBLANK('S2'!C$28),\" \",'S2'!C$28)","v":" "},{"$f":"IF(ISTEXT('S2'!$D$34),NA(),'S2'!$D$34)","v":{"$error":"#N/A"}},{"$f":"IF(ISTEXT('S2'!$D$35),NA(),'S2'!$D$35)","v":{"$error":"#N/A"}},{"$f":"IF(ISTEXT('S2'!$D$36),NA(),'S2'!$D$36)","v":{"$error":"#N/A"}},{"$f":"IF(ISTEXT('S2'!$D$37),NA(),'S2'!$D$37)","v":{"$error":"#N/A"}},{"$f":"IF(ISTEXT('S2'!$D$38),NA(),'S2'!$D$38)","v":{"$error":"#N/A"}},{"$f":"IF(ISTEXT('S2'!$D$39),NA(),'S2'!$D$39)","v":{"$error":"#N/A"}},{"$error":"#N/A"},{"$f":"IF(ISTEXT('S2'!$D$40),NA(),'S2'!$D$40)","v":{"$error":"#N/A"}},{"$error":"#N/A"},{"$f":"IF(ISTEXT('S2'!$D$41),NA(),'S2'!$D$41)","v":{"$error":"#N/A"}},{"$error":"#N/A"},{"$f":"IF(ISTEXT('S2'!$C$42),NA(),'S2'!$C$42)","v":{"$error":"#N/A"}},{"$error":"#N/A"}]
[{"$f":"IF(ISBLANK('S2'!E$28),\" \",'S2'!E$28)","v":" "},{"$f":"IF(ISTEXT('S2'!$F$34),NA(),'S2'!$F$34)","v":{"$error":"#N/A"}},{"$f":"IF(ISTEXT('S2'!$F$35),NA(),'S2'!$F$35)","v":{"$error":"#N/A"}},{"$f":"IF(ISTEXT('S2'!$F$36),NA(),'S2'!$F$36)","v":{"$error":"#N/A"}},{"$f":"IF(ISTEXT('S2'!$F$37),NA(),'S2'!$F$37)","v":{"$error":"#N/A"}},{"$f":"IF(ISTEXT('S2'!$F$38),NA(),'S2'!$F$38)","v":{"$error":"#N/A"}},{"$f":"IF(ISTEXT('S2'!$F$39),NA(),'S2'!$F$39)","v":{"$error":"#N/A"}},{"$error":"#N/A"},{"$f":"IF(ISTEXT('S2'!$F$40),NA(),'S2'!$F$40)","v":{"$error":"#N/A"}},{"$error":"#N/A"},{"$f":"IF(ISTEXT('S2'!$F$41),NA(),'S2'!$F$41)","v":{"$error":"#N/A"}},{"$error":"#N/A"},{"$f":"IF(ISTEXT('S2'!$E$42),NA(),'S2'!$E$42)","v":{"$error":"#N/A"}},{"$error":"#N/A"}]
[{"$f":"IF(ISBLANK('S2'!G$28),\" \",'S2'!G$28)","v":" "},{"$f":"IF(ISTEXT('S2'!$H$34),NA(),'S2'!$H$34)","v":{"$error":"#N/A"}},{"$f":"IF(ISTEXT('S2'!$H$35),NA(),'S2'!$H$35)","v":{"$error":"#N/A"}},{"$f":"IF(ISTEXT('S2'!$H$36),NA(),'S2'!$H$36)","v":{"$error":"#N/A"}},{"$f":"IF(ISTEXT('S2'!$H$37),NA(),'S2'!$H$37)","v":{"$error":"#N/A"}},{"$f":"IF(ISTEXT('S2'!$H$38),NA(),'S2'!$H$38)","v":{"$error":"#N/A"}},{"$f":"IF(ISTEXT('S2'!$H$39),NA(),'S2'!$H$39)","v":{"$error":"#N/A"}},{"$error":"#N/A"},{"$f":"IF(ISTEXT('S2'!$H$40),NA(),'S2'!$H$40)","v":{"$error":"#N/A"}},{"$error":"#N/A"},{"$f":"IF(ISTEXT('S2'!$H$41),NA(),'S2'!$H$41)","v":{"$error":"#N/A"}},{"$error":"#N/A"},{"$f":"IF(ISTEXT('S2'!$G$42),NA(),'S2'!$G$42)","v":{"$error":"#N/A"}},{"$error":"#N/A"}]
[{"$f":"IF(ISBLANK('S2'!I$28),\" \",'S2'!I$28)","v":" "},{"$f":"IF(ISTEXT('S2'!$J$34),NA(),'S2'!$J$34)","v":{"$error":"#N/A"}},{"$f":"IF(ISTEXT('S2'!$J$35),NA(),'S2'!$J$35)","v":{"$error":"#N/A"}},{"$f":"IF(ISTEXT('S2'!$J$36),NA(),'S2'!$J$36)","v":{"$error":"#N/A"}},{"$f":"IF(ISTEXT('S2'!$J$37),NA(),'S2'!$J$37)","v":{"$error":"#N/A"}},{"$f":"IF(ISTEXT('S2'!$J$38),NA(),'S2'!$J$38)","v":{"$error":"#N/A"}},{"$f":"IF(ISTEXT('S2'!$J$39),NA(),'S2'!$J$39)","v":{"$error":"#N/A"}},{"$error":"#N/A"},{"$f":"IF(ISTEXT('S2'!$J$40),NA(),'S2'!$J$40)","v":{"$error":"#N/A"}},{"$error":"#N/A"},{"$f":"IF(ISTEXT('S2'!$J$41),NA(),'S2'!$J$41)","v":{"$error":"#N/A"}},{"$error":"#N/A"},{"$f":"IF(ISTEXT('S2'!$I$42),NA(),'S2'!$I$42)","v":{"$error":"#N/A"}},{"$error":"#N/A"}]
[{"$f":"IF(ISBLANK('S2'!K$28),\" \",'S2'!K$28)","v":" "},{"$f":"IF(ISTEXT('S2'!$L$34),NA(),'S2'!$L$34)","v":{"$error":"#N/A"}},{"$f":"IF(ISTEXT('S2'!$L$35),NA(),'S2'!$L$35)","v":{"$error":"#N/A"}},{"$f":"IF(ISTEXT('S2'!$L$36),NA(),'S2'!$L$36)","v":{"$error":"#N/A"}},{"$f":"IF(ISTEXT('S2'!$L$37),NA(),'S2'!$L$37)","v":{"$error":"#N/A"}},{"$f":"IF(ISTEXT('S2'!$L$38),NA(),'S2'!$L$38)","v":{"$error":"#N/A"}},{"$f":"IF(ISTEXT('S2'!$L$39),NA(),'S2'!$L$39)","v":{"$error":"#N/A"}},{"$error":"#N/A"},{"$f":"IF(ISTEXT('S2'!$L$40),NA(),'S2'!$L$40)","v":{"$error":"#N/A"}},{"$error":"#N/A"},{"$f":"IF(ISTEXT('S2'!$L$41),NA(),'S2'!$L$41)","v":{"$error":"#N/A"}},{"$error":"#N/A"},{"$f":"IF(ISTEXT('S2'!$K$42),NA(),'S2'!$K$42)","v":{"$error":"#N/A"}},{"$error":"#N/A"}]
[{"$f":"IF(ISBLANK('S2'!M$28),\" \",'S2'!M$28)","v":" "},{"$f":"IF(ISTEXT('S2'!$N$34),NA(),'S2'!$N$34)","v":{"$error":"#N/A"}},{"$f":"IF(ISTEXT('S2'!$N$35),NA(),'S2'!$N$35)","v":{"$error":"#N/A"}},{"$f":"IF(ISTEXT('S2'!$N$36),NA(),'S2'!$N$36)","v":{"$error":"#N/A"}},{"$f":"IF(ISTEXT('S2'!$N$37),NA(),'S2'!$N$37)","v":{"$error":"#N/A"}},{"$f":"IF(ISTEXT('S2'!$N$38),NA(),'S2'!$N$38)","v":{"$error":"#N/A"}},{"$f":"IF(ISTEXT('S2'!$N$39),NA(),'S2'!$N$39)","v":{"$error":"#N/A"}},{"$error":"#N/A"},{"$f":"IF(ISTEXT('S2'!$N$40),NA(),'S2'!$N$40)","v":{"$error":"#N/A"}},{"$error":"#N/A"},{"$f":"IF(ISTEXT('S2'!$N$41),NA(),'S2'!$N$41)","v":{"$error":"#N/A"}},{"$error":"#N/A"},{"$f":"IF(ISTEXT('S2'!$M$42),NA(),'S2'!$M$42)","v":{"$error":"#N/A"}},{"$error":"#N/A"}]
[]
[{"$f":"IF(ISBLANK('S3'!C$8),\" \",'S3'!C$8)","v":" "},{"$f":"IF(ISTEXT('S3'!$D$14),NA(),'S3'!$D$14)","v":{"$error":"#N/A"}},{"$f":"IF(ISTEXT('S3'!$D$15),NA(),'S3'!$D$15)","v":{"$error":"#N/A"}},{"$f":"IF(ISTEXT('S3'!$D$16),NA(),'S3'!$D$16)","v":{"$error":"#N/A"}},{"$f":"IF(ISTEXT('S3'!$D$17),NA(),'S3'!$D$17)","v":{"$error":"#N/A"}},{"$f":"IF(ISTEXT('S3'!$D$18),NA(),'S3'!$D$18)","v":{"$error":"#N/A"}},{"$f":"IF(ISTEXT('S3'!$D$19),NA(),'S3'!$D$19)","v":{"$error":"#N/A"}},{"$f":"ROUND(AVERAGE(G24:G27),0)","v":{"$error":"#N/A"}},{"$f":"IF(ISTEXT('S3'!$D$20),NA(),'S3'!$D$20)","v":{"$error":"#N/A"}},{"$f":"ROUND(AVERAGE(I24:I27),0)","v":{"$error":"#N/A"}},{"$f":"IF(ISTEXT('S3'!$D$21),NA(),'S3'!$D$21)","v":{"$error":"#N/A"}},{"$f":"ROUND(AVERAGE(K24:K27),2)","v":{"$error":"#N/A"}},{"$f":"IF(ISTEXT('S3'!$C$22),NA(),'S3'!$C$22)","v":{"$error":"#N/A"}},{"$f":"ROUND(AVERAGE(M24:M27),2)","v":{"$error":"#N/A"}}]
[{"$f":"IF(ISBLANK('S3'!E$8),\" \",'S3'!E$8)","v":" "},{"$f":"IF(ISTEXT('S3'!$F$14),NA(),'S3'!$F$14)","v":{"$error":"#N/A"}},{"$f":"IF(ISTEXT('S3'!$F$15),NA(),'S3'!$F$15)","v":{"$error":"#N/A"}},{"$f":"IF(ISTEXT('S3'!$F$16),NA(),'S3'!$F$16)","v":{"$error":"#N/A"}},{"$f":"IF(ISTEXT('S3'!$F$17),NA(),'S3'!$F$17)","v":{"$error":"#N/A"}},{"$f":"IF(ISTEXT('S3'!$F$18),NA(),'S3'!$F$18)","v":{"$error":"#N/A"}},{"$f":"IF(ISTEXT('S3'!$F$19),NA(),'S3'!$F$19)","v":{"$error":"#N/A"}},{"$f":"ROUND(AVERAGE(G25:G28),0)","v":{"$error":"#N/A"}},{"$f":"IF(ISTEXT('S3'!$F$20),NA(),'S3'!$F$20)","v":{"$error":"#N/A"}},{"$f":"ROUND(AVERAGE(I25:I28),0)","v":{"$error":"#N/A"}},{"$f":"IF(ISTEXT('S3'!$F$21),NA(),'S3'!$F$21)","v":{"$error":"#N/A"}},{"$f":"ROUND(AVERAGE(K25:K28),2)","v":{"$error":"#N/A"}},{"$f":"IF(ISTEXT('S3'!$E$22),NA(),'S3'!$E$22)","v":{"$error":"#N/A"}},{"$f":"ROUND(AVERAGE(M25:M28),2)","v":{"$error":"#N/A"}}]
[{"$f":"IF(ISBLANK('S3'!G$8),\" \",'S3'!G$8)","v":" "},{"$f":"IF(ISTEXT('S3'!$H$14),NA(),'S3'!$H$14)","v":{"$error":"#N/A"}},{"$f":"IF(ISTEXT('S3'!$H$15),NA(),'S3'!$H$15)","v":{"$error":"#N/A"}},{"$f":"IF(ISTEXT('S3'!$H$16),NA(),'S3'!$H$16)","v":{"$error":"#N/A"}},{"$f":"IF(ISTEXT('S3'!$H$17),NA(),'S3'!$H$17)","v":{"$error":"#N/A"}},{"$f":"IF(ISTEXT('S3'!$H$18),NA(),'S3'!$H$18)","v":{"$error":"#N/A"}},{"$f":"IF(ISTEXT('S3'!$H$19),NA(),'S3'!$H$19)","v":{"$error":"#N/A"}},{"$f":"ROUND(AVERAGE(G27:G29),0)","v":{"$error":"#N/A"}},{"$f":"IF(ISTEXT('S3'!$H$20),NA(),'S3'!$H$20)","v":{"$error":"#N/A"}},{"$f":"ROUND(AVERAGE(I27:I29),0)","v":{"$error":"#N/A"}},{"$f":"IF(ISTEXT('S3'!$H$21),NA(),'S3'!$H$21)","v":{"$error":"#N/A"}},{"$f":"ROUND(AVERAGE(K27:K29),2)","v":{"$error":"#N/A"}},{"$f":"IF(ISTEXT('S3'!$G$22),NA(),'S3'!$G$22)","v":{"$error":"#N/A"}},{"$f":"ROUND(AVERAGE(M27:M29),2)","v":{"$error":"#N/A"}}]
[{"$f":"IF(ISBLANK('S3'!I$8),\" \",'S3'!I$8)","v":" "},{"$f":"IF(ISTEXT('S3'!$J$14),NA(),'S3'!$J$14)","v":{"$error":"#N/A"}},{"$f":"IF(ISTEXT('S3'!$J$15),NA(),'S3'!$J$15)","v":{"$error":"#N/A"}},{"$f":"IF(ISTEXT('S3'!$J$16),NA(),'S3'!$J$16)","v":{"$error":"#N/A"}},{"$f":"IF(ISTEXT('S3'!$J$17),NA(),'S3'!$J$17)","v":{"$error":"#N/A"}},{"$f":"IF(ISTEXT('S3'!$J$18),NA(),'S3'!$J$18)","v":{"$error":"#N/A"}},{"$f":"IF(ISTEXT('S3'!$J$19),NA(),'S3'!$J$19)","v":{"$error":"#N/A"}},{"$f":"ROUND(AVERAGE(G28:G30),0)","v":{"$error":"#N/A"}},{"$f":"IF(ISTEXT('S3'!$J$20),NA(),'S3'!$J$20)","v":{"$error":"#N/A"}},{"$error":"#N/A"},{"$f":"IF(ISTEXT('S3'!$J$21),NA(),'S3'!$J$21)","v":{"$error":"#N/A"}},{"$error":"#N/A"},{"$f":"IF(ISTEXT('S3'!$I$22),NA(),'S3'!$I$22)","v":{"$error":"#N/A"}},{"$error":"#N/A"}]
[{"$f":"IF(ISBLANK('S3'!K$8),\" \",'S3'!K$8)","v":" "},{"$f":"IF(ISTEXT('S3'!$L$14),NA(),'S3'!$L$14)","v":{"$error":"#N/A"}},{"$f":"IF(ISTEXT('S3'!$L$15),NA(),'S3'!$L$15)","v":{"$error":"#N/A"}},{"$f":"IF(ISTEXT('S3'!$L$16),NA(),'S3'!$L$16)","v":{"$error":"#N/A"}},{"$f":"IF(ISTEXT('S3'!$L$17),NA(),'S3'!$L$17)","v":{"$error":"#N/A"}},{"$f":"IF(ISTEXT('S3'!$L$18),NA(),'S3'!$L$18)","v":{"$error":"#N/A"}},{"$f":"IF(ISTEXT('S3'!$L$19),NA(),'S3'!$L$19)","v":{"$error":"#N/A"}},{"$error":"#N/A"},{"$f":"IF(ISTEXT('S3'!$L$20),NA(),'S3'!$L$20)","v":{"$error":"#N/A"}},{"$error":"#N/A"},{"$f":"IF(ISTEXT('S3'!$L$21),NA(),'S3'!$L$21)","v":{"$error":"#N/A"}},{"$error":"#N/A"},{"$f":"IF(ISTEXT('S3'!$K$22),NA(),'S3'!$K$22)","v":{"$error":"#N/A"}},{"$error":"#N/A"}]
[{"$f":"IF(ISBLANK('S3'!M$8),\" \",'S3'!M$8)","v":" "},{"$f":"IF(ISTEXT('S3'!$N$14),NA(),'S3'!$N$14)","v":{"$error":"#N/A"}},{"$f":"IF(ISTEXT('S3'!$N$15),NA(),'S3'!$N$15)","v":{"$error":"#N/A"}},{"$f":"IF(ISTEXT('S3'!$N$16),NA(),'S3'!$N$16)","v":{"$error":"#N/A"}},{"$f":"IF(ISTEXT('S3'!$N$17),NA(),'S3'!$N$17)","v":{"$error":"#N/A"}},{"$f":"IF(ISTEXT('S3'!$N$18),NA(),'S3'!$N$18)","v":{"$error":"#N/A"}},{"$f":"IF(ISTEXT('S3'!$N$19),NA(),'S3'!$N$19)","v":{"$error":"#N/A"}},{"$error":"#N/A"},{"$f":"IF(ISTEXT('S3'!$N$20),NA(),'S3'!$N$20)","v":{"$error":"#N/A"}},{"$error":"#N/A"},{"$f":"IF(ISTEXT('S3'!$N$21),NA(),'S3'!$N$21)","v":{"$error":"#N/A"}},{"$error":"#N/A"},{"$f":"IF(ISTEXT('S3'!$M$22),NA(),'S3'!$M$22)","v":{"$error":"#N/A"}},{"$error":"#N/A"}]
[{"$f":"IF(ISBLANK('S3'!C$28),\" \",'S3'!C$28)","v":" "},{"$f":"IF(ISTEXT('S3'!$D$34),NA(),'S3'!$D$34)","v":{"$error":"#N/A"}},{"$f":"IF(ISTEXT('S3'!$D$35),NA(),'S3'!$D$35)","v":{"$error":"#N/A"}},{"$f":"IF(ISTEXT('S3'!$D$36),NA(),'S3'!$D$36)","v":{"$error":"#N/A"}},{"$f":"IF(ISTEXT('S3'!$D$37),NA(),'S3'!$D$37)","v":{"$error":"#N/A"}},{"$f":"IF(ISTEXT('S3'!$D$38),NA(),'S3'!$D$38)","v":{"$error":"#N/A"}},{"$f":"IF(ISTEXT('S3'!$D$39),NA(),'S3'!$D$39)","v":{"$error":"#N/A"}},{"$error":"#N/A"},{"$f":"IF(ISTEXT('S3'!$D$40),NA(),'S3'!$D$40)","v":{"$error":"#N/A"}},{"$error":"#N/A"},{"$f":"IF(ISTEXT('S3'!$D$41),NA(),'S3'!$D$41)","v":{"$error":"#N/A"}},{"$error":"#N/A"},{"$f":"IF(ISTEXT('S3'!$C$42),NA(),'S3'!$C$42)","v":{"$error":"#N/A"}},{"$error":"#N/A"}]
[{"$f":"IF(ISBLANK('S3'!E$28),\" \",'S3'!E$28)","v":" "},{"$f":"IF(ISTEXT('S3'!$F$34),NA(),'S3'!$F$34)","v":{"$error":"#N/A"}},{"$f":"IF(ISTEXT('S3'!$F$35),NA(),'S3'!$F$35)","v":{"$error":"#N/A"}},{"$f":"IF(ISTEXT('S3'!$F$36),NA(),'S3'!$F$36)","v":{"$error":"#N/A"}},{"$f":"IF(ISTEXT('S3'!$F$37),NA(),'S3'!$F$37)","v":{"$error":"#N/A"}},{"$f":"IF(ISTEXT('S3'!$F$38),NA(),'S3'!$F$38)","v":{"$error":"#N/A"}},{"$f":"IF(ISTEXT('S3'!$F$39),NA(),'S3'!$F$39)","v":{"$error":"#N/A"}},{"$error":"#N/A"},{"$f":"IF(ISTEXT('S3'!$F$40),NA(),'S3'!$F$40)","v":{"$error":"#N/A"}},{"$error":"#N/A"},{"$f":"IF(ISTEXT('S3'!$F$41),NA(),'S3'!$F$41)","v":{"$error":"#N/A"}},{"$error":"#N/A"},{"$f":"IF(ISTEXT('S3'!$E$42),NA(),'S3'!$E$42)","v":{"$error":"#N/A"}},{"$error":"#N/A"}]
[{"$f":"IF(ISBLANK('S3'!G$28),\" \",'S3'!G$28)","v":" "},{"$f":"IF(ISTEXT('S3'!$H$34),NA(),'S3'!$H$34)","v":{"$error":"#N/A"}},{"$f":"IF(ISTEXT('S3'!$H$35),NA(),'S3'!$H$35)","v":{"$error":"#N/A"}},{"$f":"IF(ISTEXT('S3'!$H$36),NA(),'S3'!$H$36)","v":{"$error":"#N/A"}},{"$f":"IF(ISTEXT('S3'!$H$37),NA(),'S3'!$H$37)","v":{"$error":"#N/A"}},{"$f":"IF(ISTEXT('S3'!$H$38),NA(),'S3'!$H$38)","v":{"$error":"#N/A"}},{"$f":"IF(ISTEXT('S3'!$H$39),NA(),'S3'!$H$39)","v":{"$error":"#N/A"}},{"$error":"#N/A"},{"$f":"IF(ISTEXT('S3'!$H$40),NA(),'S3'!$H$40)","v":{"$error":"#N/A"}},{"$error":"#N/A"},{"$f":"IF(ISTEXT('S3'!$H$41),NA(),'S3'!$H$41)","v":{"$error":"#N/A"}},{"$error":"#N/A"},{"$f":"IF(ISTEXT('S3'!$G$42),NA(),'S3'!$G$42)","v":{"$error":"#N/A"}},{"$error":"#N/A"}]
[{"$f":"IF(ISBLANK('S3'!I$28),\" \",'S3'!I$28)","v":" "},{"$f":"IF(ISTEXT('S3'!$J$34),NA(),'S3'!$J$34)","v":{"$error":"#N/A"}},{"$f":"IF(ISTEXT('S3'!$J$35),NA(),'S3'!$J$35)","v":{"$error":"#N/A"}},{"$f":"IF(ISTEXT('S3'!$J$36),NA(),'S3'!$J$36)","v":{"$error":"#N/A"}},{"$f":"IF(ISTEXT('S3'!$J$37),NA(),'S3'!$J$37)","v":{"$error":"#N/A"}},{"$f":"IF(ISTEXT('S3'!$J$38),NA(),'S3'!$J$38)","v":{"$error":"#N/A"}},{"$f":"IF(ISTEXT('S3'!$J$39),NA(),'S3'!$J$39)","v":{"$error":"#N/A"}},{"$error":"#N/A"},{"$f":"IF(ISTEXT('S3'!$J$40),NA(),'S3'!$J$40)","v":{"$error":"#N/A"}},{"$error":"#N/A"},{"$f":"IF(ISTEXT('S3'!$J$41),NA(),'S3'!$J$41)","v":{"$error":"#N/A"}},{"$error":"#N/A"},{"$f":"IF(ISTEXT('S3'!$I$42),NA(),'S3'!$I$42)","v":{"$error":"#N/A"}},{"$error":"#N/A"}]
[{"$f":"IF(ISBLANK('S3'!K$28),\" \",'S3'!K$28)","v":" "},{"$f":"IF(ISTEXT('S3'!$L$34),NA(),'S3'!$L$34)","v":{"$error":"#N/A"}},{"$f":"IF(ISTEXT('S3'!$L$35),NA(),'S3'!$L$35)","v":{"$error":"#N/A"}},{"$f":"IF(ISTEXT('S3'!$L$36),NA(),'S3'!$L$36)","v":{"$error":"#N/A"}},{"$f":"IF(ISTEXT('S3'!$L$37),NA(),'S3'!$L$37)","v":{"$error":"#N/A"}},{"$f":"IF(ISTEXT('S3'!$L$38),NA(),'S3'!$L$38)","v":{"$error":"#N/A"}},{"$f":"IF(ISTEXT('S3'!$L$39),NA(),'S3'!$L$39)","v":{"$error":"#N/A"}},{"$error":"#N/A"},{"$f":"IF(ISTEXT('S3'!$L$40),NA(),'S3'!$L$40)","v":{"$error":"#N/A"}},{"$error":"#N/A"},{"$f":"IF(ISTEXT('S3'!$L$41),NA(),'S3'!$L$41)","v":{"$error":"#N/A"}},{"$error":"#N/A"},{"$f":"IF(ISTEXT('S3'!$K$42),NA(),'S3'!$K$42)","v":{"$error":"#N/A"}},{"$error":"#N/A"}]
[{"$f":"IF(ISBLANK('S3'!M$28),\" \",'S3'!M$28)","v":" "},{"$f":"IF(ISTEXT('S3'!$N$34),NA(),'S3'!$N$34)","v":{"$error":"#N/A"}},{"$f":"IF(ISTEXT('S3'!$N$35),NA(),'S3'!$N$35)","v":{"$error":"#N/A"}},{"$f":"IF(ISTEXT('S3'!$N$36),NA(),'S3'!$N$36)","v":{"$error":"#N/A"}},{"$f":"IF(ISTEXT('S3'!$N$37),NA(),'S3'!$N$37)","v":{"$error":"#N/A"}},{"$f":"IF(ISTEXT('S3'!$N$38),NA(),'S3'!$N$38)","v":{"$error":"#N/A"}},{"$f":"IF(ISTEXT('S3'!$N$39),NA(),'S3'!$N$39)","v":{"$error":"#N/A"}},{"$error":"#N/A"},{"$f":"IF(ISTEXT('S3'!$N$40),NA(),'S3'!$N$40)","v":{"$error":"#N/A"}},{"$error":"#N/A"},{"$f":"IF(ISTEXT('S3'!$N$41),NA(),'S3'!$N$41)","v":{"$error":"#N/A"}},{"$error":"#N/A"},{"$f":"IF(ISTEXT('S3'!$M$42),NA(),'S3'!$M$42)","v":{"$error":"#N/A"}},{"$error":"#N/A"}]
[{"$f":"IF(ISBLANK('S4'!C$8),\" \",'S4'!C$8)","v":" "},{"$f":"IF(ISTEXT('S4'!$D$14),NA(),'S4'!$D$14)","v":{"$error":"#N/A"}},{"$f":"IF(ISTEXT('S4'!$D$15),NA(),'S4'!$D$15)","v":{"$error":"#N/A"}},{"$f":"IF(ISTEXT('S4'!$D$16),NA(),'S4'!$D$16)","v":{"$error":"#N/A"}},{"$f":"IF(ISTEXT('S4'!$D$17),NA(),'S4'!$D$17)","v":{"$error":"#N/A"}},{"$f":"IF(ISTEXT('S4'!$D$18),NA(),'S4'!$D$18)","v":{"$error":"#N/A"}},{"$f":"IF(ISTEXT('S4'!$D$19),NA(),'S4'!$D$19)","v":{"$error":"#N/A"}},{"$error":"#N/A"},{"$f":"IF(ISTEXT('S4'!$D$20),NA(),'S4'!$D$20)","v":{"$error":"#N/A"}},{"$error":"#N/A"},{"$f":"IF(ISTEXT('S4'!$D$21),NA(),'S4'!$D$21)","v":{"$error":"#N/A"}},{"$error":"#N/A"},{"$f":"IF(ISTEXT('S4'!$C$22),NA(),'S4'!$C$22)","v":{"$error":"#N/A"}},{"$error":"#N/A"}]
[{"$f":"IF(ISBLANK('S4'!E$8),\" \",'S4'!E$8)","v":" "},{"$f":"IF(ISTEXT('S4'!$F$14),NA(),'S4'!$F$14)","v":{"$error":"#N/A"}},{"$f":"IF(ISTEXT('S4'!$F$15),NA(),'S4'!$F$15)","v":{"$error":"#N/A"}},{"$f":"IF(ISTEXT('S4'!$F$16),NA(),'S4'!$F$16)","v":{"$error":"#N/A"}},{"$f":"IF(ISTEXT('S4'!$F$17),NA(),'S4'!$F$17)","v":{"$error":"#N/A"}},{"$f":"IF(ISTEXT('S4'!$F$18),NA(),'S4'!$F$18)","v":{"$error":"#N/A"}},{"$f":"IF(ISTEXT('S4'!$F$19),NA(),'S4'!$F$19)","v":{"$error":"#N/A"}},{"$error":"#N/A"},{"$f":"IF(ISTEXT('S4'!$F$20),NA(),'S4'!$F$20)","v":{"$error":"#N/A"}},{"$error":"#N/A"},{"$f":"IF(ISTEXT('S4'!$F$21),NA(),'S4'!$F$21)","v":{"$error":"#N/A"}},{"$error":"#N/A"},{"$f":"IF(ISTEXT('S4'!$E$22),NA(),'S4'!$E$22)","v":{"$error":"#N/A"}},{"$error":"#N/A"}]
[{"$f":"IF(ISBLANK('S4'!G$8),\" \",'S4'!G$8)","v":" "},{"$f":"IF(ISTEXT('S4'!$H$14),NA(),'S4'!$H$14)","v":{"$error":"#N/A"}},{"$f":"IF(ISTEXT('S4'!$H$15),NA(),'S4'!$H$15)","v":{"$error":"#N/A"}},{"$f":"IF(ISTEXT('S4'!$H$16),NA(),'S4'!$H$16)","v":{"$error":"#N/A"}},{"$f":"IF(ISTEXT('S4'!$H$17),NA(),'S4'!$H$17)","v":{"$error":"#N/A"}},{"$f":"IF(ISTEXT('S4'!$H$18),NA(),'S4'!$H$18)","v":{"$error":"#N/A"}},{"$f":"IF(ISTEXT('S4'!$H$19),NA(),'S4'!$H$19)","v":{"$error":"#N/A"}},{"$error":"#N/A"},{"$f":"IF(ISTEXT('S4'!$H$20),NA(),'S4'!$H$20)","v":{"$error":"#N/A"}},{"$error":"#N/A"},{"$f":"IF(ISTEXT('S4'!$H$21),NA(),'S4'!$H$21)","v":{"$error":"#N/A"}},{"$error":"#N/A"},{"$f":"IF(ISTEXT('S4'!$G$22),NA(),'S4'!$G$22)","v":{"$error":"#N/A"}},{"$error":"#N/A"}]
[{"$f":"IF(ISBLANK('S4'!I$8),\" \",'S4'!I$8)","v":" "},{"$f":"IF(ISTEXT('S4'!$J$14),NA(),'S4'!$J$14)","v":{"$error":"#N/A"}},{"$f":"IF(ISTEXT('S4'!$J$15),NA(),'S4'!$J$15)","v":{"$error":"#N/A"}},{"$f":"IF(ISTEXT('S4'!$J$16),NA(),'S4'!$J$16)","v":{"$error":"#N/A"}},{"$f":"IF(ISTEXT('S4'!$J$17),NA(),'S4'!$J$17)","v":{"$error":"#N/A"}},{"$f":"IF(ISTEXT('S4'!$J$18),NA(),'S4'!$J$18)","v":{"$error":"#N/A"}},{"$f":"IF(ISTEXT('S4'!$J$19),NA(),'S4'!$J$19)","v":{"$error":"#N/A"}},{"$error":"#N/A"},{"$f":"IF(ISTEXT('S4'!$J$20),NA(),'S4'!$J$20)","v":{"$error":"#N/A"}},{"$error":"#N/A"},{"$f":"IF(ISTEXT('S4'!$J$21),NA(),'S4'!$J$21)","v":{"$error":"#N/A"}},{"$error":"#N/A"},{"$f":"IF(ISTEXT('S4'!$I$22),NA(),'S4'!$I$22)","v":{"$error":"#N/A"}},{"$error":"#N/A"}]
[{"$f":"IF(ISBLANK('S4'!K$8),\" \",'S4'!K$8)","v":" "},{"$f":"IF(ISTEXT('S4'!$L$14),NA(),'S4'!$L$14)","v":{"$error":"#N/A"}},{"$f":"IF(ISTEXT('S4'!$L$15),NA(),'S4'!$L$15)","v":{"$error":"#N/A"}},{"$f":"IF(ISTEXT('S4'!$L$16),NA(),'S4'!$L$16)","v":{"$error":"#N/A"}},{"$f":"IF(ISTEXT('S4'!$L$17),NA(),'S4'!$L$17)","v":{"$error":"#N/A"}},{"$f":"IF(ISTEXT('S4'!$L$18),NA(),'S4'!$L$18)","v":{"$error":"#N/A"}},{"$f":"IF(ISTEXT('S4'!$L$19),NA(),'S4'!$L$19)","v":{"$error":"#N/A"}},{"$error":"#N/A"},{"$f":"IF(ISTEXT('S4'!$L$20),NA(),'S4'!$L$20)","v":{"$error":"#N/A"}},{"$error":"#N/A"},{"$f":"IF(ISTEXT('S4'!$L$21),NA(),'S4'!$L$21)","v":{"$error":"#N/A"}},{"$error":"#N/A"},{"$f":"IF(ISTEXT('S4'!$K$22),NA(),'S4'!$K$22)","v":{"$error":"#N/A"}},{"$error":"#N/A"}]
[{"$f":"IF(ISBLANK('S4'!M$8),\" \",'S4'!M$8)","v":" "},{"$f":"IF(ISTEXT('S4'!$N$14),NA(),'S4'!$N$14)","v":{"$error":"#N/A"}},{"$f":"IF(ISTEXT('S4'!$N$15),NA(),'S4'!$N$15)","v":{"$error":"#N/A"}},{"$f":"IF(ISTEXT('S4'!$N$16),NA(),'S4'!$N$16)","v":{"$error":"#N/A"}},{"$f":"IF(ISTEXT('S4'!$N$17),NA(),'S4'!$N$17)","v":{"$error":"#N/A"}},{"$f":"IF(ISTEXT('S4'!$N$18),NA(),'S4'!$N$18)","v":{"$error":"#N/A"}},{"$f":"IF(ISTEXT('S4'!$N$19),NA(),'S4'!$N$19)","v":{"$error":"#N/A"}},{"$error":"#N/A"},{"$f":"IF(ISTEXT('S4'!$N$20),NA(),'S4'!$N$20)","v":{"$error":"#N/A"}},{"$error":"#N/A"},{"$f":"IF(ISTEXT('S4'!$N$21),NA(),'S4'!$N$21)","v":{"$error":"#N/A"}},{"$error":"#N/A"},{"$f":"IF(ISTEXT('S4'!$M$22),NA(),'S4'!$M$22)","v":{"$error":"#N/A"}},{"$error":"#N/A"}]
[{"$f":"IF(ISBLANK('S4'!C$28),\" \",'S4'!C$28)","v":" "},{"$f":"IF(ISTEXT('S4'!$D$34),NA(),'S4'!$D$34)","v":{"$error":"#N/A"}},{"$f":"IF(ISTEXT('S4'!$D$35),NA(),'S4'!$D$35)","v":{"$error":"#N/A"}},{"$f":"IF(ISTEXT('S4'!$D$36),NA(),'S4'!$D$36)","v":{"$error":"#N/A"}},{"$f":"IF(ISTEXT('S4'!$D$37),NA(),'S4'!$D$37)","v":{"$error":"#N/A"}},{"$f":"IF(ISTEXT('S4'!$D$38),NA(),'S4'!$D$38)","v":{"$error":"#N/A"}},{"$f":"IF(ISTEXT('S4'!$D$39),NA(),'S4'!$D$39)","v":{"$error":"#N/A"}},{"$error":"#N/A"},{"$f":"IF(ISTEXT('S4'!$D$40),NA(),'S4'!$D$40)","v":{"$error":"#N/A"}},{"$error":"#N/A"},{"$f":"IF(ISTEXT('S4'!$D$41),NA(),'S4'!$D$41)","v":{"$error":"#N/A"}},{"$error":"#N/A"},{"$f":"IF(ISTEXT('S4'!$C$42),NA(),'S4'!$C$42)","v":{"$error":"#N/A"}},{"$error":"#N/A"}]
[{"$f":"IF(ISBLANK('S4'!E$28),\" \",'S4'!E$28)","v":" "},{"$f":"IF(ISTEXT('S4'!$F$34),NA(),'S4'!$F$34)","v":{"$error":"#N/A"}},{"$f":"IF(ISTEXT('S4'!$F$35),NA(),'S4'!$F$35)","v":{"$error":"#N/A"}},{"$f":"IF(ISTEXT('S4'!$F$36),NA(),'S4'!$F$36)","v":{"$error":"#N/A"}},{"$f":"IF(ISTEXT('S4'!$F$37),NA(),'S4'!$F$37)","v":{"$error":"#N/A"}},{"$f":"IF(ISTEXT('S4'!$F$38),NA(),'S4'!$F$38)","v":{"$error":"#N/A"}},{"$f":"IF(ISTEXT('S4'!$F$39),NA(),'S4'!$F$39)","v":{"$error":"#N/A"}},{"$error":"#N/A"},{"$f":"IF(ISTEXT('S4'!$F$40),NA(),'S4'!$F$40)","v":{"$error":"#N/A"}},{"$error":"#N/A"},{"$f":"IF(ISTEXT('S4'!$F$41),NA(),'S4'!$F$41)","v":{"$error":"#N/A"}},{"$error":"#N/A"},{"$f":"IF(ISTEXT('S4'!$E$42),NA(),'S4'!$E$42)","v":{"$error":"#N/A"}},{"$error":"#N/A"}]
[{"$f":"IF(ISBLANK('S4'!G$28),\" \",'S4'!G$28)","v":" "},{"$f":"IF(ISTEXT('S4'!$H$34),NA(),'S4'!$H$34)","v":{"$error":"#N/A"}},{"$f":"IF(ISTEXT('S4'!$H$35),NA(),'S4'!$H$35)","v":{"$error":"#N/A"}},{"$f":"IF(ISTEXT('S4'!$H$36),NA(),'S4'!$H$36)","v":{"$error":"#N/A"}},{"$f":"IF(ISTEXT('S4'!$H$37),NA(),'S4'!$H$37)","v":{"$error":"#N/A"}},{"$f":"IF(ISTEXT('S4'!$H$38),NA(),'S4'!$H$38)","v":{"$error":"#N/A"}},{"$f":"IF(ISTEXT('S4'!$H$39),NA(),'S4'!$H$39)","v":{"$error":"#N/A"}},{"$error":"#N/A"},{"$f":"IF(ISTEXT('S4'!$H$40),NA(),'S4'!$H$40)","v":{"$error":"#N/A"}},{"$error":"#N/A"},{"$f":"IF(ISTEXT('S4'!$H$41),NA(),'S4'!$H$41)","v":{"$error":"#N/A"}},{"$error":"#N/A"},{"$f":"IF(ISTEXT('S4'!$G$42),NA(),'S4'!$G$42)","v":{"$error":"#N/A"}},{"$error":"#N/A"}]
[{"$f":"IF(ISBLANK('S4'!I$28),\" \",'S4'!I$28)","v":" "},{"$f":"IF(ISTEXT('S4'!$J$34),NA(),'S4'!$J$34)","v":{"$error":"#N/A"}},{"$f":"IF(ISTEXT('S4'!$J$35),NA(),'S4'!$J$35)","v":{"$error":"#N/A"}},{"$f":"IF(ISTEXT('S4'!$J$36),NA(),'S4'!$J$36)","v":{"$error":"#N/A"}},{"$f":"IF(ISTEXT('S4'!$J$37),NA(),'S4'!$J$37)","v":{"$error":"#N/A"}},{"$f":"IF(ISTEXT('S4'!$J$38),NA(),'S4'!$J$38)","v":{"$error":"#N/A"}},{"$f":"IF(ISTEXT('S4'!$J$39),NA(),'S4'!$J$39)","v":{"$error":"#N/A"}},{"$error":"#N/A"},{"$f":"IF(ISTEXT('S4'!$J$40),NA(),'S4'!$J$40)","v":{"$error":"#N/A"}},{"$error":"#N/A"},{"$f":"IF(ISTEXT('S4'!$J$41),NA(),'S4'!$J$41)","v":{"$error":"#N/A"}},{"$error":"#N/A"},{"$f":"IF(ISTEXT('S4'!$I$42),NA(),'S4'!$I$42)","v":{"$error":"#N/A"}},{"$error":"#N/A"}]
[{"$f":"IF(ISBLANK('S4'!K$28),\" \",'S4'!K$28)","v":" "},{"$f":"IF(ISTEXT('S4'!$L$34),NA(),'S4'!$L$34)","v":{"$error":"#N/A"}},{"$f":"IF(ISTEXT('S4'!$L$35),NA(),'S4'!$L$35)","v":{"$error":"#N/A"}},{"$f":"IF(ISTEXT('S4'!$L$36),NA(),'S4'!$L$36)","v":{"$error":"#N/A"}},{"$f":"IF(ISTEXT('S4'!$L$37),NA(),'S4'!$L$37)","v":{"$error":"#N/A"}},{"$f":"IF(ISTEXT('S4'!$L$38),NA(),'S4'!$L$38)","v":{"$error":"#N/A"}},{"$f":"IF(ISTEXT('S4'!$L$39),NA(),'S4'!$L$39)","v":{"$error":"#N/A"}},{"$error":"#N/A"},{"$f":"IF(ISTEXT('S4'!$L$40),NA(),'S4'!$L$40)","v":{"$error":"#N/A"}},{"$error":"#N/A"},{"$f":"IF(ISTEXT('S4'!$L$41),NA(),'S4'!$L$41)","v":{"$error":"#N/A"}},{"$error":"#N/A"},{"$f":"IF(ISTEXT('S4'!$K$42),NA(),'S4'!$K$42)","v":{"$error":"#N/A"}},{"$error":"#N/A"}]
[{"$f":"IF(ISBLANK('S4'!M$28),\" \",'S4'!M$28)","v":" "},{"$f":"IF(ISTEXT('S4'!$N$34),NA(),'S4'!$N$34)","v":{"$error":"#N/A"}},{"$f":"IF(ISTEXT('S4'!$N$35),NA(),'S4'!$N$35)","v":{"$error":"#N/A"}},{"$f":"IF(ISTEXT('S4'!$N$36),NA(),'S4'!$N$36)","v":{"$error":"#N/A"}},{"$f":"IF(ISTEXT('S4'!$N$37),NA(),'S4'!$N$37)","v":{"$error":"#N/A"}},{"$f":"IF(ISTEXT('S4'!$N$38),NA(),'S4'!$N$38)","v":{"$error":"#N/A"}},{"$f":"IF(ISTEXT('S4'!$N$39),NA(),'S4'!$N$39)","v":{"$error":"#N/A"}},{"$error":"#N/A"},{"$f":"IF(ISTEXT('S4'!$N$40),NA(),'S4'!$N$40)","v":{"$error":"#N/A"}},{"$error":"#N/A"},{"$f":"IF(ISTEXT('S4'!$N$41),NA(),'S4'!$N$41)","v":{"$error":"#N/A"}},{"$error":"#N/A"},{"$f":"IF(ISTEXT('S4'!$M$42),NA(),'S4'!$M$42)","v":{"$error":"#N/A"}},{"$error":"#N/A"}]
[]
[{"$f":"IF(ISBLANK('S5'!C$8),\" \",'S5'!C$8)","v":" "},{"$f":"IF(ISTEXT('S5'!$D$14),NA(),'S5'!$D$14)","v":{"$error":"#N/A"}},{"$f":"IF(ISTEXT('S5'!$D$15),NA(),'S5'!$D$15)","v":{"$error":"#N/A"}},{"$f":"IF(ISTEXT('S5'!$D$16),NA(),'S5'!$D$16)","v":{"$error":"#N/A"}},{"$f":"IF(ISTEXT('S5'!$D$17),NA(),'S5'!$D$17)","v":{"$error":"#N/A"}},{"$f":"IF(ISTEXT('S5'!$D$18),NA(),'S5'!$D$18)","v":{"$error":"#N/A"}},{"$f":"IF(ISTEXT('S5'!$D$19),NA(),'S5'!$D$19)","v":{"$error":"#N/A"}},{"$f":"ROUND(AVERAGE(G49:G52),0)","v":{"$error":"#N/A"}},{"$f":"IF(ISTEXT('S5'!$D$20),NA(),'S5'!$D$20)","v":{"$error":"#N/A"}},{"$f":"ROUND(AVERAGE(I49:I52),0)","v":{"$error":"#N/A"}},{"$f":"IF(ISTEXT('S5'!$D$21),NA(),'S5'!$D$21)","v":{"$error":"#N/A"}},{"$f":"ROUND(AVERAGE(K49:K52),2)","v":{"$error":"#N/A"}},{"$f":"IF(ISTEXT('S5'!$C$22),NA(),'S5'!$C$22)","v":{"$error":"#N/A"}},{"$f":"ROUND(AVERAGE(M49:M52),2)","v":{"$error":"#N/A"}}]
[{"$f":"IF(ISBLANK('S5'!E$8),\" \",'S5'!E$8)","v":" "},{"$f":"IF(ISTEXT('S5'!$F$14),NA(),'S5'!$F$14)","v":{"$error":"#N/A"}},{"$f":"IF(ISTEXT('S5'!$F$15),NA(),'S5'!$F$15)","v":{"$error":"#N/A"}},{"$f":"IF(ISTEXT('S5'!$F$16),NA(),'S5'!$F$16)","v":{"$error":"#N/A"}},{"$f":"IF(ISTEXT('S5'!$F$17),NA(),'S5'!$F$17)","v":{"$error":"#N/A"}},{"$f":"IF(ISTEXT('S5'!$F$18),NA(),'S5'!$F$18)","v":{"$error":"#N/A"}},{"$f":"IF(ISTEXT('S5'!$F$19),NA(),'S5'!$F$19)","v":{"$error":"#N/A"}},{"$f":"ROUND(AVERAGE(G50:G53),0)","v":{"$error":"#N/A"}},{"$f":"IF(ISTEXT('S5'!$F$20),NA(),'S5'!$F$20)","v":{"$error":"#N/A"}},{"$f":"ROUND(AVERAGE(I50:I53),0)","v":{"$error":"#N/A"}},{"$f":"IF(ISTEXT('S5'!$F$21),NA(),'S5'!$F$21)","v":{"$error":"#N/A"}},{"$f":"ROUND(AVERAGE(K50:K53),2)","v":{"$error":"#N/A"}},{"$f":"IF(ISTEXT('S5'!$E$22),NA(),'S5'!$E$22)","v":{"$error":"#N/A"}},{"$f":"ROUND(AVERAGE(M50:M53),2)","v":{"$error":"#N/A"}}]
[{"$f":"IF(ISBLANK('S5'!G$8),\" \",'S5'!G$8)","v":" "},{"$f":"IF(ISTEXT('S5'!$H$14),NA(),'S5'!$H$14)","v":{"$error":"#N/A"}},{"$f":"IF(ISTEXT('S5'!$H$15),NA(),'S5'!$H$15)","v":{"$error":"#N/A"}},{"$f":"IF(ISTEXT('S5'!$H$16),NA(),'S5'!$H$16)","v":{"$error":"#N/A"}},{"$f":"IF(ISTEXT('S5'!$H$17),NA(),'S5'!$H$17)","v":{"$error":"#N/A"}},{"$f":"IF(ISTEXT('S5'!$H$18),NA(),'S5'!$H$18)","v":{"$error":"#N/A"}},{"$f":"IF(ISTEXT('S5'!$H$19),NA(),'S5'!$H$19)","v":{"$error":"#N/A"}},{"$f":"ROUND(AVERAGE(G52:G54),0)","v":{"$error":"#N/A"}},{"$f":"IF(ISTEXT('S5'!$H$20),NA(),'S5'!$H$20)","v":{"$error":"#N/A"}},{"$f":"ROUND(AVERAGE(I52:I54),0)","v":{"$error":"#N/A"}},{"$f":"IF(ISTEXT('S5'!$H$21),NA(),'S5'!$H$21)","v":{"$error":"#N/A"}},{"$f":"ROUND(AVERAGE(K52:K54),2)","v":{"$error":"#N/A"}},{"$f":"IF(ISTEXT('S5'!$G$22),NA(),'S5'!$G$22)","v":{"$error":"#N/A"}},{"$f":"ROUND(AVERAGE(M52:M54),2)","v":{"$error":"#N/A"}}]
[{"$f":"IF(ISBLANK('S5'!I$8),\" \",'S5'!I$8)","v":" "},{"$f":"IF(ISTEXT('S5'!$J$14),NA(),'S5'!$J$14)","v":{"$error":"#N/A"}},{"$f":"IF(ISTEXT('S5'!$J$15),NA(),'S5'!$J$15)","v":{"$error":"#N/A"}},{"$f":"IF(ISTEXT('S5'!$J$16),NA(),'S5'!$J$16)","v":{"$error":"#N/A"}},{"$f":"IF(ISTEXT('S5'!$J$17),NA(),'S5'!$J$17)","v":{"$error":"#N/A"}},{"$f":"IF(ISTEXT('S5'!$J$18),NA(),'S5'!$J$18)","v":{"$error":"#N/A"}},{"$f":"IF(ISTEXT('S5'!$J$19),NA(),'S5'!$J$19)","v":{"$error":"#N/A"}},{"$f":"ROUND(AVERAGE(G53:G55),0)","v":{"$error":"#N/A"}},{"$f":"IF(ISTEXT('S5'!$J$20),NA(),'S5'!$J$20)","v":{"$error":"#N/A"}},{"$error":"#N/A"},{"$f":"IF(ISTEXT('S5'!$J$21),NA(),'S5'!$J$21)","v":{"$error":"#N/A"}},{"$error":"#N/A"},{"$f":"IF(ISTEXT('S5'!$I$22),NA(),'S5'!$I$22)","v":{"$error":"#N/A"}},{"$error":"#N/A"}]
[{"$f":"IF(ISBLANK('S5'!K$8),\" \",'S5'!K$8)","v":" "},{"$f":"IF(ISTEXT('S5'!$L$14),NA(),'S5'!$L$14)","v":{"$error":"#N/A"}},{"$f":"IF(ISTEXT('S5'!$L$15),NA(),'S5'!$L$15)","v":{"$error":"#N/A"}},{"$f":"IF(ISTEXT('S5'!$L$16),NA(),'S5'!$L$16)","v":{"$error":"#N/A"}},{"$f":"IF(ISTEXT('S5'!$L$17),NA(),'S5'!$L$17)","v":{"$error":"#N/A"}},{"$f":"IF(ISTEXT('S5'!$L$18),NA(),'S5'!$L$18)","v":{"$error":"#N/A"}},{"$f":"IF(ISTEXT('S5'!$L$19),NA(),'S5'!$L$19)","v":{"$error":"#N/A"}},{"$error":"#N/A"},{"$f":"IF(ISTEXT('S5'!$L$20),NA(),'S5'!$L$20)","v":{"$error":"#N/A"}},{"$error":"#N/A"},{"$f":"IF(ISTEXT('S5'!$L$21),NA(),'S5'!$L$21)","v":{"$error":"#N/A"}},{"$error":"#N/A"},{"$f":"IF(ISTEXT('S5'!$K$22),NA(),'S5'!$K$22)","v":{"$error":"#N/A"}},{"$error":"#N/A"}]
[{"$f":"IF(ISBLANK('S5'!M$8),\" \",'S5'!M$8)","v":" "},{"$f":"IF(ISTEXT('S5'!$N$14),NA(),'S5'!$N$14)","v":{"$error":"#N/A"}},{"$f":"IF(ISTEXT('S5'!$N$15),NA(),'S5'!$N$15)","v":{"$error":"#N/A"}},{"$f":"IF(ISTEXT('S5'!$N$16),NA(),'S5'!$N$16)","v":{"$error":"#N/A"}},{"$f":"IF(ISTEXT('S5'!$N$17),NA(),'S5'!$N$17)","v":{"$error":"#N/A"}},{"$f":"IF(ISTEXT('S5'!$N$18),NA(),'S5'!$N$18)","v":{"$error":"#N/A"}},{"$f":"IF(ISTEXT('S5'!$N$19),NA(),'S5'!$N$19)","v":{"$error":"#N/A"}},{"$error":"#N/A"},{"$f":"IF(ISTEXT('S5'!$N$20),NA(),'S5'!$N$20)","v":{"$error":"#N/A"}},{"$error":"#N/A"},{"$f":"IF(ISTEXT('S5'!$N$21),NA(),'S5'!$N$21)","v":{"$error":"#N/A"}},{"$error":"#N/A"},{"$f":"IF(ISTEXT('S5'!$M$22),NA(),'S5'!$M$22)","v":{"$error":"#N/A"}},{"$error":"#N/A"}]
[{"$f":"IF(ISBLANK('S5'!C$28),\" \",'S5'!C$28)","v":" "},{"$f":"IF(ISTEXT('S5'!$D$34),NA(),'S5'!$D$34)","v":{"$error":"#N/A"}},{"$f":"IF(ISTEXT('S5'!$D$35),NA(),'S5'!$D$35)","v":{"$error":"#N/A"}},{"$f":"IF(ISTEXT('S5'!$D$36),NA(),'S5'!$D$36)","v":{"$error":"#N/A"}},{"$f":"IF(ISTEXT('S5'!$D$37),NA(),'S5'!$D$37)","v":{"$error":"#N/A"}},{"$f":"IF(ISTEXT('S5'!$D$38),NA(),'S5'!$D$38)","v":{"$error":"#N/A"}},{"$f":"IF(ISTEXT('S5'!$D$39),NA(),'S5'!$D$39)","v":{"$error":"#N/A"}},{"$error":"#N/A"},{"$f":"IF(ISTEXT('S5'!$D$40),NA(),'S5'!$D$40)","v":{"$error":"#N/A"}},{"$error":"#N/A"},{"$f":"IF(ISTEXT('S5'!$D$41),NA(),'S5'!$D$41)","v":{"$error":"#N/A"}},{"$error":"#N/A"},{"$f":"IF(ISTEXT('S5'!$C$42),NA(),'S5'!$C$42)","v":{"$error":"#N/A"}},{"$error":"#N/A"}]
[{"$f":"IF(ISBLANK('S5'!E$28),\" \",'S5'!E$28)","v":" "},{"$f":"IF(ISTEXT('S5'!$F$34),NA(),'S5'!$F$34)","v":{"$error":"#N/A"}},{"$f":"IF(ISTEXT('S5'!$F$35),NA(),'S5'!$F$35)","v":{"$error":"#N/A"}},{"$f":"IF(ISTEXT('S5'!$F$36),NA(),'S5'!$F$36)","v":{"$error":"#N/A"}},{"$f":"IF(ISTEXT('S5'!$F$37),NA(),'S5'!$F$37)","v":{"$error":"#N/A"}},{"$f":"IF(ISTEXT('S5'!$F$38),NA(),'S5'!$F$38)","v":{"$error":"#N/A"}},{"$f":"IF(ISTEXT('S5'!$F$39),NA(),'S5'!$F$39)","v":{"$error":"#N/A"}},{"$error":"#N/A"},{"$f":"IF(ISTEXT('S5'!$F$40),NA(),'S5'!$F$40)","v":{"$error":"#N/A"}},{"$error":"#N/A"},{"$f":"IF(ISTEXT('S5'!$F$41),NA(),'S5'!$F$41)","v":{"$error":"#N/A"}},{"$error":"#N/A"},{"$f":"IF(ISTEXT('S5'!$E$42),NA(),'S5'!$E$42)","v":{"$error":"#N/A"}},{"$error":"#N/A"}]
[{"$f":"IF(ISBLANK('S5'!G$28),\" \",'S5'!G$28)","v":" "},{"$f":"IF(ISTEXT('S5'!$H$34),NA(),'S5'!$H$34)","v":{"$error":"#N/A"}},{"$f":"IF(ISTEXT('S5'!$H$35),NA(),'S5'!$H$35)","v":{"$error":"#N/A"}},{"$f":"IF(ISTEXT('S5'!$H$36),NA(),'S5'!$H$36)","v":{"$error":"#N/A"}},{"$f":"IF(ISTEXT('S5'!$H$37),NA(),'S5'!$H$37)","v":{"$error":"#N/A"}},{"$f":"IF(ISTEXT('S5'!$H$38),NA(),'S5'!$H$38)","v":{"$error":"#N/A"}},{"$f":"IF(ISTEXT('S5'!$H$39),NA(),'S5'!$H$39)","v":{"$error":"#N/A"}},{"$error":"#N/A"},{"$f":"IF(ISTEXT('S5'!$H$40),NA(),'S5'!$H$40)","v":{"$error":"#N/A"}},{"$error":"#N/A"},{"$f":"IF(ISTEXT('S5'!$H$41),NA(),'S5'!$H$41)","v":{"$error":"#N/A"}},{"$error":"#N/A"},{"$f":"IF(ISTEXT('S5'!$G$42),NA(),'S5'!$G$42)","v":{"$error":"#N/A"}},{"$error":"#N/A"}]
[{"$f":"IF(ISBLANK('S5'!I$28),\" \",'S5'!I$28)","v":" "},{"$f":"IF(ISTEXT('S5'!$J$34),NA(),'S5'!$J$34)","v":{"$error":"#N/A"}},{"$f":"IF(ISTEXT('S5'!$J$35),NA(),'S5'!$J$35)","v":{"$error":"#N/A"}},{"$f":"IF(ISTEXT('S5'!$J$36),NA(),'S5'!$J$36)","v":{"$error":"#N/A"}},{"$f":"IF(ISTEXT('S5'!$J$37),NA(),'S5'!$J$37)","v":{"$error":"#N/A"}},{"$f":"IF(ISTEXT('S5'!$J$38),NA(),'S5'!$J$38)","v":{"$error":"#N/A"}},{"$f":"IF(ISTEXT('S5'!$J$39),NA(),'S5'!$J$39)","v":{"$error":"#N/A"}},{"$error":"#N/A"},{"$f":"IF(ISTEXT('S5'!$J$40),NA(),'S5'!$J$40)","v":{"$error":"#N/A"}},{"$error":"#N/A"},{"$f":"IF(ISTEXT('S5'!$J$41),NA(),'S5'!$J$41)","v":{"$error":"#N/A"}},{"$error":"#N/A"},{"$f":"IF(ISTEXT('S5'!$I$42),NA(),'S5'!$I$42)","v":{"$error":"#N/A"}},{"$error":"#N/A"}]
[{"$f":"IF(ISBLANK('S5'!K$28),\" \",'S5'!K$28)","v":" "},{"$f":"IF(ISTEXT('S5'!$L$34),NA(),'S5'!$L$34)","v":{"$error":"#N/A"}},{"$f":"IF(ISTEXT('S5'!$L$35),NA(),'S5'!$L$35)","v":{"$error":"#N/A"}},{"$f":"IF(ISTEXT('S5'!$L$36),NA(),'S5'!$L$36)","v":{"$error":"#N/A"}},{"$f":"IF(ISTEXT('S5'!$L$37),NA(),'S5'!$L$37)","v":{"$error":"#N/A"}},{"$f":"IF(ISTEXT('S5'!$L$38),NA(),'S5'!$L$38)","v":{"$error":"#N/A"}},{"$f":"IF(ISTEXT('S5'!$L$39),NA(),'S5'!$L$39)","v":{"$error":"#N/A"}},{"$error":"#N/A"},{"$f":"IF(ISTEXT('S5'!$L$40),NA(),'S5'!$L$40)","v":{"$error":"#N/A"}},{"$error":"#N/A"},{"$f":"IF(ISTEXT('S5'!$L$41),NA(),'S5'!$L$41)","v":{"$error":"#N/A"}},{"$error":"#N/A"},{"$f":"IF(ISTEXT('S5'!$K$42),NA(),'S5'!$K$42)","v":{"$error":"#N/A"}},{"$error":"#N/A"}]
[{"$f":"IF(ISBLANK('S5'!M$28),\" \",'S5'!M$28)","v":" "},{"$f":"IF(ISTEXT('S5'!$N$34),NA(),'S5'!$N$34)","v":{"$error":"#N/A"}},{"$f":"IF(ISTEXT('S5'!$N$35),NA(),'S5'!$N$35)","v":{"$error":"#N/A"}},{"$f":"IF(ISTEXT('S5'!$N$36),NA(),'S5'!$N$36)","v":{"$error":"#N/A"}},{"$f":"IF(ISTEXT('S5'!$N$37),NA(),'S5'!$N$37)","v":{"$error":"#N/A"}},{"$f":"IF(ISTEXT('S5'!$N$38),NA(),'S5'!$N$38)","v":{"$error":"#N/A"}},{"$f":"IF(ISTEXT('S5'!$N$39),NA(),'S5'!$N$39)","v":{"$error":"#N/A"}},{"$error":"#N/A"},{"$f":"IF(ISTEXT('S5'!$N$40),NA(),'S5'!$N$40)","v":{"$error":"#N/A"}},{"$error":"#N/A"},{"$f":"IF(ISTEXT('S5'!$N$41),NA(),'S5'!$N$41)","v":{"$error":"#N/A"}},{"$error":"#N/A"},{"$f":"IF(ISTEXT('S5'!$M$42),NA(),'S5'!$M$42)","v":{"$error":"#N/A"}},{"$error":"#N/A"}]
[{"$f":"IF(ISBLANK('S6'!C$8),\" \",'S6'!C$8)","v":" "},{"$f":"IF(ISTEXT('S6'!$D$14),NA(),'S6'!$D$14)","v":{"$error":"#N/A"}},{"$f":"IF(ISTEXT('S6'!$D$15),NA(),'S6'!$D$15)","v":{"$error":"#N/A"}},{"$f":"IF(ISTEXT('S6'!$D$16),NA(),'S6'!$D$16)","v":{"$error":"#N/A"}},{"$f":"IF(ISTEXT('S6'!$D$17),NA(),'S6'!$D$17)","v":{"$error":"#N/A"}},{"$f":"IF(ISTEXT('S6'!$D$18),NA(),'S6'!$D$18)","v":{"$error":"#N/A"}},{"$f":"IF(ISTEXT('S6'!$D$19),NA(),'S6'!$D$19)","v":{"$error":"#N/A"}},{"$error":"#N/A"},{"$f":"IF(ISTEXT('S6'!$D$20),NA(),'S6'!$D$20)","v":{"$error":"#N/A"}},{"$error":"#N/A"},{"$f":"IF(ISTEXT('S6'!$D$21),NA(),'S6'!$D$21)","v":{"$error":"#N/A"}},{"$error":"#N/A"},{"$f":"IF(ISTEXT('S6'!$C$22),NA(),'S6'!$C$22)","v":{"$error":"#N/A"}},{"$error":"#N/A"}]
[{"$f":"IF(ISBLANK('S6'!E$8),\" \",'S6'!E$8)","v":" "},{"$f":"IF(ISTEXT('S6'!$F$14),NA(),'S6'!$F$14)","v":{"$error":"#N/A"}},{"$f":"IF(ISTEXT('S6'!$F$15),NA(),'S6'!$F$15)","v":{"$error":"#N/A"}},{"$f":"IF(ISTEXT('S6'!$F$16),NA(),'S6'!$F$16)","v":{"$error":"#N/A"}},{"$f":"IF(ISTEXT('S6'!$F$17),NA(),'S6'!$F$17)","v":{"$error":"#N/A"}},{"$f":"IF(ISTEXT('S6'!$F$18),NA(),'S6'!$F$18)","v":{"$error":"#N/A"}},{"$f":"IF(ISTEXT('S6'!$F$19),NA(),'S6'!$F$19)","v":{"$error":"#N/A"}},{"$error":"#N/A"},{"$f":"IF(ISTEXT('S6'!$F$20),NA(),'S6'!$F$20)","v":{"$error":"#N/A"}},{"$error":"#N/A"},{"$f":"IF(ISTEXT('S6'!$F$21),NA(),'S6'!$F$21)","v":{"$error":"#N/A"}},{"$error":"#N/A"},{"$f":"IF(ISTEXT('S6'!$E$22),NA(),'S6'!$E$22)","v":{"$error":"#N/A"}},{"$error":"#N/A"}]
[{"$f":"IF(ISBLANK('S6'!G$8),\" \",'S6'!G$8)","v":" "},{"$f":"IF(ISTEXT('S6'!$H$14),NA(),'S6'!$H$14)","v":{"$error":"#N/A"}},{"$f":"IF(ISTEXT('S6'!$H$15),NA(),'S6'!$H$15)","v":{"$error":"#N/A"}},{"$f":"IF(ISTEXT('S6'!$H$16),NA(),'S6'!$H$16)","v":{"$error":"#N/A"}},{"$f":"IF(ISTEXT('S6'!$H$17),NA(),'S6'!$H$17)","v":{"$error":"#N/A"}},{"$f":"IF(ISTEXT('S6'!$H$18),NA(),'S6'!$H$18)","v":{"$error":"#N/A"}},{"$f":"IF(ISTEXT('S6'!$H$19),NA(),'S6'!$H$19)","v":{"$error":"#N/A"}},{"$error":"#N/A"},{"$f":"IF(ISTEXT('S6'!$H$20),NA(),'S6'!$H$20)","v":{"$error":"#N/A"}},{"$error":"#N/A"},{"$f":"IF(ISTEXT('S6'!$H$21),NA(),'S6'!$H$21)","v":{"$error":"#N/A"}},{"$error":"#N/A"},{"$f":"IF(ISTEXT('S6'!$G$22),NA(),'S6'!$G$22)","v":{"$error":"#N/A"}},{"$error":"#N/A"}]
[{"$f":"IF(ISBLANK('S6'!I$8),\" \",'S6'!I$8)","v":" "},{"$f":"IF(ISTEXT('S6'!$J$14),NA(),'S6'!$J$14)","v":{"$error":"#N/A"}},{"$f":"IF(ISTEXT('S6'!$J$15),NA(),'S6'!$J$15)","v":{"$error":"#N/A"}},{"$f":"IF(ISTEXT('S6'!$J$16),NA(),'S6'!$J$16)","v":{"$error":"#N/A"}},{"$f":"IF(ISTEXT('S6'!$J$17),NA(),'S6'!$J$17)","v":{"$error":"#N/A"}},{"$f":"IF(ISTEXT('S6'!$J$18),NA(),'S6'!$J$18)","v":{"$error":"#N/A"}},{"$f":"IF(ISTEXT('S6'!$J$19),NA(),'S6'!$J$19)","v":{"$error":"#N/A"}},{"$error":"#N/A"},{"$f":"IF(ISTEXT('S6'!$J$20),NA(),'S6'!$J$20)","v":{"$error":"#N/A"}},{"$error":"#N/A"},{"$f":"IF(ISTEXT('S6'!$J$21),NA(),'S6'!$J$21)","v":{"$error":"#N/A"}},{"$error":"#N/A"},{"$f":"IF(ISTEXT('S6'!$I$22),NA(),'S6'!$I$22)","v":{"$error":"#N/A"}},{"$error":"#N/A"}]
[{"$f":"IF(ISBLANK('S6'!K$8),\" \",'S6'!K$8)","v":" "},{"$f":"IF(ISTEXT('S6'!$L$14),NA(),'S6'!$L$14)","v":{"$error":"#N/A"}},{"$f":"IF(ISTEXT('S6'!$L$15),NA(),'S6'!$L$15)","v":{"$error":"#N/A"}},{"$f":"IF(ISTEXT('S6'!$L$16),NA(),'S6'!$L$16)","v":{"$error":"#N/A"}},{"$f":"IF(ISTEXT('S6'!$L$17),NA(),'S6'!$L$17)","v":{"$error":"#N/A"}},{"$f":"IF(ISTEXT('S6'!$L$18),NA(),'S6'!$L$18)","v":{"$error":"#N/A"}},{"$f":"IF(ISTEXT('S6'!$L$19),NA(),'S6'!$L$19)","v":{"$error":"#N/A"}},{"$error":"#N/A"},{"$f":"IF(ISTEXT('S6'!$L$20),NA(),'S6'!$L$20)","v":{"$error":"#N/A"}},{"$error":"#N/A"},{"$f":"IF(ISTEXT('S6'!$L$21),NA(),'S6'!$L$21)","v":{"$error":"#N/A"}},{"$error":"#N/A"},{"$f":"IF(ISTEXT('S6'!$K$22),NA(),'S6'!$K$22)","v":{"$error":"#N/A"}},{"$error":"#N/A"}]
[{"$f":"IF(ISBLANK('S6'!M$8),\" \",'S6'!M$8)","v":" "},{"$f":"IF(ISTEXT('S6'!$N$14),NA(),'S6'!$N$14)","v":{"$error":"#N/A"}},{"$f":"IF(ISTEXT('S6'!$N$15),NA(),'S6'!$N$15)","v":{"$error":"#N/A"}},{"$f":"IF(ISTEXT('S6'!$N$16),NA(),'S6'!$N$16)","v":{"$error":"#N/A"}},{"$f":"IF(ISTEXT('S6'!$N$17),NA(),'S6'!$N$17)","v":{"$error":"#N/A"}},{"$f":"IF(ISTEXT('S6'!$N$18),NA(),'S6'!$N$18)","v":{"$error":"#N/A"}},{"$f":"IF(ISTEXT('S6'!$N$19),NA(),'S6'!$N$19)","v":{"$error":"#N/A"}},{"$error":"#N/A"},{"$f":"IF(ISTEXT('S6'!$N$20),NA(),'S6'!$N$20)","v":{"$error":"#N/A"}},{"$error":"#N/A"},{"$f":"IF(ISTEXT('S6'!$N$21),NA(),'S6'!$N$21)","v":{"$error":"#N/A"}},{"$error":"#N/A"},{"$f":"IF(ISTEXT('S6'!$M$22),NA(),'S6'!$M$22)","v":{"$error":"#N/A"}},{"$error":"#N/A"}]
[{"$f":"IF(ISBLANK('S6'!C$28),\" \",'S6'!C$28)","v":" "},{"$f":"IF(ISTEXT('S6'!$D$34),NA(),'S6'!$D$34)","v":{"$error":"#N/A"}},{"$f":"IF(ISTEXT('S6'!$D$35),NA(),'S6'!$D$35)","v":{"$error":"#N/A"}},{"$f":"IF(ISTEXT('S6'!$D$36),NA(),'S6'!$D$36)","v":{"$error":"#N/A"}},{"$f":"IF(ISTEXT('S6'!$D$37),NA(),'S6'!$D$37)","v":{"$error":"#N/A"}},{"$f":"IF(ISTEXT('S6'!$D$38),NA(),'S6'!$D$38)","v":{"$error":"#N/A"}},{"$f":"IF(ISTEXT('S6'!$D$39),NA(),'S6'!$D$39)","v":{"$error":"#N/A"}},{"$error":"#N/A"},{"$f":"IF(ISTEXT('S6'!$D$40),NA(),'S6'!$D$40)","v":{"$error":"#N/A"}},{"$error":"#N/A"},{"$f":"IF(ISTEXT('S6'!$D$41),NA(),'S6'!$D$41)","v":{"$error":"#N/A"}},{"$error":"#N/A"},{"$f":"IF(ISTEXT('S6'!$C$42),NA(),'S6'!$C$42)","v":{"$error":"#N/A"}},{"$error":"#N/A"}]
[{"$f":"IF(ISBLANK('S6'!E$28),\" \",'S6'!E$28)","v":" "},{"$f":"IF(ISTEXT('S6'!$F$34),NA(),'S6'!$F$34)","v":{"$error":"#N/A"}},{"$f":"IF(ISTEXT('S6'!$F$35),NA(),'S6'!$F$35)","v":{"$error":"#N/A"}},{"$f":"IF(ISTEXT('S6'!$F$36),NA(),'S6'!$F$36)","v":{"$error":"#N/A"}},{"$f":"IF(ISTEXT('S6'!$F$37),NA(),'S6'!$F$37)","v":{"$error":"#N/A"}},{"$f":"IF(ISTEXT('S6'!$F$38),NA(),'S6'!$F$38)","v":{"$error":"#N/A"}},{"$f":"IF(ISTEXT('S6'!$F$39),NA(),'S6'!$F$39)","v":{"$error":"#N/A"}},{"$error":"#N/A"},{"$f":"IF(ISTEXT('S6'!$F$40),NA(),'S6'!$F$40)","v":{"$error":"#N/A"}},{"$error":"#N/A"},{"$f":"IF(ISTEXT('S6'!$F$41),NA(),'S6'!$F$41)","v":{"$error":"#N/A"}},{"$error":"#N/A"},{"$f":"IF(ISTEXT('S6'!$E$42),NA(),'S6'!$E$42)","v":{"$error":"#N/A"}},{"$error":"#N/A"}]
[{"$f":"IF(ISBLANK('S6'!G$28),\" \",'S6'!G$28)","v":" "},{"$f":"IF(ISTEXT('S6'!$H$34),NA(),'S6'!$H$34)","v":{"$error":"#N/A"}},{"$f":"IF(ISTEXT('S6'!$H$35),NA(),'S6'!$H$35)","v":{"$error":"#N/A"}},{"$f":"IF(ISTEXT('S6'!$H$36),NA(),'S6'!$H$36)","v":{"$error":"#N/A"}},{"$f":"IF(ISTEXT('S6'!$H$37),NA(),'S6'!$H$37)","v":{"$error":"#N/A"}},{"$f":"IF(ISTEXT('S6'!$H$38),NA(),'S6'!$H$38)","v":{"$error":"#N/A"}},{"$f":"IF(ISTEXT('S6'!$H$39),NA(),'S6'!$H$39)","v":{"$error":"#N/A"}},{"$error":"#N/A"},{"$f":"IF(ISTEXT('S6'!$H$40),NA(),'S6'!$H$40)","v":{"$error":"#N/A"}},{"$error":"#N/A"},{"$f":"IF(ISTEXT('S6'!$H$41),NA(),'S6'!$H$41)","v":{"$error":"#N/A"}},{"$error":"#N/A"},{"$f":"IF(ISTEXT('S6'!$G$42),NA(),'S6'!$G$42)","v":{"$error":"#N/A"}},{"$error":"#N/A"}]
[{"$f":"IF(ISBLANK('S6'!I$28),\" \",'S6'!I$28)","v":" "},{"$f":"IF(ISTEXT('S6'!$J$34),NA(),'S6'!$J$34)","v":{"$error":"#N/A"}},{"$f":"IF(ISTEXT('S6'!$J$35),NA(),'S6'!$J$35)","v":{"$error":"#N/A"}},{"$f":"IF(ISTEXT('S6'!$J$36),NA(),'S6'!$J$36)","v":{"$error":"#N/A"}},{"$f":"IF(ISTEXT('S6'!$J$37),NA(),'S6'!$J$37)","v":{"$error":"#N/A"}},{"$f":"IF(ISTEXT('S6'!$J$38),NA(),'S6'!$J$38)","v":{"$error":"#N/A"}},{"$f":"IF(ISTEXT('S6'!$J$39),NA(),'S6'!$J$39)","v":{"$error":"#N/A"}},{"$error":"#N/A"},{"$f":"IF(ISTEXT('S6'!$J$40),NA(),'S6'!$J$40)","v":{"$error":"#N/A"}},{"$error":"#N/A"},{"$f":"IF(ISTEXT('S6'!$J$41),NA(),'S6'!$J$41)","v":{"$error":"#N/A"}},{"$error":"#N/A"},{"$f":"IF(ISTEXT('S6'!$I$42),NA(),'S6'!$I$42)","v":{"$error":"#N/A"}},{"$error":"#N/A"}]
[{"$f":"IF(ISBLANK('S6'!K$28),\" \",'S6'!K$28)","v":" "},{"$f":"IF(ISTEXT('S6'!$L$34),NA(),'S6'!$L$34)","v":{"$error":"#N/A"}},{"$f":"IF(ISTEXT('S6'!$L$35),NA(),'S6'!$L$35)","v":{"$error":"#N/A"}},{"$f":"IF(ISTEXT('S6'!$L$36),NA(),'S6'!$L$36)","v":{"$error":"#N/A"}},{"$f":"IF(ISTEXT('S6'!$L$37),NA(),'S6'!$L$37)","v":{"$error":"#N/A"}},{"$f":"IF(ISTEXT('S6'!$L$38),NA(),'S6'!$L$38)","v":{"$error":"#N/A"}},{"$f":"IF(ISTEXT('S6'!$L$39),NA(),'S6'!$L$39)","v":{"$error":"#N/A"}},{"$error":"#N/A"},{"$f":"IF(ISTEXT('S6'!$L$40),NA(),'S6'!$L$40)","v":{"$error":"#N/A"}},{"$error":"#N/A"},{"$f":"IF(ISTEXT('S6'!$L$41),NA(),'S6'!$L$41)","v":{"$error":"#N/A"}},{"$error":"#N/A"},{"$f":"IF(ISTEXT('S6'!$K$42),NA(),'S6'!$K$42)","v":{"$error":"#N/A"}},{"$error":"#N/A"}]
[{"$f":"IF(ISBLANK('S6'!M$28),\" \",'S6'!M$28)","v":" "},{"$f":"IF(ISTEXT('S6'!$N$34),NA(),'S6'!$N$34)","v":{"$error":"#N/A"}},{"$f":"IF(ISTEXT('S6'!$N$35),NA(),'S6'!$N$35)","v":{"$error":"#N/A"}},{"$f":"IF(ISTEXT('S6'!$N$36),NA(),'S6'!$N$36)","v":{"$error":"#N/A"}},{"$f":"IF(ISTEXT('S6'!$N$37),NA(),'S6'!$N$37)","v":{"$error":"#N/A"}},{"$f":"IF(ISTEXT('S6'!$N$38),NA(),'S6'!$N$38)","v":{"$error":"#N/A"}},{"$f":"IF(ISTEXT('S6'!$N$39),NA(),'S6'!$N$39)","v":{"$error":"#N/A"}},{"$error":"#N/A"},{"$f":"IF(ISTEXT('S6'!$N$40),NA(),'S6'!$N$40)","v":{"$error":"#N/A"}},{"$error":"#N/A"},{"$f":"IF(ISTEXT('S6'!$N$41),NA(),'S6'!$N$41)","v":{"$error":"#N/A"}},{"$error":"#N/A"},{"$f":"IF(ISTEXT('S6'!$M$42),NA(),'S6'!$M$42)","v":{"$error":"#N/A"}},{"$error":"#N/A"}]
[]
[{"$f":"IF(ISBLANK('S7'!C$8),\" \",'S7'!C$8)","v":" "},{"$f":"IF(ISTEXT('S7'!$D$14),NA(),'S7'!$D$14)","v":{"$error":"#N/A"}},{"$f":"IF(ISTEXT('S7'!$D$15),NA(),'S7'!$D$15)","v":{"$error":"#N/A"}},{"$f":"IF(ISTEXT('S7'!$D$16),NA(),'S7'!$D$16)","v":{"$error":"#N/A"}},{"$f":"IF(ISTEXT('S7'!$D$17),NA(),'S7'!$D$17)","v":{"$error":"#N/A"}},{"$f":"IF(ISTEXT('S7'!$D$18),NA(),'S7'!$D$18)","v":{"$error":"#N/A"}},{"$f":"IF(ISTEXT('S7'!$D$19),NA(),'S7'!$D$19)","v":{"$error":"#N/A"}},{"$f":"ROUND(AVERAGE(G74:G77),0)","v":{"$error":"#N/A"}},{"$f":"IF(ISTEXT('S7'!$D$20),NA(),'S7'!$D$20)","v":{"$error":"#N/A"}},{"$f":"ROUND(AVERAGE(I74:I77),0)","v":{"$error":"#N/A"}},{"$f":"IF(ISTEXT('S7'!$D$21),NA(),'S7'!$D$21)","v":{"$error":"#N/A"}},{"$f":"ROUND(AVERAGE(K74:K77),2)","v":{"$error":"#N/A"}},{"$f":"IF(ISTEXT('S7'!$C$22),NA(),'S7'!$C$22)","v":{"$error":"#N/A"}},{"$f":"ROUND(AVERAGE(M74:M77),2)","v":{"$error":"#N/A"}}]
[{"$f":"IF(ISBLANK('S7'!E$8),\" \",'S7'!E$8)","v":" "},{"$f":"IF(ISTEXT('S7'!$F$14),NA(),'S7'!$F$14)","v":{"$error":"#N/A"}},{"$f":"IF(ISTEXT('S7'!$F$15),NA(),'S7'!$F$15)","v":{"$error":"#N/A"}},{"$f":"IF(ISTEXT('S7'!$F$16),NA(),'S7'!$F$16)","v":{"$error":"#N/A"}},{"$f":"IF(ISTEXT('S7'!$F$17),NA(),'S7'!$F$17)","v":{"$error":"#N/A"}},{"$f":"IF(ISTEXT('S7'!$F$18),NA(),'S7'!$F$18)","v":{"$error":"#N/A"}},{"$f":"IF(ISTEXT('S7'!$F$19),NA(),'S7'!$F$19)","v":{"$error":"#N/A"}},{"$f":"ROUND(AVERAGE(G75:G78),0)","v":{"$error":"#N/A"}},{"$f":"IF(ISTEXT('S7'!$F$20),NA(),'S7'!$F$20)","v":{"$error":"#N/A"}},{"$f":"ROUND(AVERAGE(I75:I78),0)","v":{"$error":"#N/A"}},{"$f":"IF(ISTEXT('S7'!$F$21),NA(),'S7'!$F$21)","v":{"$error":"#N/A"}},{"$f":"ROUND(AVERAGE(K75:K78),2)","v":{"$error":"#N/A"}},{"$f":"IF(ISTEXT('S7'!$E$22),NA(),'S7'!$E$22)","v":{"$error":"#N/A"}},{"$f":"ROUND(AVERAGE(M75:M78),2)","v":{"$error":"#N/A"}}]
[{"$f":"IF(ISBLANK('S7'!G$8),\" \",'S7'!G$8)","v":" "},{"$f":"IF(ISTEXT('S7'!$H$14),NA(),'S7'!$H$14)","v":{"$error":"#N/A"}},{"$f":"IF(ISTEXT('S7'!$H$15),NA(),'S7'!$H$15)","v":{"$error":"#N/A"}},{"$f":"IF(ISTEXT('S7'!$H$16),NA(),'S7'!$H$16)","v":{"$error":"#N/A"}},{"$f":"IF(ISTEXT('S7'!$H$17),NA(),'S7'!$H$17)","v":{"$error":"#N/A"}},{"$f":"IF(ISTEXT('S7'!$H$18),NA(),'S7'!$H$18)","v":{"$error":"#N/A"}},{"$f":"IF(ISTEXT('S7'!$H$19),NA(),'S7'!$H$19)","v":{"$error":"#N/A"}},{"$f":"ROUND(AVERAGE(G77:G79),0)","v":{"$error":"#N/A"}},{"$f":"IF(ISTEXT('S7'!$H$20),NA(),'S7'!$H$20)","v":{"$error":"#N/A"}},{"$f":"ROUND(AVERAGE(I77:I79),0)","v":{"$error":"#N/A"}},{"$f":"IF(ISTEXT('S7'!$H$21),NA(),'S7'!$H$21)","v":{"$error":"#N/A"}},{"$f":"ROUND(AVERAGE(K77:K79),2)","v":{"$error":"#N/A"}},{"$f":"IF(ISTEXT('S7'!$G$22),NA(),'S7'!$G$22)","v":{"$error":"#N/A"}},{"$f":"ROUND(AVERAGE(M77:M79),2)","v":{"$error":"#N/A"}}]
[{"$f":"IF(ISBLANK('S7'!I$8),\" \",'S7'!I$8)","v":" "},{"$f":"IF(ISTEXT('S7'!$J$14),NA(),'S7'!$J$14)","v":{"$error":"#N/A"}},{"$f":"IF(ISTEXT('S7'!$J$15),NA(),'S7'!$J$15)","v":{"$error":"#N/A"}},{"$f":"IF(ISTEXT('S7'!$J$16),NA(),'S7'!$J$16)","v":{"$error":"#N/A"}},{"$f":"IF(ISTEXT('S7'!$J$17),NA(),'S7'!$J$17)","v":{"$error":"#N/A"}},{"$f":"IF(ISTEXT('S7'!$J$18),NA(),'S7'!$J$18)","v":{"$error":"#N/A"}},{"$f":"IF(ISTEXT('S7'!$J$19),NA(),'S7'!$J$19)","v":{"$error":"#N/A"}},{"$f":"ROUND(AVERAGE(G78:G80),0)","v":{"$error":"#N/A"}},{"$f":"IF(ISTEXT('S7'!$J$20),NA(),'S7'!$J$20)","v":{"$error":"#N/A"}},{"$error":"#N/A"},{"$f":"IF(ISTEXT('S7'!$J$21),NA(),'S7'!$J$21)","v":{"$error":"#N/A"}},{"$error":"#N/A"},{"$f":"IF(ISTEXT('S7'!$I$22),NA(),'S7'!$I$22)","v":{"$error":"#N/A"}},{"$error":"#N/A"}]
[{"$f":"IF(ISBLANK('S7'!K$8),\" \",'S7'!K$8)","v":" "},{"$f":"IF(ISTEXT('S7'!$L$14),NA(),'S7'!$L$14)","v":{"$error":"#N/A"}},{"$f":"IF(ISTEXT('S7'!$L$15),NA(),'S7'!$L$15)","v":{"$error":"#N/A"}},{"$f":"IF(ISTEXT('S7'!$L$16),NA(),'S7'!$L$16)","v":{"$error":"#N/A"}},{"$f":"IF(ISTEXT('S7'!$L$17),NA(),'S7'!$L$17)","v":{"$error":"#N/A"}},{"$f":"IF(ISTEXT('S7'!$L$18),NA(),'S7'!$L$18)","v":{"$error":"#N/A"}},{"$f":"IF(ISTEXT('S7'!$L$19),NA(),'S7'!$L$19)","v":{"$error":"#N/A"}},{"$error":"#N/A"},{"$f":"IF(ISTEXT('S7'!$L$20),NA(),'S7'!$L$20)","v":{"$error":"#N/A"}},{"$error":"#N/A"},{"$f":"IF(ISTEXT('S7'!$L$21),NA(),'S7'!$L$21)","v":{"$error":"#N/A"}},{"$error":"#N/A"},{"$f":"IF(ISTEXT('S7'!$K$22),NA(),'S7'!$K$22)","v":{"$error":"#N/A"}},{"$error":"#N/A"}]
[{"$f":"IF(ISBLANK('S7'!M$8),\" \",'S7'!M$8)","v":" "},{"$f":"IF(ISTEXT('S7'!$N$14),NA(),'S7'!$N$14)","v":{"$error":"#N/A"}},{"$f":"IF(ISTEXT('S7'!$N$15),NA(),'S7'!$N$15)","v":{"$error":"#N/A"}},{"$f":"IF(ISTEXT('S7'!$N$16),NA(),'S7'!$N$16)","v":{"$error":"#N/A"}},{"$f":"IF(ISTEXT('S7'!$N$17),NA(),'S7'!$N$17)","v":{"$error":"#N/A"}},{"$f":"IF(ISTEXT('S7'!$N$18),NA(),'S7'!$N$18)","v":{"$error":"#N/A"}},{"$f":"IF(ISTEXT('S7'!$N$19),NA(),'S7'!$N$19)","v":{"$error":"#N/A"}},{"$error":"#N/A"},{"$f":"IF(ISTEXT('S7'!$N$20),NA(),'S7'!$N$20)","v":{"$error":"#N/A"}},{"$error":"#N/A"},{"$f":"IF(ISTEXT('S7'!$N$21),NA(),'S7'!$N$21)","v":{"$error":"#N/A"}},{"$error":"#N/A"},{"$f":"IF(ISTEXT('S7'!$M$22),NA(),'S7'!$M$22)","v":{"$error":"#N/A"}},{"$error":"#N/A"}]
[{"$f":"IF(ISBLANK('S7'!C$28),\" \",'S7'!C$28)","v":" "},{"$f":"IF(ISTEXT('S7'!$D$34),NA(),'S7'!$D$34)","v":{"$error":"#N/A"}},{"$f":"IF(ISTEXT('S7'!$D$35),NA(),'S7'!$D$35)","v":{"$error":"#N/A"}},{"$f":"IF(ISTEXT('S7'!$D$36),NA(),'S7'!$D$36)","v":{"$error":"#N/A"}},{"$f":"IF(ISTEXT('S7'!$D$37),NA(),'S7'!$D$37)","v":{"$error":"#N/A"}},{"$f":"IF(ISTEXT('S7'!$D$38),NA(),'S7'!$D$38)","v":{"$error":"#N/A"}},{"$f":"IF(ISTEXT('S7'!$D$39),NA(),'S7'!$D$39)","v":{"$error":"#N/A"}},{"$error":"#N/A"},{"$f":"IF(ISTEXT('S7'!$D$40),NA(),'S7'!$D$40)","v":{"$error":"#N/A"}},{"$error":"#N/A"},{"$f":"IF(ISTEXT('S7'!$D$41),NA(),'S7'!$D$41)","v":{"$error":"#N/A"}},{"$error":"#N/A"},{"$f":"IF(ISTEXT('S7'!$C$42),NA(),'S7'!$C$42)","v":{"$error":"#N/A"}},{"$error":"#N/A"}]
[{"$f":"IF(ISBLANK('S7'!E$28),\" \",'S7'!E$28)","v":" "},{"$f":"IF(ISTEXT('S7'!$F$34),NA(),'S7'!$F$34)","v":{"$error":"#N/A"}},{"$f":"IF(ISTEXT('S7'!$F$35),NA(),'S7'!$F$35)","v":{"$error":"#N/A"}},{"$f":"IF(ISTEXT('S7'!$F$36),NA(),'S7'!$F$36)","v":{"$error":"#N/A"}},{"$f":"IF(ISTEXT('S7'!$F$37),NA(),'S7'!$F$37)","v":{"$error":"#N/A"}},{"$f":"IF(ISTEXT('S7'!$F$38),NA(),'S7'!$F$38)","v":{"$error":"#N/A"}},{"$f":"IF(ISTEXT('S7'!$F$39),NA(),'S7'!$F$39)","v":{"$error":"#N/A"}},{"$error":"#N/A"},{"$f":"IF(ISTEXT('S7'!$F$40),NA(),'S7'!$F$40)","v":{"$error":"#N/A"}},{"$error":"#N/A"},{"$f":"IF(ISTEXT('S7'!$F$41),NA(),'S7'!$F$41)","v":{"$error":"#N/A"}},{"$error":"#N/A"},{"$f":"IF(ISTEXT('S7'!$E$42),NA(),'S7'!$E$42)","v":{"$error":"#N/A"}},{"$error":"#N/A"}]
[{"$f":"IF(ISBLANK('S7'!G$28),\" \",'S7'!G$28)","v":" "},{"$f":"IF(ISTEXT('S7'!$H$34),NA(),'S7'!$H$34)","v":{"$error":"#N/A"}},{"$f":"IF(ISTEXT('S7'!$H$35),NA(),'S7'!$H$35)","v":{"$error":"#N/A"}},{"$f":"IF(ISTEXT('S7'!$H$36),NA(),'S7'!$H$36)","v":{"$error":"#N/A"}},{"$f":"IF(ISTEXT('S7'!$H$37),NA(),'S7'!$H$37)","v":{"$error":"#N/A"}},{"$f":"IF(ISTEXT('S7'!$H$38),NA(),'S7'!$H$38)","v":{"$error":"#N/A"}},{"$f":"IF(ISTEXT('S7'!$H$39),NA(),'S7'!$H$39)","v":{"$error":"#N/A"}},{"$error":"#N/A"},{"$f":"IF(ISTEXT('S7'!$H$40),NA(),'S7'!$H$40)","v":{"$error":"#N/A"}},{"$error":"#N/A"},{"$f":"IF(ISTEXT('S7'!$H$41),NA(),'S7'!$H$41)","v":{"$error":"#N/A"}},{"$error":"#N/A"},{"$f":"IF(ISTEXT('S7'!$G$42),NA(),'S7'!$G$42)","v":{"$error":"#N/A"}},{"$error":"#N/A"}]
[{"$f":"IF(ISBLANK('S7'!I$28),\" \",'S7'!I$28)","v":" "},{"$f":"IF(ISTEXT('S7'!$J$34),NA(),'S7'!$J$34)","v":{"$error":"#N/A"}},{"$f":"IF(ISTEXT('S7'!$J$35),NA(),'S7'!$J$35)","v":{"$error":"#N/A"}},{"$f":"IF(ISTEXT('S7'!$J$36),NA(),'S7'!$J$36)","v":{"$error":"#N/A"}},{"$f":"IF(ISTEXT('S7'!$J$37),NA(),'S7'!$J$37)","v":{"$error":"#N/A"}},{"$f":"IF(ISTEXT('S7'!$J$38),NA(),'S7'!$J$38)","v":{"$error":"#N/A"}},{"$f":"IF(ISTEXT('S7'!$J$39),NA(),'S7'!$J$39)","v":{"$error":"#N/A"}},{"$error":"#N/A"},{"$f":"IF(ISTEXT('S7'!$J$40),NA(),'S7'!$J$40)","v":{"$error":"#N/A"}},{"$error":"#N/A"},{"$f":"IF(ISTEXT('S7'!$J$41),NA(),'S7'!$J$41)","v":{"$error":"#N/A"}},{"$error":"#N/A"},{"$f":"IF(ISTEXT('S7'!$I$42),NA(),'S7'!$I$42)","v":{"$error":"#N/A"}},{"$error":"#N/A"}]
[{"$f":"IF(ISBLANK('S7'!K$28),\" \",'S7'!K$28)","v":" "},{"$f":"IF(ISTEXT('S7'!$L$34),NA(),'S7'!$L$34)","v":{"$error":"#N/A"}},{"$f":"IF(ISTEXT('S7'!$L$35),NA(),'S7'!$L$35)","v":{"$error":"#N/A"}},{"$f":"IF(ISTEXT('S7'!$L$36),NA(),'S7'!$L$36)","v":{"$error":"#N/A"}},{"$f":"IF(ISTEXT('S7'!$L$37),NA(),'S7'!$L$37)","v":{"$error":"#N/A"}},{"$f":"IF(ISTEXT('S7'!$L$38),NA(),'S7'!$L$38)","v":{"$error":"#N/A"}},{"$f":"IF(ISTEXT('S7'!$L$39),NA(),'S7'!$L$39)","v":{"$error":"#N/A"}},{"$error":"#N/A"},{"$f":"IF(ISTEXT('S7'!$L$40),NA(),'S7'!$L$40)","v":{"$error":"#N/A"}},{"$error":"#N/A"},{"$f":"IF(ISTEXT('S7'!$L$41),NA(),'S7'!$L$41)","v":{"$error":"#N/A"}},{"$error":"#N/A"},{"$f":"IF(ISTEXT('S7'!$K$42),NA(),'S7'!$K$42)","v":{"$error":"#N/A"}},{"$error":"#N/A"}]
[{"$f":"IF(ISBLANK('S7'!M$28),\" \",'S7'!M$28)","v":" "},{"$f":"IF(ISTEXT('S7'!$N$34),NA(),'S7'!$N$34)","v":{"$error":"#N/A"}},{"$f":"IF(ISTEXT('S7'!$N$35),NA(),'S7'!$N$35)","v":{"$error":"#N/A"}},{"$f":"IF(ISTEXT('S7'!$N$36),NA(),'S7'!$N$36)","v":{"$error":"#N/A"}},{"$f":"IF(ISTEXT('S7'!$N$37),NA(),'S7'!$N$37)","v":{"$error":"#N/A"}},{"$f":"IF(ISTEXT('S7'!$N$38),NA(),'S7'!$N$38)","v":{"$error":"#N/A"}},{"$f":"IF(ISTEXT('S7'!$N$39),NA(),'S7'!$N$39)","v":{"$error":"#N/A"}},{"$error":"#N/A"},{"$f":"IF(ISTEXT('S7'!$N$40),NA(),'S7'!$N$40)","v":{"$error":"#N/A"}},{"$error":"#N/A"},{"$f":"IF(ISTEXT('S7'!$N$41),NA(),'S7'!$N$41)","v":{"$error":"#N/A"}},{"$error":"#N/A"},{"$f":"IF(ISTEXT('S7'!$M$42),NA(),'S7'!$M$42)","v":{"$error":"#N/A"}},{"$error":"#N/A"}]
[{"$f":"IF(ISBLANK('S8'!C$8),\" \",'S8'!C$8)","v":" "},{"$f":"IF(ISTEXT('S8'!$D$14),NA(),'S8'!$D$14)","v":{"$error":"#N/A"}},{"$f":"IF(ISTEXT('S8'!$D$15),NA(),'S8'!$D$15)","v":{"$error":"#N/A"}},{"$f":"IF(ISTEXT('S8'!$D$16),NA(),'S8'!$D$16)","v":{"$error":"#N/A"}},{"$f":"IF(ISTEXT('S8'!$D$17),NA(),'S8'!$D$17)","v":{"$error":"#N/A"}},{"$f":"IF(ISTEXT('S8'!$D$18),NA(),'S8'!$D$18)","v":{"$error":"#N/A"}},{"$f":"IF(ISTEXT('S8'!$D$19),NA(),'S8'!$D$19)","v":{"$error":"#N/A"}},{"$error":"#N/A"},{"$f":"IF(ISTEXT('S8'!$D$20),NA(),'S8'!$D$20)","v":{"$error":"#N/A"}},{"$error":"#N/A"},{"$f":"IF(ISTEXT('S8'!$D$21),NA(),'S8'!$D$21)","v":{"$error":"#N/A"}},{"$error":"#N/A"},{"$f":"IF(ISTEXT('S8'!$C$22),NA(),'S8'!$C$22)","v":{"$error":"#N/A"}},{"$error":"#N/A"}]
[{"$f":"IF(ISBLANK('S8'!E$8),\" \",'S8'!E$8)","v":" "},{"$f":"IF(ISTEXT('S8'!$F$14),NA(),'S8'!$F$14)","v":{"$error":"#N/A"}},{"$f":"IF(ISTEXT('S8'!$F$15),NA(),'S8'!$F$15)","v":{"$error":"#N/A"}},{"$f":"IF(ISTEXT('S8'!$F$16),NA(),'S8'!$F$16)","v":{"$error":"#N/A"}},{"$f":"IF(ISTEXT('S8'!$F$17),NA(),'S8'!$F$17)","v":{"$error":"#N/A"}},{"$f":"IF(ISTEXT('S8'!$F$18),NA(),'S8'!$F$18)","v":{"$error":"#N/A"}},{"$f":"IF(ISTEXT('S8'!$F$19),NA(),'S8'!$F$19)","v":{"$error":"#N/A"}},{"$error":"#N/A"},{"$f":"IF(ISTEXT('S8'!$F$20),NA(),'S8'!$F$20)","v":{"$error":"#N/A"}},{"$error":"#N/A"},{"$f":"IF(ISTEXT('S8'!$F$21),NA(),'S8'!$F$21)","v":{"$error":"#N/A"}},{"$error":"#N/A"},{"$f":"IF(ISTEXT('S8'!$E$22),NA(),'S8'!$E$22)","v":{"$error":"#N/A"}},{"$error":"#N/A"}]
[{"$f":"IF(ISBLANK('S8'!G$8),\" \",'S8'!G$8)","v":" "},{"$f":"IF(ISTEXT('S8'!$H$14),NA(),'S8'!$H$14)","v":{"$error":"#N/A"}},{"$f":"IF(ISTEXT('S8'!$H$15),NA(),'S8'!$H$15)","v":{"$error":"#N/A"}},{"$f":"IF(ISTEXT('S8'!$H$16),NA(),'S8'!$H$16)","v":{"$error":"#N/A"}},{"$f":"IF(ISTEXT('S8'!$H$17),NA(),'S8'!$H$17)","v":{"$error":"#N/A"}},{"$f":"IF(ISTEXT('S8'!$H$18),NA(),'S8'!$H$18)","v":{"$error":"#N/A"}},{"$f":"IF(ISTEXT('S8'!$H$19),NA(),'S8'!$H$19)","v":{"$error":"#N/A"}},{"$error":"#N/A"},{"$f":"IF(ISTEXT('S8'!$H$20),NA(),'S8'!$H$20)","v":{"$error":"#N/A"}},{"$error":"#N/A"},{"$f":"IF(ISTEXT('S8'!$H$21),NA(),'S8'!$H$21)","v":{"$error":"#N/A"}},{"$error":"#N/A"},{"$f":"IF(ISTEXT('S8'!$G$22),NA(),'S8'!$G$22)","v":{"$error":"#N/A"}},{"$error":"#N/A"}]
[{"$f":"IF(ISBLANK('S8'!I$8),\" \",'S8'!I$8)","v":" "},{"$f":"IF(ISTEXT('S8'!$J$14),NA(),'S8'!$J$14)","v":{"$error":"#N/A"}},{"$f":"IF(ISTEXT('S8'!$J$15),NA(),'S8'!$J$15)","v":{"$error":"#N/A"}},{"$f":"IF(ISTEXT('S8'!$J$16),NA(),'S8'!$J$16)","v":{"$error":"#N/A"}},{"$f":"IF(ISTEXT('S8'!$J$17),NA(),'S8'!$J$17)","v":{"$error":"#N/A"}},{"$f":"IF(ISTEXT('S8'!$J$18),NA(),'S8'!$J$18)","v":{"$error":"#N/A"}},{"$f":"IF(ISTEXT('S8'!$J$19),NA(),'S8'!$J$19)","v":{"$error":"#N/A"}},{"$error":"#N/A"},{"$f":"IF(ISTEXT('S8'!$J$20),NA(),'S8'!$J$20)","v":{"$error":"#N/A"}},{"$error":"#N/A"},{"$f":"IF(ISTEXT('S8'!$J$21),NA(),'S8'!$J$21)","v":{"$error":"#N/A"}},{"$error":"#N/A"},{"$f":"IF(ISTEXT('S8'!$I$22),NA(),'S8'!$I$22)","v":{"$error":"#N/A"}},{"$error":"#N/A"}]
[{"$f":"IF(ISBLANK('S8'!K$8),\" \",'S8'!K$8)","v":" "},{"$f":"IF(ISTEXT('S8'!$L$14),NA(),'S8'!$L$14)","v":{"$error":"#N/A"}},{"$f":"IF(ISTEXT('S8'!$L$15),NA(),'S8'!$L$15)","v":{"$error":"#N/A"}},{"$f":"IF(ISTEXT('S8'!$L$16),NA(),'S8'!$L$16)","v":{"$error":"#N/A"}},{"$f":"IF(ISTEXT('S8'!$L$17),NA(),'S8'!$L$17)","v":{"$error":"#N/A"}},{"$f":"IF(ISTEXT('S8'!$L$18),NA(),'S8'!$L$18)","v":{"$error":"#N/A"}},{"$f":"IF(ISTEXT('S8'!$L$19),NA(),'S8'!$L$19)","v":{"$error":"#N/A"}},{"$error":"#N/A"},{"$f":"IF(ISTEXT('S8'!$L$20),NA(),'S8'!$L$20)","v":{"$error":"#N/A"}},{"$error":"#N/A"},{"$f":"IF(ISTEXT('S8'!$L$21),NA(),'S8'!$L$21)","v":{"$error":"#N/A"}},{"$error":"#N/A"},{"$f":"IF(ISTEXT('S8'!$K$22),NA(),'S8'!$K$22)","v":{"$error":"#N/A"}},{"$error":"#N/A"}]
[{"$f":"IF(ISBLANK('S8'!M$8),\" \",'S8'!M$8)","v":" "},{"$f":"IF(ISTEXT('S8'!$N$14),NA(),'S8'!$N$14)","v":{"$error":"#N/A"}},{"$f":"IF(ISTEXT('S8'!$N$15),NA(),'S8'!$N$15)","v":{"$error":"#N/A"}},{"$f":"IF(ISTEXT('S8'!$N$16),NA(),'S8'!$N$16)","v":{"$error":"#N/A"}},{"$f":"IF(ISTEXT('S8'!$N$17),NA(),'S8'!$N$17)","v":{"$error":"#N/A"}},{"$f":"IF(ISTEXT('S8'!$N$18),NA(),'S8'!$N$18)","v":{"$error":"#N/A"}},{"$f":"IF(ISTEXT('S8'!$N$19),NA(),'S8'!$N$19)","v":{"$error":"#N/A"}},{"$error":"#N/A"},{"$f":"IF(ISTEXT('S8'!$N$20),NA(),'S8'!$N$20)","v":{"$error":"#N/A"}},{"$error":"#N/A"},{"$f":"IF(ISTEXT('S8'!$N$21),NA(),'S8'!$N$21)","v":{"$error":"#N/A"}},{"$error":"#N/A"},{"$f":"IF(ISTEXT('S8'!$M$22),NA(),'S8'!$M$22)","v":{"$error":"#N/A"}},{"$error":"#N/A"}]
[{"$f":"IF(ISBLANK('S8'!C$28),\" \",'S8'!C$28)","v":" "},{"$f":"IF(ISTEXT('S8'!$D$34),NA(),'S8'!$D$34)","v":{"$error":"#N/A"}},{"$f":"IF(ISTEXT('S8'!$D$35),NA(),'S8'!$D$35)","v":{"$error":"#N/A"}},{"$f":"IF(ISTEXT('S8'!$D$36),NA(),'S8'!$D$36)","v":{"$error":"#N/A"}},{"$f":"IF(ISTEXT('S8'!$D$37),NA(),'S8'!$D$37)","v":{"$error":"#N/A"}},{"$f":"IF(ISTEXT('S8'!$D$38),NA(),'S8'!$D$38)","v":{"$error":"#N/A"}},{"$f":"IF(ISTEXT('S8'!$D$39),NA(),'S8'!$D$39)","v":{"$error":"#N/A"}},{"$error":"#N/A"},{"$f":"IF(ISTEXT('S8'!$D$40),NA(),'S8'!$D$40)","v":{"$error":"#N/A"}},{"$error":"#N/A"},{"$f":"IF(ISTEXT('S8'!$D$41),NA(),'S8'!$D$41)","v":{"$error":"#N/A"}},{"$error":"#N/A"},{"$f":"IF(ISTEXT('S8'!$C$42),NA(),'S8'!$C$42)","v":{"$error":"#N/A"}},{"$error":"#N/A"}]
[{"$f":"IF(ISBLANK('S8'!E$28),\" \",'S8'!E$28)","v":" "},{"$f":"IF(ISTEXT('S8'!$F$34),NA(),'S8'!$F$34)","v":{"$error":"#N/A"}},{"$f":"IF(ISTEXT('S8'!$F$35),NA(),'S8'!$F$35)","v":{"$error":"#N/A"}},{"$f":"IF(ISTEXT('S8'!$F$36),NA(),'S8'!$F$36)","v":{"$error":"#N/A"}},{"$f":"IF(ISTEXT('S8'!$F$37),NA(),'S8'!$F$37)","v":{"$error":"#N/A"}},{"$f":"IF(ISTEXT('S8'!$F$38),NA(),'S8'!$F$38)","v":{"$error":"#N/A"}},{"$f":"IF(ISTEXT('S8'!$F$39),NA(),'S8'!$F$39)","v":{"$error":"#N/A"}},{"$error":"#N/A"},{"$f":"IF(ISTEXT('S8'!$F$40),NA(),'S8'!$F$40)","v":{"$error":"#N/A"}},{"$error":"#N/A"},{"$f":"IF(ISTEXT('S8'!$F$41),NA(),'S8'!$F$41)","v":{"$error":"#N/A"}},{"$error":"#N/A"},{"$f":"IF(ISTEXT('S8'!$E$42),NA(),'S8'!$E$42)","v":{"$error":"#N/A"}},{"$error":"#N/A"}]
[{"$f":"IF(ISBLANK('S8'!G$28),\" \",'S8'!G$28)","v":" "},{"$f":"IF(ISTEXT('S8'!$H$34),NA(),'S8'!$H$34)","v":{"$error":"#N/A"}},{"$f":"IF(ISTEXT('S8'!$H$35),NA(),'S8'!$H$35)","v":{"$error":"#N/A"}},{"$f":"IF(ISTEXT('S8'!$H$36),NA(),'S8'!$H$36)","v":{"$error":"#N/A"}},{"$f":"IF(ISTEXT('S8'!$H$37),NA(),'S8'!$H$37)","v":{"$error":"#N/A"}},{"$f":"IF(ISTEXT('S8'!$H$38),NA(),'S8'!$H$38)","v":{"$error":"#N/A"}},{"$f":"IF(ISTEXT('S8'!$H$39),NA(),'S8'!$H$39)","v":{"$error":"#N/A"}},{"$error":"#N/A"},{"$f":"IF(ISTEXT('S8'!$H$40),NA(),'S8'!$H$40)","v":{"$error":"#N/A"}},{"$error":"#N/A"},{"$f":"IF(ISTEXT('S8'!$H$41),NA(),'S8'!$H$41)","v":{"$error":"#N/A"}},{"$error":"#N/A"},{"$f":"IF(ISTEXT('S8'!$G$42),NA(),'S8'!$G$42)","v":{"$error":"#N/A"}},{"$error":"#N/A"}]
[{"$f":"IF(ISBLANK('S8'!I$28),\" \",'S8'!I$28)","v":" "},{"$f":"IF(ISTEXT('S8'!$J$34),NA(),'S8'!$J$34)","v":{"$error":"#N/A"}},{"$f":"IF(ISTEXT('S8'!$J$35),NA(),'S8'!$J$35)","v":{"$error":"#N/A"}},{"$f":"IF(ISTEXT('S8'!$J$36),NA(),'S8'!$J$36)","v":{"$error":"#N/A"}},{"$f":"IF(ISTEXT('S8'!$J$37),NA(),'S8'!$J$37)","v":{"$error":"#N/A"}},{"$f":"IF(ISTEXT('S8'!$J$38),NA(),'S8'!$J$38)","v":{"$error":"#N/A"}},{"$f":"IF(ISTEXT('S8'!$J$39),NA(),'S8'!$J$39)","v":{"$error":"#N/A"}},{"$error":"#N/A"},{"$f":"IF(ISTEXT('S8'!$J$40),NA(),'S8'!$J$40)","v":{"$error":"#N/A"}},{"$error":"#N/A"},{"$f":"IF(ISTEXT('S8'!$J$41),NA(),'S8'!$J$41)","v":{"$error":"#N/A"}},{"$error":"#N/A"},{"$f":"IF(ISTEXT('S8'!$I$42),NA(),'S8'!$I$42)","v":{"$error":"#N/A"}},{"$error":"#N/A"}]
[{"$f":"IF(ISBLANK('S8'!K$28),\" \",'S8'!K$28)","v":" "},{"$f":"IF(ISTEXT('S8'!$L$34),NA(),'S8'!$L$34)","v":{"$error":"#N/A"}},{"$f":"IF(ISTEXT('S8'!$L$35),NA(),'S8'!$L$35)","v":{"$error":"#N/A"}},{"$f":"IF(ISTEXT('S8'!$L$36),NA(),'S8'!$L$36)","v":{"$error":"#N/A"}},{"$f":"IF(ISTEXT('S8'!$L$37),NA(),'S8'!$L$37)","v":{"$error":"#N/A"}},{"$f":"IF(ISTEXT('S8'!$L$38),NA(),'S8'!$L$38)","v":{"$error":"#N/A"}},{"$f":"IF(ISTEXT('S8'!$L$39),NA(),'S8'!$L$39)","v":{"$error":"#N/A"}},{"$error":"#N/A"},{"$f":"IF(ISTEXT('S8'!$L$40),NA(),'S8'!$L$40)","v":{"$error":"#N/A"}},{"$error":"#N/A"},{"$f":"IF(ISTEXT('S8'!$L$41),NA(),'S8'!$L$41)","v":{"$error":"#N/A"}},{"$error":"#N/A"},{"$f":"IF(ISTEXT('S8'!$K$42),NA(),'S8'!$K$42)","v":{"$error":"#N/A"}},{"$error":"#N/A"}]
[{"$f":"IF(ISBLANK('S8'!M$28),\" \",'S8'!M$28)","v":" "},{"$f":"IF(ISTEXT('S8'!$N$34),NA(),'S8'!$N$34)","v":{"$error":"#N/A"}},{"$f":"IF(ISTEXT('S8'!$N$35),NA(),'S8'!$N$35)","v":{"$error":"#N/A"}},{"$f":"IF(ISTEXT('S8'!$N$36),NA(),'S8'!$N$36)","v":{"$error":"#N/A"}},{"$f":"IF(ISTEXT('S8'!$N$37),NA(),'S8'!$N$37)","v":{"$error":"#N/A"}},{"$f":"IF(ISTEXT('S8'!$N$38),NA(),'S8'!$N$38)","v":{"$error":"#N/A"}},{"$f":"IF(ISTEXT('S8'!$N$39),NA(),'S8'!$N$39)","v":{"$error":"#N/A"}},{"$error":"#N/A"},{"$f":"IF(ISTEXT('S8'!$N$40),NA(),'S8'!$N$40)","v":{"$error":"#N/A"}},{"$error":"#N/A"},{"$f":"IF(ISTEXT('S8'!$N$41),NA(),'S8'!$N$41)","v":{"$error":"#N/A"}},{"$error":"#N/A"},{"$f":"IF(ISTEXT('S8'!$M$42),NA(),'S8'!$M$42)","v":{"$error":"#N/A"}},{"$error":"#N/A"}]
[]
[{"$f":"IF(ISBLANK('S9'!C$8),\" \",'S9'!C$8)","v":" "},{"$f":"IF(ISTEXT('S9'!$D$14),NA(),'S9'!$D$14)","v":{"$error":"#N/A"}},{"$f":"IF(ISTEXT('S9'!$D$15),NA(),'S9'!$D$15)","v":{"$error":"#N/A"}},{"$f":"IF(ISTEXT('S9'!$D$16),NA(),'S9'!$D$16)","v":{"$error":"#N/A"}},{"$f":"IF(ISTEXT('S9'!$D$17),NA(),'S9'!$D$17)","v":{"$error":"#N/A"}},{"$f":"IF(ISTEXT('S9'!$D$18),NA(),'S9'!$D$18)","v":{"$error":"#N/A"}},{"$f":"IF(ISTEXT('S9'!$D$19),NA(),'S9'!$D$19)","v":{"$error":"#N/A"}},{"$f":"ROUND(AVERAGE(G99:G102),0)","v":{"$error":"#N/A"}},{"$f":"IF(ISTEXT('S9'!$D$20),NA(),'S9'!$D$20)","v":{"$error":"#N/A"}},{"$f":"ROUND(AVERAGE(I99:I102),0)","v":{"$error":"#N/A"}},{"$f":"IF(ISTEXT('S9'!$D$21),NA(),'S9'!$D$21)","v":{"$error":"#N/A"}},{"$f":"ROUND(AVERAGE(K99:K102),2)","v":{"$error":"#N/A"}},{"$f":"IF(ISTEXT('S9'!$C$22),NA(),'S9'!$C$22)","v":{"$error":"#N/A"}},{"$f":"ROUND(AVERAGE(M99:M102),2)","v":{"$error":"#N/A"}}]
[{"$f":"IF(ISBLANK('S9'!E$8),\" \",'S9'!E$8)","v":" "},{"$f":"IF(ISTEXT('S9'!$F$14),NA(),'S9'!$F$14)","v":{"$error":"#N/A"}},{"$f":"IF(ISTEXT('S9'!$F$15),NA(),'S9'!$F$15)","v":{"$error":"#N/A"}},{"$f":"IF(ISTEXT('S9'!$F$16),NA(),'S9'!$F$16)","v":{"$error":"#N/A"}},{"$f":"IF(ISTEXT('S9'!$F$17),NA(),'S9'!$F$17)","v":{"$error":"#N/A"}},{"$f":"IF(ISTEXT('S9'!$F$18),NA(),'S9'!$F$18)","v":{"$error":"#N/A"}},{"$f":"IF(ISTEXT('S9'!$F$19),NA(),'S9'!$F$19)","v":{"$error":"#N/A"}},{"$f":"ROUND(AVERAGE(G100:G103),0)","v":{"$error":"#N/A"}},{"$f":"IF(ISTEXT('S9'!$F$20),NA(),'S9'!$F$20)","v":{"$error":"#N/A"}},{"$f":"ROUND(AVERAGE(I100:I103),0)","v":{"$error":"#N/A"}},{"$f":"IF(ISTEXT('S9'!$F$21),NA(),'S9'!$F$21)","v":{"$error":"#N/A"}},{"$f":"ROUND(AVERAGE(K100:K103),2)","v":{"$error":"#N/A"}},{"$f":"IF(ISTEXT('S9'!$E$22),NA(),'S9'!$E$22)","v":{"$error":"#N/A"}},{"$f":"ROUND(AVERAGE(M100:M103),2)","v":{"$error":"#N/A"}}]
[{"$f":"IF(ISBLANK('S9'!G$8),\" \",'S9'!G$8)","v":" "},{"$f":"IF(ISTEXT('S9'!$H$14),NA(),'S9'!$H$14)","v":{"$error":"#N/A"}},{"$f":"IF(ISTEXT('S9'!$H$15),NA(),'S9'!$H$15)","v":{"$error":"#N/A"}},{"$f":"IF(ISTEXT('S9'!$H$16),NA(),'S9'!$H$16)","v":{"$error":"#N/A"}},{"$f":"IF(ISTEXT('S9'!$H$17),NA(),'S9'!$H$17)","v":{"$error":"#N/A"}},{"$f":"IF(ISTEXT('S9'!$H$18),NA(),'S9'!$H$18)","v":{"$error":"#N/A"}},{"$f":"IF(ISTEXT('S9'!$H$19),NA(),'S9'!$H$19)","v":{"$error":"#N/A"}},{"$f":"ROUND(AVERAGE(G102:G104),0)","v":{"$error":"#N/A"}},{"$f":"IF(ISTEXT('S9'!$H$20),NA(),'S9'!$H$20)","v":{"$error":"#N/A"}},{"$f":"ROUND(AVERAGE(I102:I104),0)","v":{"$error":"#N/A"}},{"$f":"IF(ISTEXT('S9'!$H$21),NA(),'S9'!$H$21)","v":{"$error":"#N/A"}},{"$f":"ROUND(AVERAGE(K102:K104),2)","v":{"$error":"#N/A"}},{"$f":"IF(ISTEXT('S9'!$G$22),NA(),'S9'!$G$22)","v":{"$error":"#N/A"}},{"$f":"ROUND(AVERAGE(M102:M104),2)","v":{"$error":"#N/A"}}]
[{"$f":"IF(ISBLANK('S9'!I$8),\" \",'S9'!I$8)","v":" "},{"$f":"IF(ISTEXT('S9'!$J$14),NA(),'S9'!$J$14)","v":{"$error":"#N/A"}},{"$f":"IF(ISTEXT('S9'!$J$15),NA(),'S9'!$J$15)","v":{"$error":"#N/A"}},{"$f":"IF(ISTEXT('S9'!$J$16),NA(),'S9'!$J$16)","v":{"$error":"#N/A"}},{"$f":"IF(ISTEXT('S9'!$J$17),NA(),'S9'!$J$17)","v":{"$error":"#N/A"}},{"$f":"IF(ISTEXT('S9'!$J$18),NA(),'S9'!$J$18)","v":{"$error":"#N/A"}},{"$f":"IF(ISTEXT('S9'!$J$19),NA(),'S9'!$J$19)","v":{"$error":"#N/A"}},{"$f":"ROUND(AVERAGE(G103:G105),0)","v":{"$error":"#N/A"}},{"$f":"IF(ISTEXT('S9'!$J$20),NA(),'S9'!$J$20)","v":{"$error":"#N/A"}},{"$error":"#N/A"},{"$f":"IF(ISTEXT('S9'!$J$21),NA(),'S9'!$J$21)","v":{"$error":"#N/A"}},{"$error":"#N/A"},{"$f":"IF(ISTEXT('S9'!$I$22),NA(),'S9'!$I$22)","v":{"$error":"#N/A"}},{"$error":"#N/A"}]
[{"$f":"IF(ISBLANK('S9'!K$8),\" \",'S9'!K$8)","v":" "},{"$f":"IF(ISTEXT('S9'!$L$14),NA(),'S9'!$L$14)","v":{"$error":"#N/A"}},{"$f":"IF(ISTEXT('S9'!$L$15),NA(),'S9'!$L$15)","v":{"$error":"#N/A"}},{"$f":"IF(ISTEXT('S9'!$L$16),NA(),'S9'!$L$16)","v":{"$error":"#N/A"}},{"$f":"IF(ISTEXT('S9'!$L$17),NA(),'S9'!$L$17)","v":{"$error":"#N/A"}},{"$f":"IF(ISTEXT('S9'!$L$18),NA(),'S9'!$L$18)","v":{"$error":"#N/A"}},{"$f":"IF(ISTEXT('S9'!$L$19),NA(),'S9'!$L$19)","v":{"$error":"#N/A"}},{"$error":"#N/A"},{"$f":"IF(ISTEXT('S9'!$L$20),NA(),'S9'!$L$20)","v":{"$error":"#N/A"}},{"$error":"#N/A"},{"$f":"IF(ISTEXT('S9'!$L$21),NA(),'S9'!$L$21)","v":{"$error":"#N/A"}},{"$error":"#N/A"},{"$f":"IF(ISTEXT('S9'!$K$22),NA(),'S9'!$K$22)","v":{"$error":"#N/A"}},{"$error":"#N/A"}]
[{"$f":"IF(ISBLANK('S9'!M$8),\" \",'S9'!M$8)","v":" "},{"$f":"IF(ISTEXT('S9'!$N$14),NA(),'S9'!$N$14)","v":{"$error":"#N/A"}},{"$f":"IF(ISTEXT('S9'!$N$15),NA(),'S9'!$N$15)","v":{"$error":"#N/A"}},{"$f":"IF(ISTEXT('S9'!$N$16),NA(),'S9'!$N$16)","v":{"$error":"#N/A"}},{"$f":"IF(ISTEXT('S9'!$N$17),NA(),'S9'!$N$17)","v":{"$error":"#N/A"}},{"$f":"IF(ISTEXT('S9'!$N$18),NA(),'S9'!$N$18)","v":{"$error":"#N/A"}},{"$f":"IF(ISTEXT('S9'!$N$19),NA(),'S9'!$N$19)","v":{"$error":"#N/A"}},{"$error":"#N/A"},{"$f":"IF(ISTEXT('S9'!$N$20),NA(),'S9'!$N$20)","v":{"$error":"#N/A"}},{"$error":"#N/A"},{"$f":"IF(ISTEXT('S9'!$N$21),NA(),'S9'!$N$21)","v":{"$error":"#N/A"}},{"$error":"#N/A"},{"$f":"IF(ISTEXT('S9'!$M$22),NA(),'S9'!$M$22)","v":{"$error":"#N/A"}},{"$error":"#N/A"}]
[{"$f":"IF(ISBLANK('S9'!C$28),\" \",'S9'!C$28)","v":" "},{"$f":"IF(ISTEXT('S9'!$D$34),NA(),'S9'!$D$34)","v":{"$error":"#N/A"}},{"$f":"IF(ISTEXT('S9'!$D$35),NA(),'S9'!$D$35)","v":{"$error":"#N/A"}},{"$f":"IF(ISTEXT('S9'!$D$36),NA(),'S9'!$D$36)","v":{"$error":"#N/A"}},{"$f":"IF(ISTEXT('S9'!$D$37),NA(),'S9'!$D$37)","v":{"$error":"#N/A"}},{"$f":"IF(ISTEXT('S9'!$D$38),NA(),'S9'!$D$38)","v":{"$error":"#N/A"}},{"$f":"IF(ISTEXT('S9'!$D$39),NA(),'S9'!$D$39)","v":{"$error":"#N/A"}},{"$error":"#N/A"},{"$f":"IF(ISTEXT('S9'!$D$40),NA(),'S9'!$D$40)","v":{"$error":"#N/A"}},{"$error":"#N/A"},{"$f":"IF(ISTEXT('S9'!$D$41),NA(),'S9'!$D$41)","v":{"$error":"#N/A"}},{"$error":"#N/A"},{"$f":"IF(ISTEXT('S9'!$C$42),NA(),'S9'!$C$42)","v":{"$error":"#N/A"}},{"$error":"#N/A"}]
[{"$f":"IF(ISBLANK('S9'!E$28),\" \",'S9'!E$28)","v":" "},{"$f":"IF(ISTEXT('S9'!$F$34),NA(),'S9'!$F$34)","v":{"$error":"#N/A"}},{"$f":"IF(ISTEXT('S9'!$F$35),NA(),'S9'!$F$35)","v":{"$error":"#N/A"}},{"$f":"IF(ISTEXT('S9'!$F$36),NA(),'S9'!$F$36)","v":{"$error":"#N/A"}},{"$f":"IF(ISTEXT('S9'!$F$37),NA(),'S9'!$F$37)","v":{"$error":"#N/A"}},{"$f":"IF(ISTEXT('S9'!$F$38),NA(),'S9'!$F$38)","v":{"$error":"#N/A"}},{"$f":"IF(ISTEXT('S9'!$F$39),NA(),'S9'!$F$39)","v":{"$error":"#N/A"}},{"$error":"#N/A"},{"$f":"IF(ISTEXT('S9'!$F$40),NA(),'S9'!$F$40)","v":{"$error":"#N/A"}},{"$error":"#N/A"},{"$f":"IF(ISTEXT('S9'!$F$41),NA(),'S9'!$F$41)","v":{"$error":"#N/A"}},{"$error":"#N/A"},{"$f":"IF(ISTEXT('S9'!$E$42),NA(),'S9'!$E$42)","v":{"$error":"#N/A"}},{"$error":"#N/A"}]
[{"$f":"IF(ISBLANK('S9'!G$28),\" \",'S9'!G$28)","v":" "},{"$f":"IF(ISTEXT('S9'!$H$34),NA(),'S9'!$H$34)","v":{"$error":"#N/A"}},{"$f":"IF(ISTEXT('S9'!$H$35),NA(),'S9'!$H$35)","v":{"$error":"#N/A"}},{"$f":"IF(ISTEXT('S9'!$H$36),NA(),'S9'!$H$36)","v":{"$error":"#N/A"}},{"$f":"IF(ISTEXT('S9'!$H$37),NA(),'S9'!$H$37)","v":{"$error":"#N/A"}},{"$f":"IF(ISTEXT('S9'!$H$38),NA(),'S9'!$H$38)","v":{"$error":"#N/A"}},{"$f":"IF(ISTEXT('S9'!$H$39),NA(),'S9'!$H$39)","v":{"$error":"#N/A"}},{"$error":"#N/A"},{"$f":"IF(ISTEXT('S9'!$H$40),NA(),'S9'!$H$40)","v":{"$error":"#N/A"}},{"$error":"#N/A"},{"$f":"IF(ISTEXT('S9'!$H$41),NA(),'S9'!$H$41)","v":{"$error":"#N/A"}},{"$error":"#N/A"},{"$f":"IF(ISTEXT('S9'!$G$42),NA(),'S9'!$G$42)","v":{"$error":"#N/A"}},{"$error":"#N/A"}]
[{"$f":"IF(ISBLANK('S9'!I$28),\" \",'S9'!I$28)","v":" "},{"$f":"IF(ISTEXT('S9'!$J$34),NA(),'S9'!$J$34)","v":{"$error":"#N/A"}},{"$f":"IF(ISTEXT('S9'!$J$35),NA(),'S9'!$J$35)","v":{"$error":"#N/A"}},{"$f":"IF(ISTEXT('S9'!$J$36),NA(),'S9'!$J$36)","v":{"$error":"#N/A"}},{"$f":"IF(ISTEXT('S9'!$J$37),NA(),'S9'!$J$37)","v":{"$error":"#N/A"}},{"$f":"IF(ISTEXT('S9'!$J$38),NA(),'S9'!$J$38)","v":{"$error":"#N/A"}},{"$f":"IF(ISTEXT('S9'!$J$39),NA(),'S9'!$J$39)","v":{"$error":"#N/A"}},{"$error":"#N/A"},{"$f":"IF(ISTEXT('S9'!$J$40),NA(),'S9'!$J$40)","v":{"$error":"#N/A"}},{"$error":"#N/A"},{"$f":"IF(ISTEXT('S9'!$J$41),NA(),'S9'!$J$41)","v":{"$error":"#N/A"}},{"$error":"#N/A"},{"$f":"IF(ISTEXT('S9'!$I$42),NA(),'S9'!$I$42)","v":{"$error":"#N/A"}},{"$error":"#N/A"}]
[{"$f":"IF(ISBLANK('S9'!K$28),\" \",'S9'!K$28)","v":" "},{"$f":"IF(ISTEXT('S9'!$L$34),NA(),'S9'!$L$34)","v":{"$error":"#N/A"}},{"$f":"IF(ISTEXT('S9'!$L$35),NA(),'S9'!$L$35)","v":{"$error":"#N/A"}},{"$f":"IF(ISTEXT('S9'!$L$36),NA(),'S9'!$L$36)","v":{"$error":"#N/A"}},{"$f":"IF(ISTEXT('S9'!$L$37),NA(),'S9'!$L$37)","v":{"$error":"#N/A"}},{"$f":"IF(ISTEXT('S9'!$L$38),NA(),'S9'!$L$38)","v":{"$error":"#N/A"}},{"$f":"IF(ISTEXT('S9'!$L$39),NA(),'S9'!$L$39)","v":{"$error":"#N/A"}},{"$error":"#N/A"},{"$f":"IF(ISTEXT('S9'!$L$40),NA(),'S9'!$L$40)","v":{"$error":"#N/A"}},{"$error":"#N/A"},{"$f":"IF(ISTEXT('S9'!$L$41),NA(),'S9'!$L$41)","v":{"$error":"#N/A"}},{"$error":"#N/A"},{"$f":"IF(ISTEXT('S9'!$K$42),NA(),'S9'!$K$42)","v":{"$error":"#N/A"}},{"$error":"#N/A"}]
[{"$f":"IF(ISBLANK('S9'!M$28),\" \",'S9'!M$28)","v":" "},{"$f":"IF(ISTEXT('S9'!$N$34),NA(),'S9'!$N$34)","v":{"$error":"#N/A"}},{"$f":"IF(ISTEXT('S9'!$N$35),NA(),'S9'!$N$35)","v":{"$error":"#N/A"}},{"$f":"IF(ISTEXT('S9'!$N$36),NA(),'S9'!$N$36)","v":{"$error":"#N/A"}},{"$f":"IF(ISTEXT('S9'!$N$37),NA(),'S9'!$N$37)","v":{"$error":"#N/A"}},{"$f":"IF(ISTEXT('S9'!$N$38),NA(),'S9'!$N$38)","v":{"$error":"#N/A"}},{"$f":"IF(ISTEXT('S9'!$N$39),NA(),'S9'!$N$39)","v":{"$error":"#N/A"}},{"$error":"#N/A"},{"$f":"IF(ISTEXT('S9'!$N$40),NA(),'S9'!$N$40)","v":{"$error":"#N/A"}},{"$error":"#N/A"},{"$f":"IF(ISTEXT('S9'!$N$41),NA(),'S9'!$N$41)","v":{"$error":"#N/A"}},{"$error":"#N/A"},{"$f":"IF(ISTEXT('S9'!$M$42),NA(),'S9'!$M$42)","v":{"$error":"#N/A"}},{"$error":"#N/A"}]
[{"$f":"IF(ISBLANK('S10'!C$8),\" \",'S10'!C$8)","v":" "},{"$f":"IF(ISTEXT('S10'!$D$14),NA(),'S10'!$D$14)","v":{"$error":"#N/A"}},{"$f":"IF(ISTEXT('S10'!$D$15),NA(),'S10'!$D$15)","v":{"$error":"#N/A"}},{"$f":"IF(ISTEXT('S10'!$D$16),NA(),'S10'!$D$16)","v":{"$error":"#N/A"}},{"$f":"IF(ISTEXT('S10'!$D$17),NA(),'S10'!$D$17)","v":{"$error":"#N/A"}},{"$f":"IF(ISTEXT('S10'!$D$18),NA(),'S10'!$D$18)","v":{"$error":"#N/A"}},{"$f":"IF(ISTEXT('S10'!$D$19),NA(),'S10'!$D$19)","v":{"$error":"#N/A"}},{"$error":"#N/A"},{"$f":"IF(ISTEXT('S10'!$D$20),NA(),'S10'!$D$20)","v":{"$error":"#N/A"}},{"$error":"#N/A"},{"$f":"IF(ISTEXT('S10'!$D$21),NA(),'S10'!$D$21)","v":{"$error":"#N/A"}},{"$error":"#N/A"},{"$f":"IF(ISTEXT('S10'!$C$22),NA(),'S10'!$C$22)","v":{"$error":"#N/A"}},{"$error":"#N/A"}]
[{"$f":"IF(ISBLANK('S10'!E$8),\" \",'S10'!E$8)","v":" "},{"$f":"IF(ISTEXT('S10'!$F$14),NA(),'S10'!$F$14)","v":{"$error":"#N/A"}},{"$f":"IF(ISTEXT('S10'!$F$15),NA(),'S10'!$F$15)","v":{"$error":"#N/A"}},{"$f":"IF(ISTEXT('S10'!$F$16),NA(),'S10'!$F$16)","v":{"$error":"#N/A"}},{"$f":"IF(ISTEXT('S10'!$F$17),NA(),'S10'!$F$17)","v":{"$error":"#N/A"}},{"$f":"IF(ISTEXT('S10'!$F$18),NA(),'S10'!$F$18)","v":{"$error":"#N/A"}},{"$f":"IF(ISTEXT('S10'!$F$19),NA(),'S10'!$F$19)","v":{"$error":"#N/A"}},{"$error":"#N/A"},{"$f":"IF(ISTEXT('S10'!$F$20),NA(),'S10'!$F$20)","v":{"$error":"#N/A"}},{"$error":"#N/A"},{"$f":"IF(ISTEXT('S10'!$F$21),NA(),'S10'!$F$21)","v":{"$error":"#N/A"}},{"$error":"#N/A"},{"$f":"IF(ISTEXT('S10'!$E$22),NA(),'S10'!$E$22)","v":{"$error":"#N/A"}},{"$error":"#N/A"}]
[{"$f":"IF(ISBLANK('S10'!G$8),\" \",'S10'!G$8)","v":" "},{"$f":"IF(ISTEXT('S10'!$H$14),NA(),'S10'!$H$14)","v":{"$error":"#N/A"}},{"$f":"IF(ISTEXT('S10'!$H$15),NA(),'S10'!$H$15)","v":{"$error":"#N/A"}},{"$f":"IF(ISTEXT('S10'!$H$16),NA(),'S10'!$H$16)","v":{"$error":"#N/A"}},{"$f":"IF(ISTEXT('S10'!$H$17),NA(),'S10'!$H$17)","v":{"$error":"#N/A"}},{"$f":"IF(ISTEXT('S10'!$H$18),NA(),'S10'!$H$18)","v":{"$error":"#N/A"}},{"$f":"IF(ISTEXT('S10'!$H$19),NA(),'S10'!$H$19)","v":{"$error":"#N/A"}},{"$error":"#N/A"},{"$f":"IF(ISTEXT('S10'!$H$20),NA(),'S10'!$H$20)","v":{"$error":"#N/A"}},{"$error":"#N/A"},{"$f":"IF(ISTEXT('S10'!$H$21),NA(),'S10'!$H$21)","v":{"$error":"#N/A"}},{"$error":"#N/A"},{"$f":"IF(ISTEXT('S10'!$G$22),NA(),'S10'!$G$22)","v":{"$error":"#N/A"}},{"$error":"#N/A"}]
[{"$f":"IF(ISBLANK('S10'!I$8),\" \",'S10'!I$8)","v":" "},{"$f":"IF(ISTEXT('S10'!$J$14),NA(),'S10'!$J$14)","v":{"$error":"#N/A"}},{"$f":"IF(ISTEXT('S10'!$J$15),NA(),'S10'!$J$15)","v":{"$error":"#N/A"}},{"$f":"IF(ISTEXT('S10'!$J$16),NA(),'S10'!$J$16)","v":{"$error":"#N/A"}},{"$f":"IF(ISTEXT('S10'!$J$17),NA(),'S10'!$J$17)","v":{"$error":"#N/A"}},{"$f":"IF(ISTEXT('S10'!$J$18),NA(),'S10'!$J$18)","v":{"$error":"#N/A"}},{"$f":"IF(ISTEXT('S10'!$J$19),NA(),'S10'!$J$19)","v":{"$error":"#N/A"}},{"$error":"#N/A"},{"$f":"IF(ISTEXT('S10'!$J$20),NA(),'S10'!$J$20)","v":{"$error":"#N/A"}},{"$error":"#N/A"},{"$f":"IF(ISTEXT('S10'!$J$21),NA(),'S10'!$J$21)","v":{"$error":"#N/A"}},{"$error":"#N/A"},{"$f":"IF(ISTEXT('S10'!$I$22),NA(),'S10'!$I$22)","v":{"$error":"#N/A"}},{"$error":"#N/A"}]
[{"$f":"IF(ISBLANK('S10'!K$8),\" \",'S10'!K$8)","v":" "},{"$f":"IF(ISTEXT('S10'!$L$14),NA(),'S10'!$L$14)","v":{"$error":"#N/A"}},{"$f":"IF(ISTEXT('S10'!$L$15),NA(),'S10'!$L$15)","v":{"$error":"#N/A"}},{"$f":"IF(ISTEXT('S10'!$L$16),NA(),'S10'!$L$16)","v":{"$error":"#N/A"}},{"$f":"IF(ISTEXT('S10'!$L$17),NA(),'S10'!$L$17)","v":{"$error":"#N/A"}},{"$f":"IF(ISTEXT('S10'!$L$18),NA(),'S10'!$L$18)","v":{"$error":"#N/A"}},{"$f":"IF(ISTEXT('S10'!$L$19),NA(),'S10'!$L$19)","v":{"$error":"#N/A"}},{"$error":"#N/A"},{"$f":"IF(ISTEXT('S10'!$L$20),NA(),'S10'!$L$20)","v":{"$error":"#N/A"}},{"$error":"#N/A"},{"$f":"IF(ISTEXT('S10'!$L$21),NA(),'S10'!$L$21)","v":{"$error":"#N/A"}},{"$error":"#N/A"},{"$f":"IF(ISTEXT('S10'!$K$22),NA(),'S10'!$K$22)","v":{"$error":"#N/A"}},{"$error":"#N/A"}]
[{"$f":"IF(ISBLANK('S10'!M$8),\" \",'S10'!M$8)","v":" "},{"$f":"IF(ISTEXT('S10'!$N$14),NA(),'S10'!$N$14)","v":{"$error":"#N/A"}},{"$f":"IF(ISTEXT('S10'!$N$15),NA(),'S10'!$N$15)","v":{"$error":"#N/A"}},{"$f":"IF(ISTEXT('S10'!$N$16),NA(),'S10'!$N$16)","v":{"$error":"#N/A"}},{"$f":"IF(ISTEXT('S10'!$N$17),NA(),'S10'!$N$17)","v":{"$error":"#N/A"}},{"$f":"IF(ISTEXT('S10'!$N$18),NA(),'S10'!$N$18)","v":{"$error":"#N/A"}},{"$f":"IF(ISTEXT('S10'!$N$19),NA(),'S10'!$N$19)","v":{"$error":"#N/A"}},{"$error":"#N/A"},{"$f":"IF(ISTEXT('S10'!$N$20),NA(),'S10'!$N$20)","v":{"$error":"#N/A"}},{"$error":"#N/A"},{"$f":"IF(ISTEXT('S10'!$N$21),NA(),'S10'!$N$21)","v":{"$error":"#N/A"}},{"$error":"#N/A"},{"$f":"IF(ISTEXT('S10'!$M$22),NA(),'S10'!$M$22)","v":{"$error":"#N/A"}},{"$error":"#N/A"}]
[{"$f":"IF(ISBLANK('S10'!C$28),\" \",'S10'!C$28)","v":" "},{"$f":"IF(ISTEXT('S10'!$D$34),NA(),'S10'!$D$34)","v":{"$error":"#N/A"}},{"$f":"IF(ISTEXT('S10'!$D$35),NA(),'S10'!$D$35)","v":{"$error":"#N/A"}},{"$f":"IF(ISTEXT('S10'!$D$36),NA(),'S10'!$D$36)","v":{"$error":"#N/A"}},{"$f":"IF(ISTEXT('S10'!$D$37),NA(),'S10'!$D$37)","v":{"$error":"#N/A"}},{"$f":"IF(ISTEXT('S10'!$D$38),NA(),'S10'!$D$38)","v":{"$error":"#N/A"}},{"$f":"IF(ISTEXT('S10'!$D$39),NA(),'S10'!$D$39)","v":{"$error":"#N/A"}},{"$error":"#N/A"},{"$f":"IF(ISTEXT('S10'!$D$40),NA(),'S10'!$D$40)","v":{"$error":"#N/A"}},{"$error":"#N/A"},{"$f":"IF(ISTEXT('S10'!$D$41),NA(),'S10'!$D$41)","v":{"$error":"#N/A"}},{"$error":"#N/A"},{"$f":"IF(ISTEXT('S10'!$C$42),NA(),'S10'!$C$42)","v":{"$error":"#N/A"}},{"$error":"#N/A"}]
[{"$f":"IF(ISBLANK('S10'!E$28),\" \",'S10'!E$28)","v":" "},{"$f":"IF(ISTEXT('S10'!$F$34),NA(),'S10'!$F$34)","v":{"$error":"#N/A"}},{"$f":"IF(ISTEXT('S10'!$F$35),NA(),'S10'!$F$35)","v":{"$error":"#N/A"}},{"$f":"IF(ISTEXT('S10'!$F$36),NA(),'S10'!$F$36)","v":{"$error":"#N/A"}},{"$f":"IF(ISTEXT('S10'!$F$37),NA(),'S10'!$F$37)","v":{"$error":"#N/A"}},{"$f":"IF(ISTEXT('S10'!$F$38),NA(),'S10'!$F$38)","v":{"$error":"#N/A"}},{"$f":"IF(ISTEXT('S10'!$F$39),NA(),'S10'!$F$39)","v":{"$error":"#N/A"}},{"$error":"#N/A"},{"$f":"IF(ISTEXT('S10'!$F$40),NA(),'S10'!$F$40)","v":{"$error":"#N/A"}},{"$error":"#N/A"},{"$f":"IF(ISTEXT('S10'!$F$41),NA(),'S10'!$F$41)","v":{"$error":"#N/A"}},{"$error":"#N/A"},{"$f":"IF(ISTEXT('S10'!$E$42),NA(),'S10'!$E$42)","v":{"$error":"#N/A"}},{"$error":"#N/A"}]
[{"$f":"IF(ISBLANK('S10'!G$28),\" \",'S10'!G$28)","v":" "},{"$f":"IF(ISTEXT('S10'!$H$34),NA(),'S10'!$H$34)","v":{"$error":"#N/A"}},{"$f":"IF(ISTEXT('S10'!$H$35),NA(),'S10'!$H$35)","v":{"$error":"#N/A"}},{"$f":"IF(ISTEXT('S10'!$H$36),NA(),'S10'!$H$36)","v":{"$error":"#N/A"}},{"$f":"IF(ISTEXT('S10'!$H$37),NA(),'S10'!$H$37)","v":{"$error":"#N/A"}},{"$f":"IF(ISTEXT('S10'!$H$38),NA(),'S10'!$H$38)","v":{"$error":"#N/A"}},{"$f":"IF(ISTEXT('S10'!$H$39),NA(),'S10'!$H$39)","v":{"$error":"#N/A"}},{"$error":"#N/A"},{"$f":"IF(ISTEXT('S10'!$H$40),NA(),'S10'!$H$40)","v":{"$error":"#N/A"}},{"$error":"#N/A"},{"$f":"IF(ISTEXT('S10'!$H$41),NA(),'S10'!$H$41)","v":{"$error":"#N/A"}},{"$error":"#N/A"},{"$f":"IF(ISTEXT('S10'!$G$42),NA(),'S10'!$G$42)","v":{"$error":"#N/A"}},{"$error":"#N/A"}]
[{"$f":"IF(ISBLANK('S10'!I$28),\" \",'S10'!I$28)","v":" "},{"$f":"IF(ISTEXT('S10'!$J$34),NA(),'S10'!$J$34)","v":{"$error":"#N/A"}},{"$f":"IF(ISTEXT('S10'!$J$35),NA(),'S10'!$J$35)","v":{"$error":"#N/A"}},{"$f":"IF(ISTEXT('S10'!$J$36),NA(),'S10'!$J$36)","v":{"$error":"#N/A"}},{"$f":"IF(ISTEXT('S10'!$J$37),NA(),'S10'!$J$37)","v":{"$error":"#N/A"}},{"$f":"IF(ISTEXT('S10'!$J$38),NA(),'S10'!$J$38)","v":{"$error":"#N/A"}},{"$f":"IF(ISTEXT('S10'!$J$39),NA(),'S10'!$J$39)","v":{"$error":"#N/A"}},{"$error":"#N/A"},{"$f":"IF(ISTEXT('S10'!$J$40),NA(),'S10'!$J$40)","v":{"$error":"#N/A"}},{"$error":"#N/A"},{"$f":"IF(ISTEXT('S10'!$J$41),NA(),'S10'!$J$41)","v":{"$error":"#N/A"}},{"$error":"#N/A"},{"$f":"IF(ISTEXT('S10'!$I$42),NA(),'S10'!$I$42)","v":{"$error":"#N/A"}},{"$error":"#N/A"}]
[{"$f":"IF(ISBLANK('S10'!K$28),\" \",'S10'!K$28)","v":" "},{"$f":"IF(ISTEXT('S10'!$L$34),NA(),'S10'!$L$34)","v":{"$error":"#N/A"}},{"$f":"IF(ISTEXT('S10'!$L$35),NA(),'S10'!$L$35)","v":{"$error":"#N/A"}},{"$f":"IF(ISTEXT('S10'!$L$36),NA(),'S10'!$L$36)","v":{"$error":"#N/A"}},{"$f":"IF(ISTEXT('S10'!$L$37),NA(),'S10'!$L$37)","v":{"$error":"#N/A"}},{"$f":"IF(ISTEXT('S10'!$L$38),NA(),'S10'!$L$38)","v":{"$error":"#N/A"}},{"$f":"IF(ISTEXT('S10'!$L$39),NA(),'S10'!$L$39)","v":{"$error":"#N/A"}},{"$error":"#N/A"},{"$f":"IF(ISTEXT('S10'!$L$40),NA(),'S10'!$L$40)","v":{"$error":"#N/A"}},{"$error":"#N/A"},{"$f":"IF(ISTEXT('S10'!$L$41),NA(),'S10'!$L$41)","v":{"$error":"#N/A"}},{"$error":"#N/A"},{"$f":"IF(ISTEXT('S10'!$K$42),NA(),'S10'!$K$42)","v":{"$error":"#N/A"}},{"$error":"#N/A"}]
[{"$f":"IF(ISBLANK('S10'!M$28),\" \",'S10'!M$28)","v":" "},{"$f":"IF(ISTEXT('S10'!$N$34),NA(),'S10'!$N$34)","v":{"$error":"#N/A"}},{"$f":"IF(ISTEXT('S10'!$N$35),NA(),'S10'!$N$35)","v":{"$error":"#N/A"}},{"$f":"IF(ISTEXT('S10'!$N$36),NA(),'S10'!$N$36)","v":{"$error":"#N/A"}},{"$f":"IF(ISTEXT('S10'!$N$37),NA(),'S10'!$N$37)","v":{"$error":"#N/A"}},{"$f":"IF(ISTEXT('S10'!$N$38),NA(),'S10'!$N$38)","v":{"$error":"#N/A"}},{"$f":"IF(ISTEXT('S10'!$N$39),NA(),'S10'!$N$39)","v":{"$error":"#N/A"}},{"$error":"#N/A"},{"$f":"IF(ISTEXT('S10'!$N$40),NA(),'S10'!$N$40)","v":{"$error":"#N/A"}},{"$error":"#N/A"},{"$f":"IF(ISTEXT('S10'!$N$41),NA(),'S10'!$N$41)","v":{"$error":"#N/A"}},{"$error":"#N/A"},{"$f":"IF(ISTEXT('S10'!$M$42),NA(),'S10'!$M$42)","v":{"$error":"#N/A"}},{"$error":"#N/A"}]
[]
[{"$f":"IF(ISBLANK('S11'!C$8),\" \",'S11'!C$8)","v":" "},{"$f":"IF(ISTEXT('S11'!$D$14),NA(),'S11'!$D$14)","v":{"$error":"#N/A"}},{"$f":"IF(ISTEXT('S11'!$D$15),NA(),'S11'!$D$15)","v":{"$error":"#N/A"}},{"$f":"IF(ISTEXT('S11'!$D$16),NA(),'S11'!$D$16)","v":{"$error":"#N/A"}},{"$f":"IF(ISTEXT('S11'!$D$17),NA(),'S11'!$D$17)","v":{"$error":"#N/A"}},{"$f":"IF(ISTEXT('S11'!$D$18),NA(),'S11'!$D$18)","v":{"$error":"#N/A"}},{"$f":"IF(ISTEXT('S11'!$D$19),NA(),'S11'!$D$19)","v":{"$error":"#N/A"}},{"$f":"ROUND(AVERAGE(G124:G127),0)","v":{"$error":"#N/A"}},{"$f":"IF(ISTEXT('S11'!$D$20),NA(),'S11'!$D$20)","v":{"$error":"#N/A"}},{"$f":"ROUND(AVERAGE(I124:I127),0)","v":{"$error":"#N/A"}},{"$f":"IF(ISTEXT('S11'!$D$21),NA(),'S11'!$D$21)","v":{"$error":"#N/A"}},{"$f":"ROUND(AVERAGE(K124:K127),2)","v":{"$error":"#N/A"}},{"$f":"IF(ISTEXT('S11'!$C$22),NA(),'S11'!$C$22)","v":{"$error":"#N/A"}},{"$f":"ROUND(AVERAGE(M124:M127),2)","v":{"$error":"#N/A"}}]
[{"$f":"IF(ISBLANK('S11'!E$8),\" \",'S11'!E$8)","v":" "},{"$f":"IF(ISTEXT('S11'!$F$14),NA(),'S11'!$F$14)","v":{"$error":"#N/A"}},{"$f":"IF(ISTEXT('S11'!$F$15),NA(),'S11'!$F$15)","v":{"$error":"#N/A"}},{"$f":"IF(ISTEXT('S11'!$F$16),NA(),'S11'!$F$16)","v":{"$error":"#N/A"}},{"$f":"IF(ISTEXT('S11'!$F$17),NA(),'S11'!$F$17)","v":{"$error":"#N/A"}},{"$f":"IF(ISTEXT('S11'!$F$18),NA(),'S11'!$F$18)","v":{"$error":"#N/A"}},{"$f":"IF(ISTEXT('S11'!$F$19),NA(),'S11'!$F$19)","v":{"$error":"#N/A"}},{"$f":"ROUND(AVERAGE(G125:G128),0)","v":{"$error":"#N/A"}},{"$f":"IF(ISTEXT('S11'!$F$20),NA(),'S11'!$F$20)","v":{"$error":"#N/A"}},{"$f":"ROUND(AVERAGE(I125:I128),0)","v":{"$error":"#N/A"}},{"$f":"IF(ISTEXT('S11'!$F$21),NA(),'S11'!$F$21)","v":{"$error":"#N/A"}},{"$f":"ROUND(AVERAGE(K125:K128),2)","v":{"$error":"#N/A"}},{"$f":"IF(ISTEXT('S11'!$E$22),NA(),'S11'!$E$22)","v":{"$error":"#N/A"}},{"$f":"ROUND(AVERAGE(M125:M128),2)","v":{"$error":"#N/A"}}]
[{"$f":"IF(ISBLANK('S11'!G$8),\" \",'S11'!G$8)","v":" "},{"$f":"IF(ISTEXT('S11'!$H$14),NA(),'S11'!$H$14)","v":{"$error":"#N/A"}},{"$f":"IF(ISTEXT('S11'!$H$15),NA(),'S11'!$H$15)","v":{"$error":"#N/A"}},{"$f":"IF(ISTEXT('S11'!$H$16),NA(),'S11'!$H$16)","v":{"$error":"#N/A"}},{"$f":"IF(ISTEXT('S11'!$H$17),NA(),'S11'!$H$17)","v":{"$error":"#N/A"}},{"$f":"IF(ISTEXT('S11'!$H$18),NA(),'S11'!$H$18)","v":{"$error":"#N/A"}},{"$f":"IF(ISTEXT('S11'!$H$19),NA(),'S11'!$H$19)","v":{"$error":"#N/A"}},{"$f":"ROUND(AVERAGE(G127:G129),0)","v":{"$error":"#N/A"}},{"$f":"IF(ISTEXT('S11'!$H$20),NA(),'S11'!$H$20)","v":{"$error":"#N/A"}},{"$f":"ROUND(AVERAGE(I127:I129),0)","v":{"$error":"#N/A"}},{"$f":"IF(ISTEXT('S11'!$H$21),NA(),'S11'!$H$21)","v":{"$error":"#N/A"}},{"$f":"ROUND(AVERAGE(K127:K129),2)","v":{"$error":"#N/A"}},{"$f":"IF(ISTEXT('S11'!$G$22),NA(),'S11'!$G$22)","v":{"$error":"#N/A"}},{"$f":"ROUND(AVERAGE(M127:M129),2)","v":{"$error":"#N/A"}}]
[{"$f":"IF(ISBLANK('S11'!I$8),\" \",'S11'!I$8)","v":" "},{"$f":"IF(ISTEXT('S11'!$J$14),NA(),'S11'!$J$14)","v":{"$error":"#N/A"}},{"$f":"IF(ISTEXT('S11'!$J$15),NA(),'S11'!$J$15)","v":{"$error":"#N/A"}},{"$f":"IF(ISTEXT('S11'!$J$16),NA(),'S11'!$J$16)","v":{"$error":"#N/A"}},{"$f":"IF(ISTEXT('S11'!$J$17),NA(),'S11'!$J$17)","v":{"$error":"#N/A"}},{"$f":"IF(ISTEXT('S11'!$J$18),NA(),'S11'!$J$18)","v":{"$error":"#N/A"}},{"$f":"IF(ISTEXT('S11'!$J$19),NA(),'S11'!$J$19)","v":{"$error":"#N/A"}},{"$f":"ROUND(AVERAGE(G128:G130),0)","v":{"$error":"#N/A"}},{"$f":"IF(ISTEXT('S11'!$J$20),NA(),'S11'!$J$20)","v":{"$error":"#N/A"}},{"$error":"#N/A"},{"$f":"IF(ISTEXT('S11'!$J$21),NA(),'S11'!$J$21)","v":{"$error":"#N/A"}},{"$error":"#N/A"},{"$f":"IF(ISTEXT('S11'!$I$22),NA(),'S11'!$I$22)","v":{"$error":"#N/A"}},{"$error":"#N/A"}]
[{"$f":"IF(ISBLANK('S11'!K$8),\" \",'S11'!K$8)","v":" "},{"$f":"IF(ISTEXT('S11'!$L$14),NA(),'S11'!$L$14)","v":{"$error":"#N/A"}},{"$f":"IF(ISTEXT('S11'!$L$15),NA(),'S11'!$L$15)","v":{"$error":"#N/A"}},{"$f":"IF(ISTEXT('S11'!$L$16),NA(),'S11'!$L$16)","v":{"$error":"#N/A"}},{"$f":"IF(ISTEXT('S11'!$L$17),NA(),'S11'!$L$17)","v":{"$error":"#N/A"}},{"$f":"IF(ISTEXT('S11'!$L$18),NA(),'S11'!$L$18)","v":{"$error":"#N/A"}},{"$f":"IF(ISTEXT('S11'!$L$19),NA(),'S11'!$L$19)","v":{"$error":"#N/A"}},{"$error":"#N/A"},{"$f":"IF(ISTEXT('S11'!$L$20),NA(),'S11'!$L$20)","v":{"$error":"#N/A"}},{"$error":"#N/A"},{"$f":"IF(ISTEXT('S11'!$L$21),NA(),'S11'!$L$21)","v":{"$error":"#N/A"}},{"$error":"#N/A"},{"$f":"IF(ISTEXT('S11'!$K$22),NA(),'S11'!$K$22)","v":{"$error":"#N/A"}},{"$error":"#N/A"}]
[{"$f":"IF(ISBLANK('S11'!M$8),\" \",'S11'!M$8)","v":" "},{"$f":"IF(ISTEXT('S11'!$N$14),NA(),'S11'!$N$14)","v":{"$error":"#N/A"}},{"$f":"IF(ISTEXT('S11'!$N$15),NA(),'S11'!$N$15)","v":{"$error":"#N/A"}},{"$f":"IF(ISTEXT('S11'!$N$16),NA(),'S11'!$N$16)","v":{"$error":"#N/A"}},{"$f":"IF(ISTEXT('S11'!$N$17),NA(),'S11'!$N$17)","v":{"$error":"#N/A"}},{"$f":"IF(ISTEXT('S11'!$N$18),NA(),'S11'!$N$18)","v":{"$error":"#N/A"}},{"$f":"IF(ISTEXT('S11'!$N$19),NA(),'S11'!$N$19)","v":{"$error":"#N/A"}},{"$error":"#N/A"},{"$f":"IF(ISTEXT('S11'!$N$20),NA(),'S11'!$N$20)","v":{"$error":"#N/A"}},{"$error":"#N/A"},{"$f":"IF(ISTEXT('S11'!$N$21),NA(),'S11'!$N$21)","v":{"$error":"#N/A"}},{"$error":"#N/A"},{"$f":"IF(ISTEXT('S11'!$M$22),NA(),'S11'!$M$22)","v":{"$error":"#N/A"}},{"$error":"#N/A"}]
[{"$f":"IF(ISBLANK('S11'!C$28),\" \",'S11'!C$28)","v":" "},{"$f":"IF(ISTEXT('S11'!$D$34),NA(),'S11'!$D$34)","v":{"$error":"#N/A"}},{"$f":"IF(ISTEXT('S11'!$D$35),NA(),'S11'!$D$35)","v":{"$error":"#N/A"}},{"$f":"IF(ISTEXT('S11'!$D$36),NA(),'S11'!$D$36)","v":{"$error":"#N/A"}},{"$f":"IF(ISTEXT('S11'!$D$37),NA(),'S11'!$D$37)","v":{"$error":"#N/A"}},{"$f":"IF(ISTEXT('S11'!$D$38),NA(),'S11'!$D$38)","v":{"$error":"#N/A"}},{"$f":"IF(ISTEXT('S11'!$D$39),NA(),'S11'!$D$39)","v":{"$error":"#N/A"}},{"$error":"#N/A"},{"$f":"IF(ISTEXT('S11'!$D$40),NA(),'S11'!$D$40)","v":{"$error":"#N/A"}},{"$error":"#N/A"},{"$f":"IF(ISTEXT('S11'!$D$41),NA(),'S11'!$D$41)","v":{"$error":"#N/A"}},{"$error":"#N/A"},{"$f":"IF(ISTEXT('S11'!$C$42),NA(),'S11'!$C$42)","v":{"$error":"#N/A"}},{"$error":"#N/A"}]
[{"$f":"IF(ISBLANK('S11'!E$28),\" \",'S11'!E$28)","v":" "},{"$f":"IF(ISTEXT('S11'!$F$34),NA(),'S11'!$F$34)","v":{"$error":"#N/A"}},{"$f":"IF(ISTEXT('S11'!$F$35),NA(),'S11'!$F$35)","v":{"$error":"#N/A"}},{"$f":"IF(ISTEXT('S11'!$F$36),NA(),'S11'!$F$36)","v":{"$error":"#N/A"}},{"$f":"IF(ISTEXT('S11'!$F$37),NA(),'S11'!$F$37)","v":{"$error":"#N/A"}},{"$f":"IF(ISTEXT('S11'!$F$38),NA(),'S11'!$F$38)","v":{"$error":"#N/A"}},{"$f":"IF(ISTEXT('S11'!$F$39),NA(),'S11'!$F$39)","v":{"$error":"#N/A"}},{"$error":"#N/A"},{"$f":"IF(ISTEXT('S11'!$F$40),NA(),'S11'!$F$40)","v":{"$error":"#N/A"}},{"$error":"#N/A"},{"$f":"IF(ISTEXT('S11'!$F$41),NA(),'S11'!$F$41)","v":{"$error":"#N/A"}},{"$error":"#N/A"},{"$f":"IF(ISTEXT('S11'!$E$42),NA(),'S11'!$E$42)","v":{"$error":"#N/A"}},{"$error":"#N/A"}]
[{"$f":"IF(ISBLANK('S11'!G$28),\" \",'S11'!G$28)","v":" "},{"$f":"IF(ISTEXT('S11'!$H$34),NA(),'S11'!$H$34)","v":{"$error":"#N/A"}},{"$f":"IF(ISTEXT('S11'!$H$35),NA(),'S11'!$H$35)","v":{"$error":"#N/A"}},{"$f":"IF(ISTEXT('S11'!$H$36),NA(),'S11'!$H$36)","v":{"$error":"#N/A"}},{"$f":"IF(ISTEXT('S11'!$H$37),NA(),'S11'!$H$37)","v":{"$error":"#N/A"}},{"$f":"IF(ISTEXT('S11'!$H$38),NA(),'S11'!$H$38)","v":{"$error":"#N/A"}},{"$f":"IF(ISTEXT('S11'!$H$39),NA(),'S11'!$H$39)","v":{"$error":"#N/A"}},{"$error":"#N/A"},{"$f":"IF(ISTEXT('S11'!$H$40),NA(),'S11'!$H$40)","v":{"$error":"#N/A"}},{"$error":"#N/A"},{"$f":"IF(ISTEXT('S11'!$H$41),NA(),'S11'!$H$41)","v":{"$error":"#N/A"}},{"$error":"#N/A"},{"$f":"IF(ISTEXT('S11'!$G$42),NA(),'S11'!$G$42)","v":{"$error":"#N/A"}},{"$error":"#N/A"}]
[{"$f":"IF(ISBLANK('S11'!I$28),\" \",'S11'!I$28)","v":" "},{"$f":"IF(ISTEXT('S11'!$J$34),NA(),'S11'!$J$34)","v":{"$error":"#N/A"}},{"$f":"IF(ISTEXT('S11'!$J$35),NA(),'S11'!$J$35)","v":{"$error":"#N/A"}},{"$f":"IF(ISTEXT('S11'!$J$36),NA(),'S11'!$J$36)","v":{"$error":"#N/A"}},{"$f":"IF(ISTEXT('S11'!$J$37),NA(),'S11'!$J$37)","v":{"$error":"#N/A"}},{"$f":"IF(ISTEXT('S11'!$J$38),NA(),'S11'!$J$38)","v":{"$error":"#N/A"}},{"$f":"IF(ISTEXT('S11'!$J$39),NA(),'S11'!$J$39)","v":{"$error":"#N/A"}},{"$error":"#N/A"},{"$f":"IF(ISTEXT('S11'!$J$40),NA(),'S11'!$J$40)","v":{"$error":"#N/A"}},{"$error":"#N/A"},{"$f":"IF(ISTEXT('S11'!$J$41),NA(),'S11'!$J$41)","v":{"$error":"#N/A"}},{"$error":"#N/A"},{"$f":"IF(ISTEXT('S11'!$I$42),NA(),'S11'!$I$42)","v":{"$error":"#N/A"}},{"$error":"#N/A"}]
[{"$f":"IF(ISBLANK('S11'!K$28),\" \",'S11'!K$28)","v":" "},{"$f":"IF(ISTEXT('S11'!$L$34),NA(),'S11'!$L$34)","v":{"$error":"#N/A"}},{"$f":"IF(ISTEXT('S11'!$L$35),NA(),'S11'!$L$35)","v":{"$error":"#N/A"}},{"$f":"IF(ISTEXT('S11'!$L$36),NA(),'S11'!$L$36)","v":{"$error":"#N/A"}},{"$f":"IF(ISTEXT('S11'!$L$37),NA(),'S11'!$L$37)","v":{"$error":"#N/A"}},{"$f":"IF(ISTEXT('S11'!$L$38),NA(),'S11'!$L$38)","v":{"$error":"#N/A"}},{"$f":"IF(ISTEXT('S11'!$L$39),NA(),'S11'!$L$39)","v":{"$error":"#N/A"}},{"$error":"#N/A"},{"$f":"IF(ISTEXT('S11'!$L$40),NA(),'S11'!$L$40)","v":{"$error":"#N/A"}},{"$error":"#N/A"},{"$f":"IF(ISTEXT('S11'!$L$41),NA(),'S11'!$L$41)","v":{"$error":"#N/A"}},{"$error":"#N/A"},{"$f":"IF(ISTEXT('S11'!$K$42),NA(),'S11'!$K$42)","v":{"$error":"#N/A"}},{"$error":"#N/A"}]
[{"$f":"IF(ISBLANK('S11'!M$28),\" \",'S11'!M$28)","v":" "},{"$f":"IF(ISTEXT('S11'!$N$34),NA(),'S11'!$N$34)","v":{"$error":"#N/A"}},{"$f":"IF(ISTEXT('S11'!$N$35),NA(),'S11'!$N$35)","v":{"$error":"#N/A"}},{"$f":"IF(ISTEXT('S11'!$N$36),NA(),'S11'!$N$36)","v":{"$error":"#N/A"}},{"$f":"IF(ISTEXT('S11'!$N$37),NA(),'S11'!$N$37)","v":{"$error":"#N/A"}},{"$f":"IF(ISTEXT('S11'!$N$38),NA(),'S11'!$N$38)","v":{"$error":"#N/A"}},{"$f":"IF(ISTEXT('S11'!$N$39),NA(),'S11'!$N$39)","v":{"$error":"#N/A"}},{"$error":"#N/A"},{"$f":"IF(ISTEXT('S11'!$N$40),NA(),'S11'!$N$40)","v":{"$error":"#N/A"}},{"$error":"#N/A"},{"$f":"IF(ISTEXT('S11'!$N$41),NA(),'S11'!$N$41)","v":{"$error":"#N/A"}},{"$error":"#N/A"},{"$f":"IF(ISTEXT('S11'!$M$42),NA(),'S11'!$M$42)","v":{"$error":"#N/A"}},{"$error":"#N/A"}]
[{"$f":"IF(ISBLANK('S12'!C$8),\" \",'S12'!C$8)","v":" "},{"$f":"IF(ISTEXT('S12'!$D$14),NA(),'S12'!$D$14)","v":{"$error":"#N/A"}},{"$f":"IF(ISTEXT('S12'!$D$15),NA(),'S12'!$D$15)","v":{"$error":"#N/A"}},{"$f":"IF(ISTEXT('S12'!$D$16),NA(),'S12'!$D$16)","v":{"$error":"#N/A"}},{"$f":"IF(ISTEXT('S12'!$D$17),NA(),'S12'!$D$17)","v":{"$error":"#N/A"}},{"$f":"IF(ISTEXT('S12'!$D$18),NA(),'S12'!$D$18)","v":{"$error":"#N/A"}},{"$f":"IF(ISTEXT('S12'!$D$19),NA(),'S12'!$D$19)","v":{"$error":"#N/A"}},{"$error":"#N/A"},{"$f":"IF(ISTEXT('S12'!$D$20),NA(),'S12'!$D$20)","v":{"$error":"#N/A"}},{"$error":"#N/A"},{"$f":"IF(ISTEXT('S12'!$D$21),NA(),'S12'!$D$21)","v":{"$error":"#N/A"}},{"$error":"#N/A"},{"$f":"IF(ISTEXT('S12'!$C$22),NA(),'S12'!$C$22)","v":{"$error":"#N/A"}},{"$error":"#N/A"}]
[{"$f":"IF(ISBLANK('S12'!E$8),\" \",'S12'!E$8)","v":" "},{"$f":"IF(ISTEXT('S12'!$F$14),NA(),'S12'!$F$14)","v":{"$error":"#N/A"}},{"$f":"IF(ISTEXT('S12'!$F$15),NA(),'S12'!$F$15)","v":{"$error":"#N/A"}},{"$f":"IF(ISTEXT('S12'!$F$16),NA(),'S12'!$F$16)","v":{"$error":"#N/A"}},{"$f":"IF(ISTEXT('S12'!$F$17),NA(),'S12'!$F$17)","v":{"$error":"#N/A"}},{"$f":"IF(ISTEXT('S12'!$F$18),NA(),'S12'!$F$18)","v":{"$error":"#N/A"}},{"$f":"IF(ISTEXT('S12'!$F$19),NA(),'S12'!$F$19)","v":{"$error":"#N/A"}},{"$error":"#N/A"},{"$f":"IF(ISTEXT('S12'!$F$20),NA(),'S12'!$F$20)","v":{"$error":"#N/A"}},{"$error":"#N/A"},{"$f":"IF(ISTEXT('S12'!$F$21),NA(),'S12'!$F$21)","v":{"$error":"#N/A"}},{"$error":"#N/A"},{"$f":"IF(ISTEXT('S12'!$E$22),NA(),'S12'!$E$22)","v":{"$error":"#N/A"}},{"$error":"#N/A"}]
[{"$f":"IF(ISBLANK('S12'!G$8),\" \",'S12'!G$8)","v":" "},{"$f":"IF(ISTEXT('S12'!$H$14),NA(),'S12'!$H$14)","v":{"$error":"#N/A"}},{"$f":"IF(ISTEXT('S12'!$H$15),NA(),'S12'!$H$15)","v":{"$error":"#N/A"}},{"$f":"IF(ISTEXT('S12'!$H$16),NA(),'S12'!$H$16)","v":{"$error":"#N/A"}},{"$f":"IF(ISTEXT('S12'!$H$17),NA(),'S12'!$H$17)","v":{"$error":"#N/A"}},{"$f":"IF(ISTEXT('S12'!$H$18),NA(),'S12'!$H$18)","v":{"$error":"#N/A"}},{"$f":"IF(ISTEXT('S12'!$H$19),NA(),'S12'!$H$19)","v":{"$error":"#N/A"}},{"$error":"#N/A"},{"$f":"IF(ISTEXT('S12'!$H$20),NA(),'S12'!$H$20)","v":{"$error":"#N/A"}},{"$error":"#N/A"},{"$f":"IF(ISTEXT('S12'!$H$21),NA(),'S12'!$H$21)","v":{"$error":"#N/A"}},{"$error":"#N/A"},{"$f":"IF(ISTEXT('S12'!$G$22),NA(),'S12'!$G$22)","v":{"$error":"#N/A"}},{"$error":"#N/A"}]
[{"$f":"IF(ISBLANK('S12'!I$8),\" \",'S12'!I$8)","v":" "},{"$f":"IF(ISTEXT('S12'!$J$14),NA(),'S12'!$J$14)","v":{"$error":"#N/A"}},{"$f":"IF(ISTEXT('S12'!$J$15),NA(),'S12'!$J$15)","v":{"$error":"#N/A"}},{"$f":"IF(ISTEXT('S12'!$J$16),NA(),'S12'!$J$16)","v":{"$error":"#N/A"}},{"$f":"IF(ISTEXT('S12'!$J$17),NA(),'S12'!$J$17)","v":{"$error":"#N/A"}},{"$f":"IF(ISTEXT('S12'!$J$18),NA(),'S12'!$J$18)","v":{"$error":"#N/A"}},{"$f":"IF(ISTEXT('S12'!$J$19),NA(),'S12'!$J$19)","v":{"$error":"#N/A"}},{"$error":"#N/A"},{"$f":"IF(ISTEXT('S12'!$J$20),NA(),'S12'!$J$20)","v":{"$error":"#N/A"}},{"$error":"#N/A"},{"$f":"IF(ISTEXT('S12'!$J$21),NA(),'S12'!$J$21)","v":{"$error":"#N/A"}},{"$error":"#N/A"},{"$f":"IF(ISTEXT('S12'!$I$22),NA(),'S12'!$I$22)","v":{"$error":"#N/A"}},{"$error":"#N/A"}]
[{"$f":"IF(ISBLANK('S12'!K$8),\" \",'S12'!K$8)","v":" "},{"$f":"IF(ISTEXT('S12'!$L$14),NA(),'S12'!$L$14)","v":{"$error":"#N/A"}},{"$f":"IF(ISTEXT('S12'!$L$15),NA(),'S12'!$L$15)","v":{"$error":"#N/A"}},{"$f":"IF(ISTEXT('S12'!$L$16),NA(),'S12'!$L$16)","v":{"$error":"#N/A"}},{"$f":"IF(ISTEXT('S12'!$L$17),NA(),'S12'!$L$17)","v":{"$error":"#N/A"}},{"$f":"IF(ISTEXT('S12'!$L$18),NA(),'S12'!$L$18)","v":{"$error":"#N/A"}},{"$f":"IF(ISTEXT('S12'!$L$19),NA(),'S12'!$L$19)","v":{"$error":"#N/A"}},{"$error":"#N/A"},{"$f":"IF(ISTEXT('S12'!$L$20),NA(),'S12'!$L$20)","v":{"$error":"#N/A"}},{"$error":"#N/A"},{"$f":"IF(ISTEXT('S12'!$L$21),NA(),'S12'!$L$21)","v":{"$error":"#N/A"}},{"$error":"#N/A"},{"$f":"IF(ISTEXT('S12'!$K$22),NA(),'S12'!$K$22)","v":{"$error":"#N/A"}},{"$error":"#N/A"}]
[{"$f":"IF(ISBLANK('S12'!M$8),\" \",'S12'!M$8)","v":" "},{"$f":"IF(ISTEXT('S12'!$N$14),NA(),'S12'!$N$14)","v":{"$error":"#N/A"}},{"$f":"IF(ISTEXT('S12'!$N$15),NA(),'S12'!$N$15)","v":{"$error":"#N/A"}},{"$f":"IF(ISTEXT('S12'!$N$16),NA(),'S12'!$N$16)","v":{"$error":"#N/A"}},{"$f":"IF(ISTEXT('S12'!$N$17),NA(),'S12'!$N$17)","v":{"$error":"#N/A"}},{"$f":"IF(ISTEXT('S12'!$N$18),NA(),'S12'!$N$18)","v":{"$error":"#N/A"}},{"$f":"IF(ISTEXT('S12'!$N$19),NA(),'S12'!$N$19)","v":{"$error":"#N/A"}},{"$error":"#N/A"},{"$f":"IF(ISTEXT('S12'!$N$20),NA(),'S12'!$N$20)","v":{"$error":"#N/A"}},{"$error":"#N/A"},{"$f":"IF(ISTEXT('S12'!$N$21),NA(),'S12'!$N$21)","v":{"$error":"#N/A"}},{"$error":"#N/A"},{"$f":"IF(ISTEXT('S12'!$M$22),NA(),'S12'!$M$22)","v":{"$error":"#N/A"}},{"$error":"#N/A"}]
[{"$f":"IF(ISBLANK('S12'!C$28),\" \",'S12'!C$28)","v":" "},{"$f":"IF(ISTEXT('S12'!$D$34),NA(),'S12'!$D$34)","v":{"$error":"#N/A"}},{"$f":"IF(ISTEXT('S12'!$D$35),NA(),'S12'!$D$35)","v":{"$error":"#N/A"}},{"$f":"IF(ISTEXT('S12'!$D$36),NA(),'S12'!$D$36)","v":{"$error":"#N/A"}},{"$f":"IF(ISTEXT('S12'!$D$37),NA(),'S12'!$D$37)","v":{"$error":"#N/A"}},{"$f":"IF(ISTEXT('S12'!$D$38),NA(),'S12'!$D$38)","v":{"$error":"#N/A"}},{"$f":"IF(ISTEXT('S12'!$D$39),NA(),'S12'!$D$39)","v":{"$error":"#N/A"}},{"$error":"#N/A"},{"$f":"IF(ISTEXT('S12'!$D$40),NA(),'S12'!$D$40)","v":{"$error":"#N/A"}},{"$error":"#N/A"},{"$f":"IF(ISTEXT('S12'!$D$41),NA(),'S12'!$D$41)","v":{"$error":"#N/A"}},{"$error":"#N/A"},{"$f":"IF(ISTEXT('S12'!$C$42),NA(),'S12'!$C$42)","v":{"$error":"#N/A"}},{"$error":"#N/A"}]
[{"$f":"IF(ISBLANK('S12'!E$28),\" \",'S12'!E$28)","v":" "},{"$f":"IF(ISTEXT('S12'!$F$34),NA(),'S12'!$F$34)","v":{"$error":"#N/A"}},{"$f":"IF(ISTEXT('S12'!$F$35),NA(),'S12'!$F$35)","v":{"$error":"#N/A"}},{"$f":"IF(ISTEXT('S12'!$F$36),NA(),'S12'!$F$36)","v":{"$error":"#N/A"}},{"$f":"IF(ISTEXT('S12'!$F$37),NA(),'S12'!$F$37)","v":{"$error":"#N/A"}},{"$f":"IF(ISTEXT('S12'!$F$38),NA(),'S12'!$F$38)","v":{"$error":"#N/A"}},{"$f":"IF(ISTEXT('S12'!$F$39),NA(),'S12'!$F$39)","v":{"$error":"#N/A"}},{"$error":"#N/A"},{"$f":"IF(ISTEXT('S12'!$F$40),NA(),'S12'!$F$40)","v":{"$error":"#N/A"}},{"$error":"#N/A"},{"$f":"IF(ISTEXT('S12'!$F$41),NA(),'S12'!$F$41)","v":{"$error":"#N/A"}},{"$error":"#N/A"},{"$f":"IF(ISTEXT('S12'!$E$42),NA(),'S12'!$E$42)","v":{"$error":"#N/A"}},{"$error":"#N/A"}]
[{"$f":"IF(ISBLANK('S12'!G$28),\" \",'S12'!G$28)","v":" "},{"$f":"IF(ISTEXT('S12'!$H$34),NA(),'S12'!$H$34)","v":{"$error":"#N/A"}},{"$f":"IF(ISTEXT('S12'!$H$35),NA(),'S12'!$H$35)","v":{"$error":"#N/A"}},{"$f":"IF(ISTEXT('S12'!$H$36),NA(),'S12'!$H$36)","v":{"$error":"#N/A"}},{"$f":"IF(ISTEXT('S12'!$H$37),NA(),'S12'!$H$37)","v":{"$error":"#N/A"}},{"$f":"IF(ISTEXT('S12'!$H$38),NA(),'S12'!$H$38)","v":{"$error":"#N/A"}},{"$f":"IF(ISTEXT('S12'!$H$39),NA(),'S12'!$H$39)","v":{"$error":"#N/A"}},{"$error":"#N/A"},{"$f":"IF(ISTEXT('S12'!$H$40),NA(),'S12'!$H$40)","v":{"$error":"#N/A"}},{"$error":"#N/A"},{"$f":"IF(ISTEXT('S12'!$H$41),NA(),'S12'!$H$41)","v":{"$error":"#N/A"}},{"$error":"#N/A"},{"$f":"IF(ISTEXT('S12'!$G$42),NA(),'S12'!$G$42)","v":{"$error":"#N/A"}},{"$error":"#N/A"}]
[{"$f":"IF(ISBLANK('S12'!I$28),\" \",'S12'!I$28)","v":" "},{"$f":"IF(ISTEXT('S12'!$J$34),NA(),'S12'!$J$34)","v":{"$error":"#N/A"}},{"$f":"IF(ISTEXT('S12'!$J$35),NA(),'S12'!$J$35)","v":{"$error":"#N/A"}},{"$f":"IF(ISTEXT('S12'!$J$36),NA(),'S12'!$J$36)","v":{"$error":"#N/A"}},{"$f":"IF(ISTEXT('S12'!$J$37),NA(),'S12'!$J$37)","v":{"$error":"#N/A"}},{"$f":"IF(ISTEXT('S12'!$J$38),NA(),'S12'!$J$38)","v":{"$error":"#N/A"}},{"$f":"IF(ISTEXT('S12'!$J$39),NA(),'S12'!$J$39)","v":{"$error":"#N/A"}},{"$error":"#N/A"},{"$f":"IF(ISTEXT('S12'!$J$40),NA(),'S12'!$J$40)","v":{"$error":"#N/A"}},{"$error":"#N/A"},{"$f":"IF(ISTEXT('S12'!$J$41),NA(),'S12'!$J$41)","v":{"$error":"#N/A"}},{"$error":"#N/A"},{"$f":"IF(ISTEXT('S12'!$I$42),NA(),'S12'!$I$42)","v":{"$error":"#N/A"}},{"$error":"#N/A"}]
[{"$f":"IF(ISBLANK('S12'!K$28),\" \",'S12'!K$28)","v":" "},{"$f":"IF(ISTEXT('S12'!$L$34),NA(),'S12'!$L$34)","v":{"$error":"#N/A"}},{"$f":"IF(ISTEXT('S12'!$L$35),NA(),'S12'!$L$35)","v":{"$error":"#N/A"}},{"$f":"IF(ISTEXT('S12'!$L$36),NA(),'S12'!$L$36)","v":{"$error":"#N/A"}},{"$f":"IF(ISTEXT('S12'!$L$37),NA(),'S12'!$L$37)","v":{"$error":"#N/A"}},{"$f":"IF(ISTEXT('S12'!$L$38),NA(),'S12'!$L$38)","v":{"$error":"#N/A"}},{"$f":"IF(ISTEXT('S12'!$L$39),NA(),'S12'!$L$39)","v":{"$error":"#N/A"}},{"$error":"#N/A"},{"$f":"IF(ISTEXT('S12'!$L$40),NA(),'S12'!$L$40)","v":{"$error":"#N/A"}},{"$error":"#N/A"},{"$f":"IF(ISTEXT('S12'!$L$41),NA(),'S12'!$L$41)","v":{"$error":"#N/A"}},{"$error":"#N/A"},{"$f":"IF(ISTEXT('S12'!$K$42),NA(),'S12'!$K$42)","v":{"$error":"#N/A"}},{"$error":"#N/A"}]
[{"$f":"IF(ISBLANK('S12'!M$28),\" \",'S12'!M$28)","v":" "},{"$f":"IF(ISTEXT('S12'!$N$34),NA(),'S12'!$N$34)","v":{"$error":"#N/A"}},{"$f":"IF(ISTEXT('S12'!$N$35),NA(),'S12'!$N$35)","v":{"$error":"#N/A"}},{"$f":"IF(ISTEXT('S12'!$N$36),NA(),'S12'!$N$36)","v":{"$error":"#N/A"}},{"$f":"IF(ISTEXT('S12'!$N$37),NA(),'S12'!$N$37)","v":{"$error":"#N/A"}},{"$f":"IF(ISTEXT('S12'!$N$38),NA(),'S12'!$N$38)","v":{"$error":"#N/A"}},{"$f":"IF(ISTEXT('S12'!$N$39),NA(),'S12'!$N$39)","v":{"$error":"#N/A"}},{"$error":"#N/A"},{"$f":"IF(ISTEXT('S12'!$N$40),NA(),'S12'!$N$40)","v":{"$error":"#N/A"}},{"$error":"#N/A"},{"$f":"IF(ISTEXT('S12'!$N$41),NA(),'S12'!$N$41)","v":{"$error":"#N/A"}},{"$error":"#N/A"},{"$f":"IF(ISTEXT('S12'!$M$42),NA(),'S12'!$M$42)","v":{"$error":"#N/A"}},{"$error":"#N/A"}]

{"sheet":"S14","index":20,"n_rows":145,"n_cols":9,"rows_kept":145,"cut":false,"hidden":true,"merged":[]}
["FM",200,100,50,30,16,8,4,0.375]
[{"$f":"'S1'!$C$22","v":" "},{"$f":"'S1'!$D$21","v":"  "},{"$f":"'S1'!$D$20","v":"  "},{"$f":"'S1'!$D$19","v":"  "},{"$f":"'S1'!$D$18","v":"  "},{"$f":"'S1'!$D$17","v":"  "},{"$f":"'S1'!$D$16","v":"  "},{"$f":"'S1'!$D$15","v":"  "},{"$f":"'S1'!$D$14","v":"  "}]
[{"$f":"'S1'!$E$22","v":" "},{"$f":"'S1'!$F$21","v":"  "},{"$f":"'S1'!$F$20","v":"  "},{"$f":"'S1'!$F$19","v":"  "},{"$f":"'S1'!$F$18","v":"  "},{"$f":"'S1'!$F$17","v":"  "},{"$f":"'S1'!$F$16","v":"  "},{"$f":"'S1'!$F$15","v":"  "},{"$f":"'S1'!$F$14","v":"  "}]
[{"$f":"'S1'!$G$22","v":" "},{"$f":"'S1'!$H$21","v":"  "},{"$f":"'S1'!$H$20","v":"  "},{"$f":"'S1'!$H$19","v":"  "},{"$f":"'S1'!$H$18","v":"  "},{"$f":"'S1'!$H$17","v":"  "},{"$f":"'S1'!$H$16","v":"  "},{"$f":"'S1'!$H$15","v":"  "},{"$f":"'S1'!$H$14","v":"  "}]
[{"$f":"'S1'!$I$22","v":" "},{"$f":"'S1'!$J$21","v":"  "},{"$f":"'S1'!$J$20","v":"  "},{"$f":"'S1'!$J$19","v":"  "},{"$f":"'S1'!$J$18","v":"  "},{"$f":"'S1'!$J$17","v":"  "},{"$f":"'S1'!$J$16","v":"  "},{"$f":"'S1'!$J$15","v":"  "},{"$f":"'S1'!$J$14","v":"  "}]
[{"$f":"'S1'!$K$22","v":" "},{"$f":"'S1'!$L$21","v":"  "},{"$f":"'S1'!$L$20","v":"  "},{"$f":"'S1'!$L$19","v":"  "},{"$f":"'S1'!$L$18","v":"  "},{"$f":"'S1'!$L$17","v":"  "},{"$f":"'S1'!$L$16","v":"  "},{"$f":"'S1'!$L$15","v":"  "},{"$f":"'S1'!$L$14","v":"  "}]
[{"$f":"'S1'!$M$22","v":" "},{"$f":"'S1'!$N$21","v":"  "},{"$f":"'S1'!$N$20","v":"  "},{"$f":"'S1'!$N$19","v":"  "},{"$f":"'S1'!$N$18","v":"  "},{"$f":"'S1'!$N$17","v":"  "},{"$f":"'S1'!$N$16","v":"  "},{"$f":"'S1'!$N$15","v":"  "},{"$f":"'S1'!$N$14","v":"  "}]
[{"$f":"'S1'!$C$42","v":" "},{"$f":"'S1'!$D$41","v":"  "},{"$f":"'S1'!$D$40","v":"  "},{"$f":"'S1'!$D$39","v":"  "},{"$f":"'S1'!$D$38","v":"  "},{"$f":"'S1'!$D$37","v":"  "},{"$f":"'S1'!$D$36","v":"  "},{"$f":"'S1'!$D$35","v":"  "},{"$f":"'S1'!$D$34","v":"  "}]
[{"$f":"'S1'!$E$42","v":" "},{"$f":"'S1'!$F$41","v":"  "},{"$f":"'S1'!$F$40","v":"  "},{"$f":"'S1'!$F$39","v":"  "},{"$f":"'S1'!$F$38","v":"  "},{"$f":"'S1'!$F$37","v":"  "},{"$f":"'S1'!$F$36","v":"  "},{"$f":"'S1'!$F$35","v":"  "},{"$f":"'S1'!$F$34","v":"  "}]
[{"$f":"'S1'!$G$42","v":" "},{"$f":"'S1'!$H$41","v":"  "},{"$f":"'S1'!$H$40","v":"  "},{"$f":"'S1'!$H$39","v":"  "},{"$f":"'S1'!$H$38","v":"  "},{"$f":"'S1'!$H$37","v":"  "},{"$f":"'S1'!$H$36","v":"  "},{"$f":"'S1'!$H$35","v":"  "},{"$f":"'S1'!$H$34","v":"  "}]
[{"$f":"'S1'!$I$42","v":" "},{"$f":"'S1'!$J$41","v":"  "},{"$f":"'S1'!$J$40","v":"  "},{"$f":"'S1'!$J$39","v":"  "},{"$f":"'S1'!$J$38","v":"  "},{"$f":"'S1'!$J$37","v":"  "},{"$f":"'S1'!$J$36","v":"  "},{"$f":"'S1'!$J$35","v":"  "},{"$f":"'S1'!$J$34","v":"  "}]
[{"$f":"'S1'!$K$42","v":" "},{"$f":"'S1'!$L$41","v":"  "},{"$f":"'S1'!$L$40","v":"  "},{"$f":"'S1'!$L$39","v":"  "},{"$f":"'S1'!$L$38","v":"  "},{"$f":"'S1'!$L$37","v":"  "},{"$f":"'S1'!$L$36","v":"  "},{"$f":"'S1'!$L$35","v":"  "},{"$f":"'S1'!$L$34","v":"  "}]
[{"$f":"'S1'!$M$42","v":" "},{"$f":"'S1'!$N$41","v":"  "},{"$f":"'S1'!$N$40","v":"  "},{"$f":"'S1'!$N$39","v":"  "},{"$f":"'S1'!$N$38","v":"  "},{"$f":"'S1'!$N$37","v":"  "},{"$f":"'S1'!$N$36","v":"  "},{"$f":"'S1'!$N$35","v":"  "},{"$f":"'S1'!$N$34","v":"  "}]
[{"$f":"'S2'!$C$22","v":" "},{"$f":"'S2'!$D$21","v":"  "},{"$f":"'S2'!$D$20","v":"  "},{"$f":"'S2'!$D$19","v":"  "},{"$f":"'S2'!$D$18","v":"  "},{"$f":"'S2'!$D$17","v":"  "},{"$f":"'S2'!$D$16","v":"  "},{"$f":"'S2'!$D$15","v":"  "},{"$f":"'S2'!$D$14","v":"  "}]
[{"$f":"'S2'!$E$22","v":" "},{"$f":"'S2'!$F$21","v":"  "},{"$f":"'S2'!$F$20","v":"  "},{"$f":"'S2'!$F$19","v":"  "},{"$f":"'S2'!$F$18","v":"  "},{"$f":"'S2'!$F$17","v":"  "},{"$f":"'S2'!$F$16","v":"  "},{"$f":"'S2'!$F$15","v":"  "},{"$f":"'S2'!$F$14","v":"  "}]
[{"$f":"'S2'!$G$22","v":" "},{"$f":"'S2'!$H$21","v":"  "},{"$f":"'S2'!$H$20","v":"  "},{"$f":"'S2'!$H$19","v":"  "},{"$f":"'S2'!$H$18","v":"  "},{"$f":"'S2'!$H$17","v":"  "},{"$f":"'S2'!$H$16","v":"  "},{"$f":"'S2'!$H$15","v":"  "},{"$f":"'S2'!$H$14","v":"  "}]
[{"$f":"'S2'!$I$22","v":" "},{"$f":"'S2'!$J$21","v":"  "},{"$f":"'S2'!$J$20","v":"  "},{"$f":"'S2'!$J$19","v":"  "},{"$f":"'S2'!$J$18","v":"  "},{"$f":"'S2'!$J$17","v":"  "},{"$f":"'S2'!$J$16","v":"  "},{"$f":"'S2'!$J$15","v":"  "},{"$f":"'S2'!$J$14","v":"  "}]
[{"$f":"'S2'!$K$22","v":" "},{"$f":"'S2'!$L$21","v":"  "},{"$f":"'S2'!$L$20","v":"  "},{"$f":"'S2'!$L$19","v":"  "},{"$f":"'S2'!$L$18","v":"  "},{"$f":"'S2'!$L$17","v":"  "},{"$f":"'S2'!$L$16","v":"  "},{"$f":"'S2'!$L$15","v":"  "},{"$f":"'S2'!$L$14","v":"  "}]
[{"$f":"'S2'!$M$22","v":" "},{"$f":"'S2'!$N$21","v":"  "},{"$f":"'S2'!$N$20","v":"  "},{"$f":"'S2'!$N$19","v":"  "},{"$f":"'S2'!$N$18","v":"  "},{"$f":"'S2'!$N$17","v":"  "},{"$f":"'S2'!$N$16","v":"  "},{"$f":"'S2'!$N$15","v":"  "},{"$f":"'S2'!$N$14","v":"  "}]
[{"$f":"'S2'!$C$42","v":" "},{"$f":"'S2'!$D$41","v":"  "},{"$f":"'S2'!$D$40","v":"  "},{"$f":"'S2'!$D$39","v":"  "},{"$f":"'S2'!$D$38","v":"  "},{"$f":"'S2'!$D$37","v":"  "},{"$f":"'S2'!$D$36","v":"  "},{"$f":"'S2'!$D$35","v":"  "},{"$f":"'S2'!$D$34","v":"  "}]
[{"$f":"'S2'!$E$42","v":" "},{"$f":"'S2'!$F$41","v":"  "},{"$f":"'S2'!$F$40","v":"  "},{"$f":"'S2'!$F$39","v":"  "},{"$f":"'S2'!$F$38","v":"  "},{"$f":"'S2'!$F$37","v":"  "},{"$f":"'S2'!$F$36","v":"  "},{"$f":"'S2'!$F$35","v":"  "},{"$f":"'S2'!$F$34","v":"  "}]
[{"$f":"'S2'!$G$42","v":" "},{"$f":"'S2'!$H$41","v":"  "},{"$f":"'S2'!$H$40","v":"  "},{"$f":"'S2'!$H$39","v":"  "},{"$f":"'S2'!$H$38","v":"  "},{"$f":"'S2'!$H$37","v":"  "},{"$f":"'S2'!$H$36","v":"  "},{"$f":"'S2'!$H$35","v":"  "},{"$f":"'S2'!$H$34","v":"  "}]
[{"$f":"'S2'!$I$42","v":" "},{"$f":"'S2'!$J$41","v":"  "},{"$f":"'S2'!$J$40","v":"  "},{"$f":"'S2'!$J$39","v":"  "},{"$f":"'S2'!$J$38","v":"  "},{"$f":"'S2'!$J$37","v":"  "},{"$f":"'S2'!$J$36","v":"  "},{"$f":"'S2'!$J$35","v":"  "},{"$f":"'S2'!$J$34","v":"  "}]
[{"$f":"'S2'!$K$42","v":" "},{"$f":"'S2'!$L$41","v":"  "},{"$f":"'S2'!$L$40","v":"  "},{"$f":"'S2'!$L$39","v":"  "},{"$f":"'S2'!$L$38","v":"  "},{"$f":"'S2'!$L$37","v":"  "},{"$f":"'S2'!$L$36","v":"  "},{"$f":"'S2'!$L$35","v":"  "},{"$f":"'S2'!$L$34","v":"  "}]
[{"$f":"'S2'!$M$42","v":" "},{"$f":"'S2'!$N$41","v":"  "},{"$f":"'S2'!$N$40","v":"  "},{"$f":"'S2'!$N$39","v":"  "},{"$f":"'S2'!$N$38","v":"  "},{"$f":"'S2'!$N$37","v":"  "},{"$f":"'S2'!$N$36","v":"  "},{"$f":"'S2'!$N$35","v":"  "},{"$f":"'S2'!$N$34","v":"  "}]
[{"$f":"'S3'!$C$22","v":" "},{"$f":"'S3'!$D$21","v":"  "},{"$f":"'S3'!$D$20","v":"  "},{"$f":"'S3'!$D$19","v":"  "},{"$f":"'S3'!$D$18","v":"  "},{"$f":"'S3'!$D$17","v":"  "},{"$f":"'S3'!$D$16","v":"  "},{"$f":"'S3'!$D$15","v":"  "},{"$f":"'S3'!$D$14","v":"  "}]
[{"$f":"'S3'!$E$22","v":" "},{"$f":"'S3'!$F$21","v":"  "},{"$f":"'S3'!$F$20","v":"  "},{"$f":"'S3'!$F$19","v":"  "},{"$f":"'S3'!$F$18","v":"  "},{"$f":"'S3'!$F$17","v":"  "},{"$f":"'S3'!$F$16","v":"  "},{"$f":"'S3'!$F$15","v":"  "},{"$f":"'S3'!$F$14","v":"  "}]
[{"$f":"'S3'!$G$22","v":" "},{"$f":"'S3'!$H$21","v":"  "},{"$f":"'S3'!$H$20","v":"  "},{"$f":"'S3'!$H$19","v":"  "},{"$f":"'S3'!$H$18","v":"  "},{"$f":"'S3'!$H$17","v":"  "},{"$f":"'S3'!$H$16","v":"  "},{"$f":"'S3'!$H$15","v":"  "},{"$f":"'S3'!$H$14","v":"  "}]
[{"$f":"'S3'!$I$22","v":" "},{"$f":"'S3'!$J$21","v":"  "},{"$f":"'S3'!$J$20","v":"  "},{"$f":"'S3'!$J$19","v":"  "},{"$f":"'S3'!$J$18","v":"  "},{"$f":"'S3'!$J$17","v":"  "},{"$f":"'S3'!$J$16","v":"  "},{"$f":"'S3'!$J$15","v":"  "},{"$f":"'S3'!$J$14","v":"  "}]
[{"$f":"'S3'!$K$22","v":" "},{"$f":"'S3'!$L$21","v":"  "},{"$f":"'S3'!$L$20","v":"  "},{"$f":"'S3'!$L$19","v":"  "},{"$f":"'S3'!$L$18","v":"  "},{"$f":"'S3'!$L$17","v":"  "},{"$f":"'S3'!$L$16","v":"  "},{"$f":"'S3'!$L$15","v":"  "},{"$f":"'S3'!$L$14","v":"  "}]
[{"$f":"'S3'!$M$22","v":" "},{"$f":"'S3'!$N$21","v":"  "},{"$f":"'S3'!$N$20","v":"  "},{"$f":"'S3'!$N$19","v":"  "},{"$f":"'S3'!$N$18","v":"  "},{"$f":"'S3'!$N$17","v":"  "},{"$f":"'S3'!$N$16","v":"  "},{"$f":"'S3'!$N$15","v":"  "},{"$f":"'S3'!$N$14","v":"  "}]
[{"$f":"'S3'!$C$42","v":" "},{"$f":"'S3'!$D$41","v":"  "},{"$f":"'S3'!$D$40","v":"  "},{"$f":"'S3'!$D$39","v":"  "},{"$f":"'S3'!$D$38","v":"  "},{"$f":"'S3'!$D$37","v":"  "},{"$f":"'S3'!$D$36","v":"  "},{"$f":"'S3'!$D$35","v":"  "},{"$f":"'S3'!$D$34","v":"  "}]
[{"$f":"'S3'!$E$42","v":" "},{"$f":"'S3'!$F$41","v":"  "},{"$f":"'S3'!$F$40","v":"  "},{"$f":"'S3'!$F$39","v":"  "},{"$f":"'S3'!$F$38","v":"  "},{"$f":"'S3'!$F$37","v":"  "},{"$f":"'S3'!$F$36","v":"  "},{"$f":"'S3'!$F$35","v":"  "},{"$f":"'S3'!$F$34","v":"  "}]
[{"$f":"'S3'!$G$42","v":" "},{"$f":"'S3'!$H$41","v":"  "},{"$f":"'S3'!$H$40","v":"  "},{"$f":"'S3'!$H$39","v":"  "},{"$f":"'S3'!$H$38","v":"  "},{"$f":"'S3'!$H$37","v":"  "},{"$f":"'S3'!$H$36","v":"  "},{"$f":"'S3'!$H$35","v":"  "},{"$f":"'S3'!$H$34","v":"  "}]
[{"$f":"'S3'!$I$42","v":" "},{"$f":"'S3'!$J$41","v":"  "},{"$f":"'S3'!$J$40","v":"  "},{"$f":"'S3'!$J$39","v":"  "},{"$f":"'S3'!$J$38","v":"  "},{"$f":"'S3'!$J$37","v":"  "},{"$f":"'S3'!$J$36","v":"  "},{"$f":"'S3'!$J$35","v":"  "},{"$f":"'S3'!$J$34","v":"  "}]
[{"$f":"'S3'!$K$42","v":" "},{"$f":"'S3'!$L$41","v":"  "},{"$f":"'S3'!$L$40","v":"  "},{"$f":"'S3'!$L$39","v":"  "},{"$f":"'S3'!$L$38","v":"  "},{"$f":"'S3'!$L$37","v":"  "},{"$f":"'S3'!$L$36","v":"  "},{"$f":"'S3'!$L$35","v":"  "},{"$f":"'S3'!$L$34","v":"  "}]
[{"$f":"'S3'!$M$42","v":" "},{"$f":"'S3'!$N$41","v":"  "},{"$f":"'S3'!$N$40","v":"  "},{"$f":"'S3'!$N$39","v":"  "},{"$f":"'S3'!$N$38","v":"  "},{"$f":"'S3'!$N$37","v":"  "},{"$f":"'S3'!$N$36","v":"  "},{"$f":"'S3'!$N$35","v":"  "},{"$f":"'S3'!$N$34","v":"  "}]
[{"$f":"'S4'!$C$22","v":" "},{"$f":"'S4'!$D$21","v":"  "},{"$f":"'S4'!$D$20","v":"  "},{"$f":"'S4'!$D$19","v":"  "},{"$f":"'S4'!$D$18","v":"  "},{"$f":"'S4'!$D$17","v":"  "},{"$f":"'S4'!$D$16","v":"  "},{"$f":"'S4'!$D$15","v":"  "},{"$f":"'S4'!$D$14","v":"  "}]
[{"$f":"'S4'!$E$22","v":" "},{"$f":"'S4'!$F$21","v":"  "},{"$f":"'S4'!$F$20","v":"  "},{"$f":"'S4'!$F$19","v":"  "},{"$f":"'S4'!$F$18","v":"  "},{"$f":"'S4'!$F$17","v":"  "},{"$f":"'S4'!$F$16","v":"  "},{"$f":"'S4'!$F$15","v":"  "},{"$f":"'S4'!$F$14","v":"  "}]
[{"$f":"'S4'!$G$22","v":" "},{"$f":"'S4'!$H$21","v":"  "},{"$f":"'S4'!$H$20","v":"  "},{"$f":"'S4'!$H$19","v":"  "},{"$f":"'S4'!$H$18","v":"  "},{"$f":"'S4'!$H$17","v":"  "},{"$f":"'S4'!$H$16","v":"  "},{"$f":"'S4'!$H$15","v":"  "},{"$f":"'S4'!$H$14","v":"  "}]
[{"$f":"'S4'!$I$22","v":" "},{"$f":"'S4'!$J$21","v":"  "},{"$f":"'S4'!$J$20","v":"  "},{"$f":"'S4'!$J$19","v":"  "},{"$f":"'S4'!$J$18","v":"  "},{"$f":"'S4'!$J$17","v":"  "},{"$f":"'S4'!$J$16","v":"  "},{"$f":"'S4'!$J$15","v":"  "},{"$f":"'S4'!$J$14","v":"  "}]
[{"$f":"'S4'!$K$22","v":" "},{"$f":"'S4'!$L$21","v":"  "},{"$f":"'S4'!$L$20","v":"  "},{"$f":"'S4'!$L$19","v":"  "},{"$f":"'S4'!$L$18","v":"  "},{"$f":"'S4'!$L$17","v":"  "},{"$f":"'S4'!$L$16","v":"  "},{"$f":"'S4'!$L$15","v":"  "},{"$f":"'S4'!$L$14","v":"  "}]
[{"$f":"'S4'!$M$22","v":" "},{"$f":"'S4'!$N$21","v":"  "},{"$f":"'S4'!$N$20","v":"  "},{"$f":"'S4'!$N$19","v":"  "},{"$f":"'S4'!$N$18","v":"  "},{"$f":"'S4'!$N$17","v":"  "},{"$f":"'S4'!$N$16","v":"  "},{"$f":"'S4'!$N$15","v":"  "},{"$f":"'S4'!$N$14","v":"  "}]
[{"$f":"'S4'!$C$42","v":" "},{"$f":"'S4'!$D$41","v":"  "},{"$f":"'S4'!$D$40","v":"  "},{"$f":"'S4'!$D$39","v":"  "},{"$f":"'S4'!$D$38","v":"  "},{"$f":"'S4'!$D$37","v":"  "},{"$f":"'S4'!$D$36","v":"  "},{"$f":"'S4'!$D$35","v":"  "},{"$f":"'S4'!$D$34","v":"  "}]
[{"$f":"'S4'!$E$42","v":" "},{"$f":"'S4'!$F$41","v":"  "},{"$f":"'S4'!$F$40","v":"  "},{"$f":"'S4'!$F$39","v":"  "},{"$f":"'S4'!$F$38","v":"  "},{"$f":"'S4'!$F$37","v":"  "},{"$f":"'S4'!$F$36","v":"  "},{"$f":"'S4'!$F$35","v":"  "},{"$f":"'S4'!$F$34","v":"  "}]
[{"$f":"'S4'!$G$42","v":" "},{"$f":"'S4'!$H$41","v":"  "},{"$f":"'S4'!$H$40","v":"  "},{"$f":"'S4'!$H$39","v":"  "},{"$f":"'S4'!$H$38","v":"  "},{"$f":"'S4'!$H$37","v":"  "},{"$f":"'S4'!$H$36","v":"  "},{"$f":"'S4'!$H$35","v":"  "},{"$f":"'S4'!$H$34","v":"  "}]
[{"$f":"'S4'!$I$42","v":" "},{"$f":"'S4'!$J$41","v":"  "},{"$f":"'S4'!$J$40","v":"  "},{"$f":"'S4'!$J$39","v":"  "},{"$f":"'S4'!$J$38","v":"  "},{"$f":"'S4'!$J$37","v":"  "},{"$f":"'S4'!$J$36","v":"  "},{"$f":"'S4'!$J$35","v":"  "},{"$f":"'S4'!$J$34","v":"  "}]
[{"$f":"'S4'!$K$42","v":" "},{"$f":"'S4'!$L$41","v":"  "},{"$f":"'S4'!$L$40","v":"  "},{"$f":"'S4'!$L$39","v":"  "},{"$f":"'S4'!$L$38","v":"  "},{"$f":"'S4'!$L$37","v":"  "},{"$f":"'S4'!$L$36","v":"  "},{"$f":"'S4'!$L$35","v":"  "},{"$f":"'S4'!$L$34","v":"  "}]
[{"$f":"'S4'!$M$42","v":" "},{"$f":"'S4'!$N$41","v":"  "},{"$f":"'S4'!$N$40","v":"  "},{"$f":"'S4'!$N$39","v":"  "},{"$f":"'S4'!$N$38","v":"  "},{"$f":"'S4'!$N$37","v":"  "},{"$f":"'S4'!$N$36","v":"  "},{"$f":"'S4'!$N$35","v":"  "},{"$f":"'S4'!$N$34","v":"  "}]
[{"$f":"'S5'!$C$22","v":" "},{"$f":"'S5'!$D$21","v":"  "},{"$f":"'S5'!$D$20","v":"  "},{"$f":"'S5'!$D$19","v":"  "},{"$f":"'S5'!$D$18","v":"  "},{"$f":"'S5'!$D$17","v":"  "},{"$f":"'S5'!$D$16","v":"  "},{"$f":"'S5'!$D$15","v":"  "},{"$f":"'S5'!$D$14","v":"  "}]
[{"$f":"'S5'!$E$22","v":" "},{"$f":"'S5'!$F$21","v":"  "},{"$f":"'S5'!$F$20","v":"  "},{"$f":"'S5'!$F$19","v":"  "},{"$f":"'S5'!$F$18","v":"  "},{"$f":"'S5'!$F$17","v":"  "},{"$f":"'S5'!$F$16","v":"  "},{"$f":"'S5'!$F$15","v":"  "},{"$f":"'S5'!$F$14","v":"  "}]
[{"$f":"'S5'!$G$22","v":" "},{"$f":"'S5'!$H$21","v":"  "},{"$f":"'S5'!$H$20","v":"  "},{"$f":"'S5'!$H$19","v":"  "},{"$f":"'S5'!$H$18","v":"  "},{"$f":"'S5'!$H$17","v":"  "},{"$f":"'S5'!$H$16","v":"  "},{"$f":"'S5'!$H$15","v":"  "},{"$f":"'S5'!$H$14","v":"  "}]
[{"$f":"'S5'!$I$22","v":" "},{"$f":"'S5'!$J$21","v":"  "},{"$f":"'S5'!$J$20","v":"  "},{"$f":"'S5'!$J$19","v":"  "},{"$f":"'S5'!$J$18","v":"  "},{"$f":"'S5'!$J$17","v":"  "},{"$f":"'S5'!$J$16","v":"  "},{"$f":"'S5'!$J$15","v":"  "},{"$f":"'S5'!$J$14","v":"  "}]
[{"$f":"'S5'!$K$22","v":" "},{"$f":"'S5'!$L$21","v":"  "},{"$f":"'S5'!$L$20","v":"  "},{"$f":"'S5'!$L$19","v":"  "},{"$f":"'S5'!$L$18","v":"  "},{"$f":"'S5'!$L$17","v":"  "},{"$f":"'S5'!$L$16","v":"  "},{"$f":"'S5'!$L$15","v":"  "},{"$f":"'S5'!$L$14","v":"  "}]
[{"$f":"'S5'!$M$22","v":" "},{"$f":"'S5'!$N$21","v":"  "},{"$f":"'S5'!$N$20","v":"  "},{"$f":"'S5'!$N$19","v":"  "},{"$f":"'S5'!$N$18","v":"  "},{"$f":"'S5'!$N$17","v":"  "},{"$f":"'S5'!$N$16","v":"  "},{"$f":"'S5'!$N$15","v":"  "},{"$f":"'S5'!$N$14","v":"  "}]
[{"$f":"'S5'!$C$42","v":" "},{"$f":"'S5'!$D$41","v":"  "},{"$f":"'S5'!$D$40","v":"  "},{"$f":"'S5'!$D$39","v":"  "},{"$f":"'S5'!$D$38","v":"  "},{"$f":"'S5'!$D$37","v":"  "},{"$f":"'S5'!$D$36","v":"  "},{"$f":"'S5'!$D$35","v":"  "},{"$f":"'S5'!$D$34","v":"  "}]
[{"$f":"'S5'!$E$42","v":" "},{"$f":"'S5'!$F$41","v":"  "},{"$f":"'S5'!$F$40","v":"  "},{"$f":"'S5'!$F$39","v":"  "},{"$f":"'S5'!$F$38","v":"  "},{"$f":"'S5'!$F$37","v":"  "},{"$f":"'S5'!$F$36","v":"  "},{"$f":"'S5'!$F$35","v":"  "},{"$f":"'S5'!$F$34","v":"  "}]
[{"$f":"'S5'!$G$42","v":" "},{"$f":"'S5'!$H$41","v":"  "},{"$f":"'S5'!$H$40","v":"  "},{"$f":"'S5'!$H$39","v":"  "},{"$f":"'S5'!$H$38","v":"  "},{"$f":"'S5'!$H$37","v":"  "},{"$f":"'S5'!$H$36","v":"  "},{"$f":"'S5'!$H$35","v":"  "},{"$f":"'S5'!$H$34","v":"  "}]
[{"$f":"'S5'!$I$42","v":" "},{"$f":"'S5'!$J$41","v":"  "},{"$f":"'S5'!$J$40","v":"  "},{"$f":"'S5'!$J$39","v":"  "},{"$f":"'S5'!$J$38","v":"  "},{"$f":"'S5'!$J$37","v":"  "},{"$f":"'S5'!$J$36","v":"  "},{"$f":"'S5'!$J$35","v":"  "},{"$f":"'S5'!$J$34","v":"  "}]
[{"$f":"'S5'!$K$42","v":" "},{"$f":"'S5'!$L$41","v":"  "},{"$f":"'S5'!$L$40","v":"  "},{"$f":"'S5'!$L$39","v":"  "},{"$f":"'S5'!$L$38","v":"  "},{"$f":"'S5'!$L$37","v":"  "},{"$f":"'S5'!$L$36","v":"  "},{"$f":"'S5'!$L$35","v":"  "},{"$f":"'S5'!$L$34","v":"  "}]
[{"$f":"'S5'!$M$42","v":" "},{"$f":"'S5'!$N$41","v":"  "},{"$f":"'S5'!$N$40","v":"  "},{"$f":"'S5'!$N$39","v":"  "},{"$f":"'S5'!$N$38","v":"  "},{"$f":"'S5'!$N$37","v":"  "},{"$f":"'S5'!$N$36","v":"  "},{"$f":"'S5'!$N$35","v":"  "},{"$f":"'S5'!$N$34","v":"  "}]
[{"$f":"'S6'!$C$22","v":" "},{"$f":"'S6'!$D$21","v":"  "},{"$f":"'S6'!$D$20","v":"  "},{"$f":"'S6'!$D$19","v":"  "},{"$f":"'S6'!$D$18","v":"  "},{"$f":"'S6'!$D$17","v":"  "},{"$f":"'S6'!$D$16","v":"  "},{"$f":"'S6'!$D$15","v":"  "},{"$f":"'S6'!$D$14","v":"  "}]
[{"$f":"'S6'!$E$22","v":" "},{"$f":"'S6'!$F$21","v":"  "},{"$f":"'S6'!$F$20","v":"  "},{"$f":"'S6'!$F$19","v":"  "},{"$f":"'S6'!$F$18","v":"  "},{"$f":"'S6'!$F$17","v":"  "},{"$f":"'S6'!$F$16","v":"  "},{"$f":"'S6'!$F$15","v":"  "},{"$f":"'S6'!$F$14","v":"  "}]
[{"$f":"'S6'!$G$22","v":" "},{"$f":"'S6'!$H$21","v":"  "},{"$f":"'S6'!$H$20","v":"  "},{"$f":"'S6'!$H$19","v":"  "},{"$f":"'S6'!$H$18","v":"  "},{"$f":"'S6'!$H$17","v":"  "},{"$f":"'S6'!$H$16","v":"  "},{"$f":"'S6'!$H$15","v":"  "},{"$f":"'S6'!$H$14","v":"  "}]
[{"$f":"'S6'!$I$22","v":" "},{"$f":"'S6'!$J$21","v":"  "},{"$f":"'S6'!$J$20","v":"  "},{"$f":"'S6'!$J$19","v":"  "},{"$f":"'S6'!$J$18","v":"  "},{"$f":"'S6'!$J$17","v":"  "},{"$f":"'S6'!$J$16","v":"  "},{"$f":"'S6'!$J$15","v":"  "},{"$f":"'S6'!$J$14","v":"  "}]
[{"$f":"'S6'!$K$22","v":" "},{"$f":"'S6'!$L$21","v":"  "},{"$f":"'S6'!$L$20","v":"  "},{"$f":"'S6'!$L$19","v":"  "},{"$f":"'S6'!$L$18","v":"  "},{"$f":"'S6'!$L$17","v":"  "},{"$f":"'S6'!$L$16","v":"  "},{"$f":"'S6'!$L$15","v":"  "},{"$f":"'S6'!$L$14","v":"  "}]
[{"$f":"'S6'!$M$22","v":" "},{"$f":"'S6'!$N$21","v":"  "},{"$f":"'S6'!$N$20","v":"  "},{"$f":"'S6'!$N$19","v":"  "},{"$f":"'S6'!$N$18","v":"  "},{"$f":"'S6'!$N$17","v":"  "},{"$f":"'S6'!$N$16","v":"  "},{"$f":"'S6'!$N$15","v":"  "},{"$f":"'S6'!$N$14","v":"  "}]
[{"$f":"'S6'!$C$42","v":" "},{"$f":"'S6'!$D$41","v":"  "},{"$f":"'S6'!$D$40","v":"  "},{"$f":"'S6'!$D$39","v":"  "},{"$f":"'S6'!$D$38","v":"  "},{"$f":"'S6'!$D$37","v":"  "},{"$f":"'S6'!$D$36","v":"  "},{"$f":"'S6'!$D$35","v":"  "},{"$f":"'S6'!$D$34","v":"  "}]
[{"$f":"'S6'!$E$42","v":" "},{"$f":"'S6'!$F$41","v":"  "},{"$f":"'S6'!$F$40","v":"  "},{"$f":"'S6'!$F$39","v":"  "},{"$f":"'S6'!$F$38","v":"  "},{"$f":"'S6'!$F$37","v":"  "},{"$f":"'S6'!$F$36","v":"  "},{"$f":"'S6'!$F$35","v":"  "},{"$f":"'S6'!$F$34","v":"  "}]
[{"$f":"'S6'!$G$42","v":" "},{"$f":"'S6'!$H$41","v":"  "},{"$f":"'S6'!$H$40","v":"  "},{"$f":"'S6'!$H$39","v":"  "},{"$f":"'S6'!$H$38","v":"  "},{"$f":"'S6'!$H$37","v":"  "},{"$f":"'S6'!$H$36","v":"  "},{"$f":"'S6'!$H$35","v":"  "},{"$f":"'S6'!$H$34","v":"  "}]
[{"$f":"'S6'!$I$42","v":" "},{"$f":"'S6'!$J$41","v":"  "},{"$f":"'S6'!$J$40","v":"  "},{"$f":"'S6'!$J$39","v":"  "},{"$f":"'S6'!$J$38","v":"  "},{"$f":"'S6'!$J$37","v":"  "},{"$f":"'S6'!$J$36","v":"  "},{"$f":"'S6'!$J$35","v":"  "},{"$f":"'S6'!$J$34","v":"  "}]
[{"$f":"'S6'!$K$42","v":" "},{"$f":"'S6'!$L$41","v":"  "},{"$f":"'S6'!$L$40","v":"  "},{"$f":"'S6'!$L$39","v":"  "},{"$f":"'S6'!$L$38","v":"  "},{"$f":"'S6'!$L$37","v":"  "},{"$f":"'S6'!$L$36","v":"  "},{"$f":"'S6'!$L$35","v":"  "},{"$f":"'S6'!$L$34","v":"  "}]
[{"$f":"'S6'!$M$42","v":" "},{"$f":"'S6'!$N$41","v":"  "},{"$f":"'S6'!$N$40","v":"  "},{"$f":"'S6'!$N$39","v":"  "},{"$f":"'S6'!$N$38","v":"  "},{"$f":"'S6'!$N$37","v":"  "},{"$f":"'S6'!$N$36","v":"  "},{"$f":"'S6'!$N$35","v":"  "},{"$f":"'S6'!$N$34","v":"  "}]
[{"$f":"'S7'!$C$22","v":" "},{"$f":"'S7'!$D$21","v":"  "},{"$f":"'S7'!$D$20","v":"  "},{"$f":"'S7'!$D$19","v":"  "},{"$f":"'S7'!$D$18","v":"  "},{"$f":"'S7'!$D$17","v":"  "},{"$f":"'S7'!$D$16","v":"  "},{"$f":"'S7'!$D$15","v":"  "},{"$f":"'S7'!$D$14","v":"  "}]
[{"$f":"'S7'!$E$22","v":" "},{"$f":"'S7'!$F$21","v":"  "},{"$f":"'S7'!$F$20","v":"  "},{"$f":"'S7'!$F$19","v":"  "},{"$f":"'S7'!$F$18","v":"  "},{"$f":"'S7'!$F$17","v":"  "},{"$f":"'S7'!$F$16","v":"  "},{"$f":"'S7'!$F$15","v":"  "},{"$f":"'S7'!$F$14","v":"  "}]
[{"$f":"'S7'!$G$22","v":" "},{"$f":"'S7'!$H$21","v":"  "},{"$f":"'S7'!$H$20","v":"  "},{"$f":"'S7'!$H$19","v":"  "},{"$f":"'S7'!$H$18","v":"  "},{"$f":"'S7'!$H$17","v":"  "},{"$f":"'S7'!$H$16","v":"  "},{"$f":"'S7'!$H$15","v":"  "},{"$f":"'S7'!$H$14","v":"  "}]
[{"$f":"'S7'!$I$22","v":" "},{"$f":"'S7'!$J$21","v":"  "},{"$f":"'S7'!$J$20","v":"  "},{"$f":"'S7'!$J$19","v":"  "},{"$f":"'S7'!$J$18","v":"  "},{"$f":"'S7'!$J$17","v":"  "},{"$f":"'S7'!$J$16","v":"  "},{"$f":"'S7'!$J$15","v":"  "},{"$f":"'S7'!$J$14","v":"  "}]
[{"$f":"'S7'!$K$22","v":" "},{"$f":"'S7'!$L$21","v":"  "},{"$f":"'S7'!$L$20","v":"  "},{"$f":"'S7'!$L$19","v":"  "},{"$f":"'S7'!$L$18","v":"  "},{"$f":"'S7'!$L$17","v":"  "},{"$f":"'S7'!$L$16","v":"  "},{"$f":"'S7'!$L$15","v":"  "},{"$f":"'S7'!$L$14","v":"  "}]
[{"$f":"'S7'!$M$22","v":" "},{"$f":"'S7'!$N$21","v":"  "},{"$f":"'S7'!$N$20","v":"  "},{"$f":"'S7'!$N$19","v":"  "},{"$f":"'S7'!$N$18","v":"  "},{"$f":"'S7'!$N$17","v":"  "},{"$f":"'S7'!$N$16","v":"  "},{"$f":"'S7'!$N$15","v":"  "},{"$f":"'S7'!$N$14","v":"  "}]
[{"$f":"'S7'!$C$42","v":" "},{"$f":"'S7'!$D$41","v":"  "},{"$f":"'S7'!$D$40","v":"  "},{"$f":"'S7'!$D$39","v":"  "},{"$f":"'S7'!$D$38","v":"  "},{"$f":"'S7'!$D$37","v":"  "},{"$f":"'S7'!$D$36","v":"  "},{"$f":"'S7'!$D$35","v":"  "},{"$f":"'S7'!$D$34","v":"  "}]
[{"$f":"'S7'!$E$42","v":" "},{"$f":"'S7'!$F$41","v":"  "},{"$f":"'S7'!$F$40","v":"  "},{"$f":"'S7'!$F$39","v":"  "},{"$f":"'S7'!$F$38","v":"  "},{"$f":"'S7'!$F$37","v":"  "},{"$f":"'S7'!$F$36","v":"  "},{"$f":"'S7'!$F$35","v":"  "},{"$f":"'S7'!$F$34","v":"  "}]
[{"$f":"'S7'!$G$42","v":" "},{"$f":"'S7'!$H$41","v":"  "},{"$f":"'S7'!$H$40","v":"  "},{"$f":"'S7'!$H$39","v":"  "},{"$f":"'S7'!$H$38","v":"  "},{"$f":"'S7'!$H$37","v":"  "},{"$f":"'S7'!$H$36","v":"  "},{"$f":"'S7'!$H$35","v":"  "},{"$f":"'S7'!$H$34","v":"  "}]
[{"$f":"'S7'!$I$42","v":" "},{"$f":"'S7'!$J$41","v":"  "},{"$f":"'S7'!$J$40","v":"  "},{"$f":"'S7'!$J$39","v":"  "},{"$f":"'S7'!$J$38","v":"  "},{"$f":"'S7'!$J$37","v":"  "},{"$f":"'S7'!$J$36","v":"  "},{"$f":"'S7'!$J$35","v":"  "},{"$f":"'S7'!$J$34","v":"  "}]
[{"$f":"'S7'!$K$42","v":" "},{"$f":"'S7'!$L$41","v":"  "},{"$f":"'S7'!$L$40","v":"  "},{"$f":"'S7'!$L$39","v":"  "},{"$f":"'S7'!$L$38","v":"  "},{"$f":"'S7'!$L$37","v":"  "},{"$f":"'S7'!$L$36","v":"  "},{"$f":"'S7'!$L$35","v":"  "},{"$f":"'S7'!$L$34","v":"  "}]
[{"$f":"'S7'!$M$42","v":" "},{"$f":"'S7'!$N$41","v":"  "},{"$f":"'S7'!$N$40","v":"  "},{"$f":"'S7'!$N$39","v":"  "},{"$f":"'S7'!$N$38","v":"  "},{"$f":"'S7'!$N$37","v":"  "},{"$f":"'S7'!$N$36","v":"  "},{"$f":"'S7'!$N$35","v":"  "},{"$f":"'S7'!$N$34","v":"  "}]
[{"$f":"'S8'!$C$22","v":" "},{"$f":"'S8'!$D$21","v":"  "},{"$f":"'S8'!$D$20","v":"  "},{"$f":"'S8'!$D$19","v":"  "},{"$f":"'S8'!$D$18","v":"  "},{"$f":"'S8'!$D$17","v":"  "},{"$f":"'S8'!$D$16","v":"  "},{"$f":"'S8'!$D$15","v":"  "},{"$f":"'S8'!$D$14","v":"  "}]
[{"$f":"'S8'!$E$22","v":" "},{"$f":"'S8'!$F$21","v":"  "},{"$f":"'S8'!$F$20","v":"  "},{"$f":"'S8'!$F$19","v":"  "},{"$f":"'S8'!$F$18","v":"  "},{"$f":"'S8'!$F$17","v":"  "},{"$f":"'S8'!$F$16","v":"  "},{"$f":"'S8'!$F$15","v":"  "},{"$f":"'S8'!$F$14","v":"  "}]
[{"$f":"'S8'!$G$22","v":" "},{"$f":"'S8'!$H$21","v":"  "},{"$f":"'S8'!$H$20","v":"  "},{"$f":"'S8'!$H$19","v":"  "},{"$f":"'S8'!$H$18","v":"  "},{"$f":"'S8'!$H$17","v":"  "},{"$f":"'S8'!$H$16","v":"  "},{"$f":"'S8'!$H$15","v":"  "},{"$f":"'S8'!$H$14","v":"  "}]
[{"$f":"'S8'!$I$22","v":" "},{"$f":"'S8'!$J$21","v":"  "},{"$f":"'S8'!$J$20","v":"  "},{"$f":"'S8'!$J$19","v":"  "},{"$f":"'S8'!$J$18","v":"  "},{"$f":"'S8'!$J$17","v":"  "},{"$f":"'S8'!$J$16","v":"  "},{"$f":"'S8'!$J$15","v":"  "},{"$f":"'S8'!$J$14","v":"  "}]
[{"$f":"'S8'!$K$22","v":" "},{"$f":"'S8'!$L$21","v":"  "},{"$f":"'S8'!$L$20","v":"  "},{"$f":"'S8'!$L$19","v":"  "},{"$f":"'S8'!$L$18","v":"  "},{"$f":"'S8'!$L$17","v":"  "},{"$f":"'S8'!$L$16","v":"  "},{"$f":"'S8'!$L$15","v":"  "},{"$f":"'S8'!$L$14","v":"  "}]
[{"$f":"'S8'!$M$22","v":" "},{"$f":"'S8'!$N$21","v":"  "},{"$f":"'S8'!$N$20","v":"  "},{"$f":"'S8'!$N$19","v":"  "},{"$f":"'S8'!$N$18","v":"  "},{"$f":"'S8'!$N$17","v":"  "},{"$f":"'S8'!$N$16","v":"  "},{"$f":"'S8'!$N$15","v":"  "},{"$f":"'S8'!$N$14","v":"  "}]
[{"$f":"'S8'!$C$42","v":" "},{"$f":"'S8'!$D$41","v":"  "},{"$f":"'S8'!$D$40","v":"  "},{"$f":"'S8'!$D$39","v":"  "},{"$f":"'S8'!$D$38","v":"  "},{"$f":"'S8'!$D$37","v":"  "},{"$f":"'S8'!$D$36","v":"  "},{"$f":"'S8'!$D$35","v":"  "},{"$f":"'S8'!$D$34","v":"  "}]
[{"$f":"'S8'!$E$42","v":" "},{"$f":"'S8'!$F$41","v":"  "},{"$f":"'S8'!$F$40","v":"  "},{"$f":"'S8'!$F$39","v":"  "},{"$f":"'S8'!$F$38","v":"  "},{"$f":"'S8'!$F$37","v":"  "},{"$f":"'S8'!$F$36","v":"  "},{"$f":"'S8'!$F$35","v":"  "},{"$f":"'S8'!$F$34","v":"  "}]
[{"$f":"'S8'!$G$42","v":" "},{"$f":"'S8'!$H$41","v":"  "},{"$f":"'S8'!$H$40","v":"  "},{"$f":"'S8'!$H$39","v":"  "},{"$f":"'S8'!$H$38","v":"  "},{"$f":"'S8'!$H$37","v":"  "},{"$f":"'S8'!$H$36","v":"  "},{"$f":"'S8'!$H$35","v":"  "},{"$f":"'S8'!$H$34","v":"  "}]
[{"$f":"'S8'!$I$42","v":" "},{"$f":"'S8'!$J$41","v":"  "},{"$f":"'S8'!$J$40","v":"  "},{"$f":"'S8'!$J$39","v":"  "},{"$f":"'S8'!$J$38","v":"  "},{"$f":"'S8'!$J$37","v":"  "},{"$f":"'S8'!$J$36","v":"  "},{"$f":"'S8'!$J$35","v":"  "},{"$f":"'S8'!$J$34","v":"  "}]
[{"$f":"'S8'!$K$42","v":" "},{"$f":"'S8'!$L$41","v":"  "},{"$f":"'S8'!$L$40","v":"  "},{"$f":"'S8'!$L$39","v":"  "},{"$f":"'S8'!$L$38","v":"  "},{"$f":"'S8'!$L$37","v":"  "},{"$f":"'S8'!$L$36","v":"  "},{"$f":"'S8'!$L$35","v":"  "},{"$f":"'S8'!$L$34","v":"  "}]
[{"$f":"'S8'!$M$42","v":" "},{"$f":"'S8'!$N$41","v":"  "},{"$f":"'S8'!$N$40","v":"  "},{"$f":"'S8'!$N$39","v":"  "},{"$f":"'S8'!$N$38","v":"  "},{"$f":"'S8'!$N$37","v":"  "},{"$f":"'S8'!$N$36","v":"  "},{"$f":"'S8'!$N$35","v":"  "},{"$f":"'S8'!$N$34","v":"  "}]
[{"$f":"'S9'!$C$22","v":" "},{"$f":"'S9'!$D$21","v":"  "},{"$f":"'S9'!$D$20","v":"  "},{"$f":"'S9'!$D$19","v":"  "},{"$f":"'S9'!$D$18","v":"  "},{"$f":"'S9'!$D$17","v":"  "},{"$f":"'S9'!$D$16","v":"  "},{"$f":"'S9'!$D$15","v":"  "},{"$f":"'S9'!$D$14","v":"  "}]
[{"$f":"'S9'!$E$22","v":" "},{"$f":"'S9'!$F$21","v":"  "},{"$f":"'S9'!$F$20","v":"  "},{"$f":"'S9'!$F$19","v":"  "},{"$f":"'S9'!$F$18","v":"  "},{"$f":"'S9'!$F$17","v":"  "},{"$f":"'S9'!$F$16","v":"  "},{"$f":"'S9'!$F$15","v":"  "},{"$f":"'S9'!$F$14","v":"  "}]
[{"$f":"'S9'!$G$22","v":" "},{"$f":"'S9'!$H$21","v":"  "},{"$f":"'S9'!$H$20","v":"  "},{"$f":"'S9'!$H$19","v":"  "},{"$f":"'S9'!$H$18","v":"  "},{"$f":"'S9'!$H$17","v":"  "},{"$f":"'S9'!$H$16","v":"  "},{"$f":"'S9'!$H$15","v":"  "},{"$f":"'S9'!$H$14","v":"  "}]
[{"$f":"'S9'!$I$22","v":" "},{"$f":"'S9'!$J$21","v":"  "},{"$f":"'S9'!$J$20","v":"  "},{"$f":"'S9'!$J$19","v":"  "},{"$f":"'S9'!$J$18","v":"  "},{"$f":"'S9'!$J$17","v":"  "},{"$f":"'S9'!$J$16","v":"  "},{"$f":"'S9'!$J$15","v":"  "},{"$f":"'S9'!$J$14","v":"  "}]
[{"$f":"'S9'!$K$22","v":" "},{"$f":"'S9'!$L$21","v":"  "},{"$f":"'S9'!$L$20","v":"  "},{"$f":"'S9'!$L$19","v":"  "},{"$f":"'S9'!$L$18","v":"  "},{"$f":"'S9'!$L$17","v":"  "},{"$f":"'S9'!$L$16","v":"  "},{"$f":"'S9'!$L$15","v":"  "},{"$f":"'S9'!$L$14","v":"  "}]
[{"$f":"'S9'!$M$22","v":" "},{"$f":"'S9'!$N$21","v":"  "},{"$f":"'S9'!$N$20","v":"  "},{"$f":"'S9'!$N$19","v":"  "},{"$f":"'S9'!$N$18","v":"  "},{"$f":"'S9'!$N$17","v":"  "},{"$f":"'S9'!$N$16","v":"  "},{"$f":"'S9'!$N$15","v":"  "},{"$f":"'S9'!$N$14","v":"  "}]
[{"$f":"'S9'!$C$42","v":" "},{"$f":"'S9'!$D$41","v":"  "},{"$f":"'S9'!$D$40","v":"  "},{"$f":"'S9'!$D$39","v":"  "},{"$f":"'S9'!$D$38","v":"  "},{"$f":"'S9'!$D$37","v":"  "},{"$f":"'S9'!$D$36","v":"  "},{"$f":"'S9'!$D$35","v":"  "},{"$f":"'S9'!$D$34","v":"  "}]
[{"$f":"'S9'!$E$42","v":" "},{"$f":"'S9'!$F$41","v":"  "},{"$f":"'S9'!$F$40","v":"  "},{"$f":"'S9'!$F$39","v":"  "},{"$f":"'S9'!$F$38","v":"  "},{"$f":"'S9'!$F$37","v":"  "},{"$f":"'S9'!$F$36","v":"  "},{"$f":"'S9'!$F$35","v":"  "},{"$f":"'S9'!$F$34","v":"  "}]
[{"$f":"'S9'!$G$42","v":" "},{"$f":"'S9'!$H$41","v":"  "},{"$f":"'S9'!$H$40","v":"  "},{"$f":"'S9'!$H$39","v":"  "},{"$f":"'S9'!$H$38","v":"  "},{"$f":"'S9'!$H$37","v":"  "},{"$f":"'S9'!$H$36","v":"  "},{"$f":"'S9'!$H$35","v":"  "},{"$f":"'S9'!$H$34","v":"  "}]
[{"$f":"'S9'!$I$42","v":" "},{"$f":"'S9'!$J$41","v":"  "},{"$f":"'S9'!$J$40","v":"  "},{"$f":"'S9'!$J$39","v":"  "},{"$f":"'S9'!$J$38","v":"  "},{"$f":"'S9'!$J$37","v":"  "},{"$f":"'S9'!$J$36","v":"  "},{"$f":"'S9'!$J$35","v":"  "},{"$f":"'S9'!$J$34","v":"  "}]
[{"$f":"'S9'!$K$42","v":" "},{"$f":"'S9'!$L$41","v":"  "},{"$f":"'S9'!$L$40","v":"  "},{"$f":"'S9'!$L$39","v":"  "},{"$f":"'S9'!$L$38","v":"  "},{"$f":"'S9'!$L$37","v":"  "},{"$f":"'S9'!$L$36","v":"  "},{"$f":"'S9'!$L$35","v":"  "},{"$f":"'S9'!$L$34","v":"  "}]
[{"$f":"'S9'!$M$42","v":" "},{"$f":"'S9'!$N$41","v":"  "},{"$f":"'S9'!$N$40","v":"  "},{"$f":"'S9'!$N$39","v":"  "},{"$f":"'S9'!$N$38","v":"  "},{"$f":"'S9'!$N$37","v":"  "},{"$f":"'S9'!$N$36","v":"  "},{"$f":"'S9'!$N$35","v":"  "},{"$f":"'S9'!$N$34","v":"  "}]
[{"$f":"'S10'!$C$22","v":" "},{"$f":"'S10'!$D$21","v":"  "},{"$f":"'S10'!$D$20","v":"  "},{"$f":"'S10'!$D$19","v":"  "},{"$f":"'S10'!$D$18","v":"  "},{"$f":"'S10'!$D$17","v":"  "},{"$f":"'S10'!$D$16","v":"  "},{"$f":"'S10'!$D$15","v":"  "},{"$f":"'S10'!$D$14","v":"  "}]
[{"$f":"'S10'!$E$22","v":" "},{"$f":"'S10'!$F$21","v":"  "},{"$f":"'S10'!$F$20","v":"  "},{"$f":"'S10'!$F$19","v":"  "},{"$f":"'S10'!$F$18","v":"  "},{"$f":"'S10'!$F$17","v":"  "},{"$f":"'S10'!$F$16","v":"  "},{"$f":"'S10'!$F$15","v":"  "},{"$f":"'S10'!$F$14","v":"  "}]
[{"$f":"'S10'!$G$22","v":" "},{"$f":"'S10'!$H$21","v":"  "},{"$f":"'S10'!$H$20","v":"  "},{"$f":"'S10'!$H$19","v":"  "},{"$f":"'S10'!$H$18","v":"  "},{"$f":"'S10'!$H$17","v":"  "},{"$f":"'S10'!$H$16","v":"  "},{"$f":"'S10'!$H$15","v":"  "},{"$f":"'S10'!$H$14","v":"  "}]
[{"$f":"'S10'!$I$22","v":" "},{"$f":"'S10'!$J$21","v":"  "},{"$f":"'S10'!$J$20","v":"  "},{"$f":"'S10'!$J$19","v":"  "},{"$f":"'S10'!$J$18","v":"  "},{"$f":"'S10'!$J$17","v":"  "},{"$f":"'S10'!$J$16","v":"  "},{"$f":"'S10'!$J$15","v":"  "},{"$f":"'S10'!$J$14","v":"  "}]
[{"$f":"'S10'!$K$22","v":" "},{"$f":"'S10'!$L$21","v":"  "},{"$f":"'S10'!$L$20","v":"  "},{"$f":"'S10'!$L$19","v":"  "},{"$f":"'S10'!$L$18","v":"  "},{"$f":"'S10'!$L$17","v":"  "},{"$f":"'S10'!$L$16","v":"  "},{"$f":"'S10'!$L$15","v":"  "},{"$f":"'S10'!$L$14","v":"  "}]
[{"$f":"'S10'!$M$22","v":" "},{"$f":"'S10'!$N$21","v":"  "},{"$f":"'S10'!$N$20","v":"  "},{"$f":"'S10'!$N$19","v":"  "},{"$f":"'S10'!$N$18","v":"  "},{"$f":"'S10'!$N$17","v":"  "},{"$f":"'S10'!$N$16","v":"  "},{"$f":"'S10'!$N$15","v":"  "},{"$f":"'S10'!$N$14","v":"  "}]
[{"$f":"'S10'!$C$42","v":" "},{"$f":"'S10'!$D$41","v":"  "},{"$f":"'S10'!$D$40","v":"  "},{"$f":"'S10'!$D$39","v":"  "},{"$f":"'S10'!$D$38","v":"  "},{"$f":"'S10'!$D$37","v":"  "},{"$f":"'S10'!$D$36","v":"  "},{"$f":"'S10'!$D$35","v":"  "},{"$f":"'S10'!$D$34","v":"  "}]
[{"$f":"'S10'!$E$42","v":" "},{"$f":"'S10'!$F$41","v":"  "},{"$f":"'S10'!$F$40","v":"  "},{"$f":"'S10'!$F$39","v":"  "},{"$f":"'S10'!$F$38","v":"  "},{"$f":"'S10'!$F$37","v":"  "},{"$f":"'S10'!$F$36","v":"  "},{"$f":"'S10'!$F$35","v":"  "},{"$f":"'S10'!$F$34","v":"  "}]
[{"$f":"'S10'!$G$42","v":" "},{"$f":"'S10'!$H$41","v":"  "},{"$f":"'S10'!$H$40","v":"  "},{"$f":"'S10'!$H$39","v":"  "},{"$f":"'S10'!$H$38","v":"  "},{"$f":"'S10'!$H$37","v":"  "},{"$f":"'S10'!$H$36","v":"  "},{"$f":"'S10'!$H$35","v":"  "},{"$f":"'S10'!$H$34","v":"  "}]
[{"$f":"'S10'!$I$42","v":" "},{"$f":"'S10'!$J$41","v":"  "},{"$f":"'S10'!$J$40","v":"  "},{"$f":"'S10'!$J$39","v":"  "},{"$f":"'S10'!$J$38","v":"  "},{"$f":"'S10'!$J$37","v":"  "},{"$f":"'S10'!$J$36","v":"  "},{"$f":"'S10'!$J$35","v":"  "},{"$f":"'S10'!$J$34","v":"  "}]
[{"$f":"'S10'!$K$42","v":" "},{"$f":"'S10'!$L$41","v":"  "},{"$f":"'S10'!$L$40","v":"  "},{"$f":"'S10'!$L$39","v":"  "},{"$f":"'S10'!$L$38","v":"  "},{"$f":"'S10'!$L$37","v":"  "},{"$f":"'S10'!$L$36","v":"  "},{"$f":"'S10'!$L$35","v":"  "},{"$f":"'S10'!$L$34","v":"  "}]
[{"$f":"'S10'!$M$42","v":" "},{"$f":"'S10'!$N$41","v":"  "},{"$f":"'S10'!$N$40","v":"  "},{"$f":"'S10'!$N$39","v":"  "},{"$f":"'S10'!$N$38","v":"  "},{"$f":"'S10'!$N$37","v":"  "},{"$f":"'S10'!$N$36","v":"  "},{"$f":"'S10'!$N$35","v":"  "},{"$f":"'S10'!$N$34","v":"  "}]
[{"$f":"'S11'!$C$22","v":" "},{"$f":"'S11'!$D$21","v":"  "},{"$f":"'S11'!$D$20","v":"  "},{"$f":"'S11'!$D$19","v":"  "},{"$f":"'S11'!$D$18","v":"  "},{"$f":"'S11'!$D$17","v":"  "},{"$f":"'S11'!$D$16","v":"  "},{"$f":"'S11'!$D$15","v":"  "},{"$f":"'S11'!$D$14","v":"  "}]
[{"$f":"'S11'!$E$22","v":" "},{"$f":"'S11'!$F$21","v":"  "},{"$f":"'S11'!$F$20","v":"  "},{"$f":"'S11'!$F$19","v":"  "},{"$f":"'S11'!$F$18","v":"  "},{"$f":"'S11'!$F$17","v":"  "},{"$f":"'S11'!$F$16","v":"  "},{"$f":"'S11'!$F$15","v":"  "},{"$f":"'S11'!$F$14","v":"  "}]
[{"$f":"'S11'!$G$22","v":" "},{"$f":"'S11'!$H$21","v":"  "},{"$f":"'S11'!$H$20","v":"  "},{"$f":"'S11'!$H$19","v":"  "},{"$f":"'S11'!$H$18","v":"  "},{"$f":"'S11'!$H$17","v":"  "},{"$f":"'S11'!$H$16","v":"  "},{"$f":"'S11'!$H$15","v":"  "},{"$f":"'S11'!$H$14","v":"  "}]
[{"$f":"'S11'!$I$22","v":" "},{"$f":"'S11'!$J$21","v":"  "},{"$f":"'S11'!$J$20","v":"  "},{"$f":"'S11'!$J$19","v":"  "},{"$f":"'S11'!$J$18","v":"  "},{"$f":"'S11'!$J$17","v":"  "},{"$f":"'S11'!$J$16","v":"  "},{"$f":"'S11'!$J$15","v":"  "},{"$f":"'S11'!$J$14","v":"  "}]
[{"$f":"'S11'!$K$22","v":" "},{"$f":"'S11'!$L$21","v":"  "},{"$f":"'S11'!$L$20","v":"  "},{"$f":"'S11'!$L$19","v":"  "},{"$f":"'S11'!$L$18","v":"  "},{"$f":"'S11'!$L$17","v":"  "},{"$f":"'S11'!$L$16","v":"  "},{"$f":"'S11'!$L$15","v":"  "},{"$f":"'S11'!$L$14","v":"  "}]
[{"$f":"'S11'!$M$22","v":" "},{"$f":"'S11'!$N$21","v":"  "},{"$f":"'S11'!$N$20","v":"  "},{"$f":"'S11'!$N$19","v":"  "},{"$f":"'S11'!$N$18","v":"  "},{"$f":"'S11'!$N$17","v":"  "},{"$f":"'S11'!$N$16","v":"  "},{"$f":"'S11'!$N$15","v":"  "},{"$f":"'S11'!$N$14","v":"  "}]
[{"$f":"'S11'!$C$42","v":" "},{"$f":"'S11'!$D$41","v":"  "},{"$f":"'S11'!$D$40","v":"  "},{"$f":"'S11'!$D$39","v":"  "},{"$f":"'S11'!$D$38","v":"  "},{"$f":"'S11'!$D$37","v":"  "},{"$f":"'S11'!$D$36","v":"  "},{"$f":"'S11'!$D$35","v":"  "},{"$f":"'S11'!$D$34","v":"  "}]
[{"$f":"'S11'!$E$42","v":" "},{"$f":"'S11'!$F$41","v":"  "},{"$f":"'S11'!$F$40","v":"  "},{"$f":"'S11'!$F$39","v":"  "},{"$f":"'S11'!$F$38","v":"  "},{"$f":"'S11'!$F$37","v":"  "},{"$f":"'S11'!$F$36","v":"  "},{"$f":"'S11'!$F$35","v":"  "},{"$f":"'S11'!$F$34","v":"  "}]
[{"$f":"'S11'!$G$42","v":" "},{"$f":"'S11'!$H$41","v":"  "},{"$f":"'S11'!$H$40","v":"  "},{"$f":"'S11'!$H$39","v":"  "},{"$f":"'S11'!$H$38","v":"  "},{"$f":"'S11'!$H$37","v":"  "},{"$f":"'S11'!$H$36","v":"  "},{"$f":"'S11'!$H$35","v":"  "},{"$f":"'S11'!$H$34","v":"  "}]
[{"$f":"'S11'!$I$42","v":" "},{"$f":"'S11'!$J$41","v":"  "},{"$f":"'S11'!$J$40","v":"  "},{"$f":"'S11'!$J$39","v":"  "},{"$f":"'S11'!$J$38","v":"  "},{"$f":"'S11'!$J$37","v":"  "},{"$f":"'S11'!$J$36","v":"  "},{"$f":"'S11'!$J$35","v":"  "},{"$f":"'S11'!$J$34","v":"  "}]
[{"$f":"'S11'!$K$42","v":" "},{"$f":"'S11'!$L$41","v":"  "},{"$f":"'S11'!$L$40","v":"  "},{"$f":"'S11'!$L$39","v":"  "},{"$f":"'S11'!$L$38","v":"  "},{"$f":"'S11'!$L$37","v":"  "},{"$f":"'S11'!$L$36","v":"  "},{"$f":"'S11'!$L$35","v":"  "},{"$f":"'S11'!$L$34","v":"  "}]
[{"$f":"'S11'!$M$42","v":" "},{"$f":"'S11'!$N$41","v":"  "},{"$f":"'S11'!$N$40","v":"  "},{"$f":"'S11'!$N$39","v":"  "},{"$f":"'S11'!$N$38","v":"  "},{"$f":"'S11'!$N$37","v":"  "},{"$f":"'S11'!$N$36","v":"  "},{"$f":"'S11'!$N$35","v":"  "},{"$f":"'S11'!$N$34","v":"  "}]
[{"$f":"'S12'!$C$22","v":" "},{"$f":"'S12'!$D$21","v":"  "},{"$f":"'S12'!$D$20","v":"  "},{"$f":"'S12'!$D$19","v":"  "},{"$f":"'S12'!$D$18","v":"  "},{"$f":"'S12'!$D$17","v":"  "},{"$f":"'S12'!$D$16","v":"  "},{"$f":"'S12'!$D$15","v":"  "},{"$f":"'S12'!$D$14","v":"  "}]
[{"$f":"'S12'!$E$22","v":" "},{"$f":"'S12'!$F$21","v":"  "},{"$f":"'S12'!$F$20","v":"  "},{"$f":"'S12'!$F$19","v":"  "},{"$f":"'S12'!$F$18","v":"  "},{"$f":"'S12'!$F$17","v":"  "},{"$f":"'S12'!$F$16","v":"  "},{"$f":"'S12'!$F$15","v":"  "},{"$f":"'S12'!$F$14","v":"  "}]
[{"$f":"'S12'!$G$22","v":" "},{"$f":"'S12'!$H$21","v":"  "},{"$f":"'S12'!$H$20","v":"  "},{"$f":"'S12'!$H$19","v":"  "},{"$f":"'S12'!$H$18","v":"  "},{"$f":"'S12'!$H$17","v":"  "},{"$f":"'S12'!$H$16","v":"  "},{"$f":"'S12'!$H$15","v":"  "},{"$f":"'S12'!$H$14","v":"  "}]
[{"$f":"'S12'!$I$22","v":" "},{"$f":"'S12'!$J$21","v":"  "},{"$f":"'S12'!$J$20","v":"  "},{"$f":"'S12'!$J$19","v":"  "},{"$f":"'S12'!$J$18","v":"  "},{"$f":"'S12'!$J$17","v":"  "},{"$f":"'S12'!$J$16","v":"  "},{"$f":"'S12'!$J$15","v":"  "},{"$f":"'S12'!$J$14","v":"  "}]
[{"$f":"'S12'!$K$22","v":" "},{"$f":"'S12'!$L$21","v":"  "},{"$f":"'S12'!$L$20","v":"  "},{"$f":"'S12'!$L$19","v":"  "},{"$f":"'S12'!$L$18","v":"  "},{"$f":"'S12'!$L$17","v":"  "},{"$f":"'S12'!$L$16","v":"  "},{"$f":"'S12'!$L$15","v":"  "},{"$f":"'S12'!$L$14","v":"  "}]
[{"$f":"'S12'!$M$22","v":" "},{"$f":"'S12'!$N$21","v":"  "},{"$f":"'S12'!$N$20","v":"  "},{"$f":"'S12'!$N$19","v":"  "},{"$f":"'S12'!$N$18","v":"  "},{"$f":"'S12'!$N$17","v":"  "},{"$f":"'S12'!$N$16","v":"  "},{"$f":"'S12'!$N$15","v":"  "},{"$f":"'S12'!$N$14","v":"  "}]
[{"$f":"'S12'!$C$42","v":" "},{"$f":"'S12'!$D$41","v":"  "},{"$f":"'S12'!$D$40","v":"  "},{"$f":"'S12'!$D$39","v":"  "},{"$f":"'S12'!$D$38","v":"  "},{"$f":"'S12'!$D$37","v":"  "},{"$f":"'S12'!$D$36","v":"  "},{"$f":"'S12'!$D$35","v":"  "},{"$f":"'S12'!$D$34","v":"  "}]
[{"$f":"'S12'!$E$42","v":" "},{"$f":"'S12'!$F$41","v":"  "},{"$f":"'S12'!$F$40","v":"  "},{"$f":"'S12'!$F$39","v":"  "},{"$f":"'S12'!$F$38","v":"  "},{"$f":"'S12'!$F$37","v":"  "},{"$f":"'S12'!$F$36","v":"  "},{"$f":"'S12'!$F$35","v":"  "},{"$f":"'S12'!$F$34","v":"  "}]
[{"$f":"'S12'!$G$42","v":" "},{"$f":"'S12'!$H$41","v":"  "},{"$f":"'S12'!$H$40","v":"  "},{"$f":"'S12'!$H$39","v":"  "},{"$f":"'S12'!$H$38","v":"  "},{"$f":"'S12'!$H$37","v":"  "},{"$f":"'S12'!$H$36","v":"  "},{"$f":"'S12'!$H$35","v":"  "},{"$f":"'S12'!$H$34","v":"  "}]
[{"$f":"'S12'!$I$42","v":" "},{"$f":"'S12'!$J$41","v":"  "},{"$f":"'S12'!$J$40","v":"  "},{"$f":"'S12'!$J$39","v":"  "},{"$f":"'S12'!$J$38","v":"  "},{"$f":"'S12'!$J$37","v":"  "},{"$f":"'S12'!$J$36","v":"  "},{"$f":"'S12'!$J$35","v":"  "},{"$f":"'S12'!$J$34","v":"  "}]
[{"$f":"'S12'!$K$42","v":" "},{"$f":"'S12'!$L$41","v":"  "},{"$f":"'S12'!$L$40","v":"  "},{"$f":"'S12'!$L$39","v":"  "},{"$f":"'S12'!$L$38","v":"  "},{"$f":"'S12'!$L$37","v":"  "},{"$f":"'S12'!$L$36","v":"  "},{"$f":"'S12'!$L$35","v":"  "},{"$f":"'S12'!$L$34","v":"  "}]
[{"$f":"'S12'!$M$42","v":" "},{"$f":"'S12'!$N$41","v":"  "},{"$f":"'S12'!$N$40","v":"  "},{"$f":"'S12'!$N$39","v":"  "},{"$f":"'S12'!$N$38","v":"  "},{"$f":"'S12'!$N$37","v":"  "},{"$f":"'S12'!$N$36","v":"  "},{"$f":"'S12'!$N$35","v":"  "},{"$f":"'S12'!$N$34","v":"  "}]

{"sheet":"Avg","index":21,"n_rows":7,"n_cols":11,"rows_kept":7,"cut":false,"hidden":false,"merged":[[1,0,1,9],[1,10,1,11]]}
[]
["Average Gradations",null,null,null,null,null,null,null,null,null,{"$f":"IF(ISBLANK('S1'!M4),\" \",'S1'!M4)","v":"Type A"}]
[]
["Sieve","FM",200,100,50,30,16,8,4,0.375]
["Count",{"$f":"COUNT('S14'!A2:A145)","v":0},{"$f":"COUNT('S14'!B2:B145)","v":0},{"$f":"COUNT('S14'!C2:C145)","v":0},{"$f":"COUNT('S14'!D2:D145)","v":0},{"$f":"COUNT('S14'!E2:E145)","v":0},{"$f":"COUNT('S14'!F2:F145)","v":0},{"$f":"COUNT('S14'!G2:G145)","v":0},{"$f":"COUNT('S14'!H2:H145)","v":0},{"$f":"COUNT('S14'!I2:I145)","v":0}]
["Avg",{"$f":"AVERAGE('S14'!A2:A145)","v":{"$error":"#DIV/0!"}},{"$f":"AVERAGE('S14'!B2:B145)","v":{"$error":"#DIV/0!"}},{"$f":"AVERAGE('S14'!C2:C145)","v":{"$error":"#DIV/0!"}},{"$f":"AVERAGE('S14'!D2:D145)","v":{"$error":"#DIV/0!"}},{"$f":"AVERAGE('S14'!E2:E145)","v":{"$error":"#DIV/0!"}},{"$f":"AVERAGE('S14'!F2:F145)","v":{"$error":"#DIV/0!"}},{"$f":"AVERAGE('S14'!G2:G145)","v":{"$error":"#DIV/0!"}},{"$f":"AVERAGE('S14'!H2:H145)","v":{"$error":"#DIV/0!"}},{"$f":"AVERAGE('S14'!I2:I145)","v":{"$error":"#DIV/0!"}}]
["St Dev",{"$f":"STDEV('S14'!A2:A145)","v":{"$error":"#DIV/0!"}},{"$f":"STDEV('S14'!B2:B145)","v":{"$error":"#DIV/0!"}},{"$f":"STDEV('S14'!C2:C145)","v":{"$error":"#DIV/0!"}},{"$f":"STDEV('S14'!D2:D145)","v":{"$error":"#DIV/0!"}},{"$f":"STDEV('S14'!E2:E145)","v":{"$error":"#DIV/0!"}},{"$f":"STDEV('S14'!F2:F145)","v":{"$error":"#DIV/0!"}},{"$f":"STDEV('S14'!G2:G145)","v":{"$error":"#DIV/0!"}},{"$f":"STDEV('S14'!H2:H145)","v":{"$error":"#DIV/0!"}},{"$f":"STDEV('S14'!I2:I145)","v":{"$error":"#DIV/0!"}}]

{"sheet":"AP","index":22,"n_rows":36,"n_cols":28,"rows_kept":36,"cut":false,"hidden":true,"merged":[[21,0,23,0],[5,0,7,0],[9,0,11,0],[1,0,3,0],[13,0,15,0],[17,0,19,0],[25,0,27,0],[29,0,31,0],[33,0,35,0],[26,2,26,3],[30,2,30,3]]}
[]
[0.375,"Max",105]
[]
[null,"Min",95]
[]
[4,"Max",100]
[]
[null,"Min",90]
[]
[8,"Max",100]
[]
[null,"Min",70]
[]
[16,"Max",85]
[]
[null,"Min",45]
[]
[30,"Max",65]
[]
[null,"Min",25]
[]
[50,"Max",30,"Upper",{"$f":"'Critical screen tolerances'!D9","v":26},{"$f":"$E22","v":26},{"$f":"$E22","v":26},26,26,26,26,26,26,26,26,26,26,26,26,26,26,26,26,26,26,26,26,26]
[]
[null,"Min",10,"Lower",{"$f":"'Critical screen tolerances'!D10","v":14},{"$f":"$E24","v":14},{"$f":"$E24","v":14},14,14,14,14,14,14,14,14,14,14,14,14,14,14,14,14,14,14,14,14,14]
[]
[100,"Max",10]
[null,null,"Upper  Action",null,{"$f":"'Critical screen tolerances'!D11","v":9},{"$f":"$E27","v":9},{"$f":"$E27","v":9},9,9,9,9,9,9,9,9,9,9,9,9,9,9,9,9,9,9,9,9,9]
[null,"Min",0]
[]
[200,"Max",3.5]
[null,null,"Upper  Action",null,{"$f":"'Critical screen tolerances'!D12","v":2.8},{"$f":"$E31","v":2.8},{"$f":"$E31","v":2.8},2.8,2.8,2.8,2.8,2.8,2.8,2.8,2.8,2.8,2.8,2.8,2.8,2.8,2.8,2.8,2.8,2.8,2.8,2.8,2.8,2.8]
[null,"Min",0]
[]
["FM","Max",{"$f":"E35+0.4","v":0.4},"Upper",{"$f":"E35+'Critical screen tolerances'!D17","v":0.2},{"$f":"$E34","v":0.2},{"$f":"$E34","v":0.2},0.2,0.2,0.2,0.2,0.2,0.2,0.2,0.2,0.2,0.2,0.2,0.2,0.2,0.2,0.2,0.2,0.2,0.2,0.2,0.2,0.2]
[null,null,null,"Target",{"$f":"'S1'!M5","v":0},{"$f":"$E35","v":0},0,0,0,0,0,0,0,0,0,0,0,0,0,0,0,0,0,0,0,0,0,0]
[null,"Min",{"$f":"E35-0.4","v":-0.4},"Lower",{"$f":"E35-'Critical screen tolerances'!D18","v":-0.2},{"$f":"$E36","v":-0.2},-0.2,-0.2,-0.2,-0.2,-0.2,-0.2,-0.2,-0.2,-0.2,-0.2,-0.2,-0.2,-0.2,-0.2,-0.2,-0.2,-0.2,-0.2,-0.2,-0.2,-0.2,-0.2]

{"sheet":"Critical screen tolerances","index":23,"n_rows":18,"n_cols":4,"rows_kept":18,"cut":false,"hidden":false,"merged":[[11,1,11,2],[16,0,17,0],[16,1,16,2],[17,1,17,2],[13,0,14,9],[10,1,10,2],[1,0,5,9],[7,0,7,3],[8,0,9,0],[8,1,8,2],[9,1,9,2]]}
[]
["In this workbook for Type A sand, the critical screen tolerances are set to a default value but can be changed at the Producer / Agency's discretion. To change these values, select the gray shaded cells below"]
[]
[]
[]
[]
[]
["Type A"]
["#50","Upper control point % ",null,26]
[null,"Lower control point %",null,14]
["#100","Upper control point % ",null,9]
[200,"Upper control point % ",null,2.8]
[]
["FM control tolerances are set by default at + / - .2 from the estabilished target value selected on S1. These values can be changed in gray shaded cells below"]
[]
[]
["FM","Upper control point % ",null,0.2]
[null,"Lower control point %",null,0.2]