{"text_format":"1","workbook":"xlsx","n_sheets":20,"sheets":["S1","S2","S3","S4","S5","S6","S7","S8","S9","S10","Chart 1-24","Chart 25-48","Chart 49-72","Chart 73-96","Chart 97-120","ST1","Avg","ST13","AP","Spec"],"not_rendered":{"charts":25,"images":28,"macros":1,"external_links":0,"defined_names":2,"comments":0,"pivot_tables":0},"unopened":[],"bounds":{"document_bytes":16777216,"sheet_cells":100000,"rows_first":2000,"rows_last":500,"rows_between":2000,"halvings":0,"cell_chars":16384,"cell_head_chars":4096},"cells_cut":0,"cells_raw":0,"read":"whole","date_system":"1900"}

{"sheet":"S1","index":0,"n_rows":47,"n_cols":24,"rows_kept":47,"cut":false,"hidden":false,"merged":[[7,0,7,1],[7,2,7,3],[2,9,2,10],[3,9,3,10],[5,3,5,8],[7,4,7,5],[0,0,3,1],[4,0,4,1],[0,7,3,8],[1,11,1,12],[2,11,2,12],[3,11,3,12],[7,6,7,7],[7,10,7,11],[7,12,7,13],[7,8,7,9],[1,9,1,10],[1,2,1,6],[2,2,2,6],[3,2,3,6],[5,9,5,12],[9,0,9,1],[10,0,10,1],[8,8,8,9],[8,0,8,1],[8,2,8,3],[8,4,8,5],[8,6,8,7],[11,0,11,1],[11,2,11,3],[11,4,11,5],[11,6,11,7],[20,0,20,1],[20,2,20,3],[20,4,20,5],[20,6,20,7],[27,2,27,3],[27,4,27,5],[27,6,27,7],[21,0,24,1],[21,2,24,3],[21,4,24,5],[21,6,24,7],[25,0,25,13],[40,12,43,13],[27,10,27,11],[29,0,29,1],[27,12,27,13],[39,10,39,11],[39,12,39,13],[30,8,30,9],[30,10,30,11],[30,12,30,13],[27,8,27,9],[30,0,30,1],[30,2,30,3],[30,4,30,5],[39,8,39,9],[39,0,39,1],[39,2,39,3],[40,0,43,1],[40,2,43,3],[40,4,43,5],[40,6,43,7],[8,10,8,11],[39,6,39,7],[30,6,30,7],[40,8,43,9],[40,10,43,11],[39,4,39,5],[26,0,26,1],[26,2,26,3],[26,4,26,5],[26,6,26,7],[28,0,28,1],[27,0,27,1],[8,12,8,13],[26,10,26,11],[26,12,26,13],[20,8,20,9],[20,10,20,11],[20,12,20,13],[21,8,24,9],[21,12,24,13],[26,8,26,9],[11,12,11,13],[21,10,24,11],[11,8,11,9],[11,10,11,11]]}
[]
[null,null,"COMMONWEALTH OF PENNSYLVANIA",null,null,null,null,null,null,"DISTRICT"]
[null,null,"DEPARTMENT OF TRANSPORTATION",null,null,null,null,null,null,"PLANT CODE",null,null,null,null,null,null,null,null,"Type AS1"]
[null,null,"PENNSYLVANIA TURNPIKE COMMISSION",null,null,null,null,null,null,"AGG SIZE",null,"Type AS4",null,null,null,null,null,null,"Type AS2",null,null,null,null,{"$f":"IF(L4=\"TYPE AS1\",1,IF(L4=\"TYPE AS2\",2,IF(L4=\"TYPE AS3\",3,IF(L4=\"TYPE AS4\",1))))","v":1}]
["Aggregate 2023",null,null,null,null,null,null,null,null,null,null,null,null,null,null,null,null,null,"Type AS3"]
[null,null,null,{"$f":"IF(L4=\"Type AS1\",Spec!A1,IF(L4=\"Type AS2\",Spec!A2,IF(L4=\"Type AS3\",Spec!A3,IF(L4=\"Type AS4\",Spec!A4))))","v":"Material Test Results for Type AS4"},null,null,null,null,null,"Select Anti-Skid Type to be tested",null,null,null,null,null,null,null,null,"Type AS4"]
{"$rows_left_out":42}
{"sheet":"S2","index":1,"n_rows":47,"n_cols":14,"rows_kept":47,"cut":false,"hidden":true,"merged":[[27,12,27,13],[27,10,27,11],[20,12,20,13],[27,6,27,7],[26,12,26,13],[20,10,20,11],[20,8,20,9],[21,6,24,7],[21,8,24,9],[26,10,26,11],[21,10,24,11],[21,12,24,13],[27,8,27,9],[26,8,26,9],[25,0,25,13],[10,0,10,1],[20,2,20,3],[20,4,20,5],[20,0,20,1],[21,0,24,1],[21,2,24,3],[21,4,24,5],[11,0,11,1],[11,2,11,3],[11,4,11,5],[8,4,8,5],[8,6,8,7],[8,8,8,9],[9,0,9,1],[8,0,8,1],[8,2,8,3],[1,2,1,7],[5,3,5,8],[7,0,7,1],[7,2,7,3],[7,4,7,5],[7,6,7,7],[7,8,7,9],[2,2,2,7],[3,2,3,7],[4,0,4,1],[0,0,3,1],[11,8,11,9],[1,10,1,11],[1,12,1,13],[2,10,2,11],[2,12,2,13],[3,10,3,11],[3,12,3,13],[7,10,7,11],[7,12,7,13],[11,12,11,13],[8,10,8,11],[8,12,8,13],[11,10,11,11],[0,8,3,9],[39,12,39,13],[30,12,30,13],[30,8,30,9],[30,10,30,11],[39,8,39,9],[40,12,43,13],[40,0,43,1],[40,2,43,3],[40,4,43,5],[40,6,43,7],[40,8,43,9],[39,0,39,1],[39,2,39,3],[39,4,39,5],[39,6,39,7],[40,10,43,11],[39,10,39,11],[11,6,11,7],[28,0,28,1],[29,0,29,1],[30,0,30,1],[30,2,30,3],[30,4,30,5],[30,6,30,7],[26,0,26,1],[27,0,27,1],[20,6,20,7],[26,2,26,3],[26,4,26,5],[26,6,26,7],[27,4,27,5],[27,2,27,3]]}
[]
[null,null,"COMMONWEALTH OF PENNSYLVANIA",null,null,null,null,null,null,null,"DISTRICT",null,{"$f":"IF(ISBLANK('S1'!L2),\"\",'S1'!L2)","v":""}]
[null,null,"DEPARTMENT OF TRANSPORTATION",null,null,null,null,null,null,null,"PLANT CODE",null,{"$f":"IF(ISBLANK('S1'!L3),\"\",'S1'!L3)","v":""}]
[null,null,"PENNSYLVANIA TURNPIKE COMMISSION",null,null,null,null,null,null,null,"AGG SIZE",null,{"$f":"IF(ISBLANK('S1'!L4),\"\",'S1'!L4)","v":"Type AS4"}]
[{"$f":"'S1'!A5","v":"Aggregate 2023"}]
[null,null,null,{"$f":"'S1'!D6","v":"Material Test Results for Type AS4"}]
{"$rows_left_out":42}
{"sheet":"S3","index":2,"n_rows":47,"n_cols":14,"rows_kept":47,"cut":false,"hidden":true,"merged":[[3,10,3,11],[3,12,3,13],[0,0,3,1],[1,10,1,11],[1,12,1,13],[2,10,2,11],[2,12,2,13],[0,8,3,9],[1,2,1,7],[2,2,2,7],[3,2,3,7],[5,3,5,8],[7,0,7,1],[7,2,7,3],[7,4,7,5],[7,6,7,7],[7,8,7,9],[10,0,10,1],[9,0,9,1],[7,10,7,11],[7,12,7,13],[8,0,8,1],[8,2,8,3],[8,4,8,5],[8,6,8,7],[8,8,8,9],[8,10,8,11],[8,12,8,13],[21,12,24,13],[26,12,26,13],[27,12,27,13],[30,2,30,3],[11,10,11,11],[11,12,11,13],[11,4,11,5],[11,6,11,7],[11,8,11,9],[20,12,20,13],[30,10,30,11],[21,6,24,7],[27,2,27,3],[20,2,20,3],[26,2,26,3],[20,10,20,11],[28,0,28,1],[26,0,26,1],[27,0,27,1],[26,10,26,11],[21,0,24,1],[21,2,24,3],[21,4,24,5],[27,4,27,5],[27,6,27,7],[26,4,26,5],[26,6,26,7],[26,8,26,9],[39,6,39,7],[39,8,39,9],[11,0,11,1],[11,2,11,3],[21,8,24,9],[20,0,20,1],[39,0,39,1],[20,4,20,5],[20,6,20,7],[20,8,20,9],[30,0,30,1],[25,0,25,13],[21,10,24,11],[27,8,27,9],[27,10,27,11],[29,0,29,1],[4,0,4,1],[39,2,39,3],[30,12,30,13],[39,12,39,13],[40,0,43,1],[40,2,43,3],[40,4,43,5],[40,6,43,7],[40,8,43,9],[40,10,43,11],[40,12,43,13],[30,4,30,5],[30,6,30,7],[30,8,30,9],[39,10,39,11],[39,4,39,5]]}
[]
[null,null,"COMMONWEALTH OF PENNSYLVANIA",null,null,null,null,null,null,null,"DISTRICT",null,{"$f":"IF(ISBLANK('S1'!L2),\"\",'S1'!L2)","v":""}]
[null,null,"DEPARTMENT OF TRANSPORTATION",null,null,null,null,null,null,null,"PLANT CODE",null,{"$f":"IF(ISBLANK('S1'!L3),\"\",'S1'!L3)","v":""}]
[null,null,"PENNSYLVANIA TURNPIKE COMMISSION",null,null,null,null,null,null,null,"AGG SIZE",null,{"$f":"IF(ISBLANK('S1'!L4),\"\",'S1'!L4)","v":"Type AS4"}]
[{"$f":"'S1'!A5","v":"Aggregate 2023"}]
[null,null,null,{"$f":"'S1'!D6","v":"Material Test Results for Type AS4"}]
{"$rows_left_out":42}
{"sheet":"S4","index":3,"n_rows":47,"n_cols":14,"rows_kept":47,"cut":false,"hidden":true,"merged":[[3,10,3,11],[3,12,3,13],[0,0,3,1],[1,10,1,11],[1,12,1,13],[2,10,2,11],[2,12,2,13],[0,8,3,9],[1,2,1,7],[2,2,2,7],[3,2,3,7],[5,3,5,8],[7,0,7,1],[7,2,7,3],[7,4,7,5],[7,6,7,7],[7,8,7,9],[10,0,10,1],[9,0,9,1],[7,10,7,11],[7,12,7,13],[8,0,8,1],[8,2,8,3],[8,4,8,5],[8,6,8,7],[8,8,8,9],[8,10,8,11],[8,12,8,13],[21,12,24,13],[26,12,26,13],[27,12,27,13],[30,2,30,3],[11,10,11,11],[11,12,11,13],[11,4,11,5],[11,6,11,7],[11,8,11,9],[20,12,20,13],[30,10,30,11],[21,6,24,7],[27,2,27,3],[20,2,20,3],[26,2,26,3],[20,10,20,11],[28,0,28,1],[26,0,26,1],[27,0,27,1],[26,10,26,11],[21,0,24,1],[21,2,24,3],[21,4,24,5],[27,4,27,5],[27,6,27,7],[26,4,26,5],[26,6,26,7],[26,8,26,9],[39,6,39,7],[39,8,39,9],[11,0,11,1],[11,2,11,3],[21,8,24,9],[20,0,20,1],[39,0,39,1],[20,4,20,5],[20,6,20,7],[20,8,20,9],[30,0,30,1],[25,0,25,13],[21,10,24,11],[27,8,27,9],[27,10,27,11],[29,0,29,1],[4,0,4,1],[39,2,39,3],[30,12,30,13],[39,12,39,13],[40,0,43,1],[40,2,43,3],[40,4,43,5],[40,6,43,7],[40,8,43,9],[40,10,43,11],[40,12,43,13],[30,4,30,5],[30,6,30,7],[30,8,30,9],[39,10,39,11],[39,4,39,5]]}
[]
[null,null,"COMMONWEALTH OF PENNSYLVANIA",null,null,null,null,null,null,null,"DISTRICT",null,{"$f":"IF(ISBLANK('S1'!L2),\"\",'S1'!L2)","v":""}]
[null,null,"DEPARTMENT OF TRANSPORTATION",null,null,null,null,null,null,null,"PLANT CODE",null,{"$f":"IF(ISBLANK('S1'!L3),\"\",'S1'!L3)","v":""}]
[null,null,"PENNSYLVANIA TURNPIKE COMMISSION",null,null,null,null,null,null,null,"AGG SIZE",null,{"$f":"IF(ISBLANK('S1'!L4),\"\",'S1'!L4)","v":"Type AS4"}]
[{"$f":"'S1'!A5","v":"Aggregate 2023"}]
[null,null,null,{"$f":"'S1'!D6","v":"Material Test Results for Type AS4"}]
{"$rows_left_out":42}
{"sheet":"S5","index":4,"n_rows":47,"n_cols":14,"rows_kept":47,"cut":false,"hidden":true,"merged":[[3,10,3,11],[3,12,3,13],[0,0,3,1],[1,10,1,11],[1,12,1,13],[2,10,2,11],[2,12,2,13],[0,8,3,9],[1,2,1,7],[2,2,2,7],[3,2,3,7],[5,3,5,8],[7,0,7,1],[7,2,7,3],[7,4,7,5],[7,6,7,7],[7,8,7,9],[10,0,10,1],[9,0,9,1],[7,10,7,11],[7,12,7,13],[8,0,8,1],[8,2,8,3],[8,4,8,5],[8,6,8,7],[8,8,8,9],[8,10,8,11],[8,12,8,13],[21,12,24,13],[26,12,26,13],[27,12,27,13],[30,2,30,3],[11,10,11,11],[11,12,11,13],[11,4,11,5],[11,6,11,7],[11,8,11,9],[20,12,20,13],[30,10,30,11],[21,6,24,7],[27,2,27,3],[20,2,20,3],[26,2,26,3],[20,10,20,11],[28,0,28,1],[26,0,26,1],[27,0,27,1],[26,10,26,11],[21,0,24,1],[21,2,24,3],[21,4,24,5],[27,4,27,5],[27,6,27,7],[26,4,26,5],[26,6,26,7],[26,8,26,9],[39,6,39,7],[39,8,39,9],[11,0,11,1],[11,2,11,3],[21,8,24,9],[20,0,20,1],[39,0,39,1],[20,4,20,5],[20,6,20,7],[20,8,20,9],[30,0,30,1],[25,0,25,13],[21,10,24,11],[27,8,27,9],[27,10,27,11],[29,0,29,1],[4,0,4,1],[39,2,39,3],[30,12,30,13],[39,12,39,13],[40,0,43,1],[40,2,43,3],[40,4,43,5],[40,6,43,7],[40,8,43,9],[40,10,43,11],[40,12,43,13],[30,4,30,5],[30,6,30,7],[30,8,30,9],[39,10,39,11],[39,4,39,5]]}
[]
[null,null,"COMMONWEALTH OF PENNSYLVANIA",null,null,null,null,null,null,null,"DISTRICT",null,{"$f":"IF(ISBLANK('S1'!L2),\"\",'S1'!L2)","v":""}]
[null,null,"DEPARTMENT OF TRANSPORTATION",null,null,null,null,null,null,null,"PLANT CODE",null,{"$f":"IF(ISBLANK('S1'!L3),\"\",'S1'!L3)","v":""}]
[null,null,"PENNSYLVANIA TURNPIKE COMMISSION",null,null,null,null,null,null,null,"AGG SIZE",null,{"$f":"IF(ISBLANK('S1'!L4),\"\",'S1'!L4)","v":"Type AS4"}]
[{"$f":"'S1'!A5","v":"Aggregate 2023"}]
[null,null,null,{"$f":"'S1'!D6","v":"Material Test Results for Type AS4"}]
{"$rows_left_out":42}
{"sheet":"S6","index":5,"n_rows":47,"n_cols":14,"rows_kept":47,"cut":false,"hidden":true,"merged":[[3,10,3,11],[3,12,3,13],[0,0,3,1],[1,10,1,11],[1,12,1,13],[2,10,2,11],[2,12,2,13],[0,8,3,9],[1,2,1,7],[2,2,2,7],[3,2,3,7],[5,3,5,8],[7,0,7,1],[7,2,7,3],[7,4,7,5],[7,6,7,7],[7,8,7,9],[10,0,10,1],[9,0,9,1],[7,10,7,11],[7,12,7,13],[8,0,8,1],[8,2,8,3],[8,4,8,5],[8,6,8,7],[8,8,8,9],[8,10,8,11],[8,12,8,13],[21,12,24,13],[26,12,26,13],[27,12,27,13],[30,2,30,3],[11,10,11,11],[11,12,11,13],[11,4,11,5],[11,6,11,7],[11,8,11,9],[20,12,20,13],[30,10,30,11],[21,6,24,7],[27,2,27,3],[20,2,20,3],[26,2,26,3],[20,10,20,11],[28,0,28,1],[26,0,26,1],[27,0,27,1],[26,10,26,11],[21,0,24,1],[21,2,24,3],[21,4,24,5],[27,4,27,5],[27,6,27,7],[26,4,26,5],[26,6,26,7],[26,8,26,9],[39,6,39,7],[39,8,39,9],[11,0,11,1],[11,2,11,3],[21,8,24,9],[20,0,20,1],[39,0,39,1],[20,4,20,5],[20,6,20,7],[20,8,20,9],[30,0,30,1],[25,0,25,13],[21,10,24,11],[27,8,27,9],[27,10,27,11],[29,0,29,1],[4,0,4,1],[39,2,39,3],[30,12,30,13],[39,12,39,13],[40,0,43,1],[40,2,43,3],[40,4,43,5],[40,6,43,7],[40,8,43,9],[40,10,43,11],[40,12,43,13],[30,4,30,5],[30,6,30,7],[30,8,30,9],[39,10,39,11],[39,4,39,5]]}
[]
[null,null,"COMMONWEALTH OF PENNSYLVANIA",null,null,null,null,null,null,null,"DISTRICT",null,{"$f":"IF(ISBLANK('S1'!L2),\"\",'S1'!L2)","v":""}]
[null,null,"DEPARTMENT OF TRANSPORTATION",null,null,null,null,null,null,null,"PLANT CODE",null,{"$f":"IF(ISBLANK('S1'!L3),\"\",'S1'!L3)","v":""}]
[null,null,"PENNSYLVANIA TURNPIKE COMMISSION",null,null,null,null,null,null,null,"AGG SIZE",null,{"$f":"IF(ISBLANK('S1'!L4),\"\",'S1'!L4)","v":"Type AS4"}]
[{"$f":"'S1'!A5","v":"Aggregate 2023"}]
[null,null,null,{"$f":"'S1'!D6","v":"Material Test Results for Type AS4"}]
{"$rows_left_out":42}
{"sheet":"S7","index":6,"n_rows":47,"n_cols":14,"rows_kept":47,"cut":false,"hidden":true,"merged":[[3,10,3,11],[3,12,3,13],[0,0,3,1],[1,10,1,11],[1,12,1,13],[2,10,2,11],[2,12,2,13],[0,8,3,9],[1,2,1,7],[2,2,2,7],[3,2,3,7],[5,3,5,8],[7,0,7,1],[7,2,7,3],[7,4,7,5],[7,6,7,7],[7,8,7,9],[10,0,10,1],[9,0,9,1],[7,10,7,11],[7,12,7,13],[8,0,8,1],[8,2,8,3],[8,4,8,5],[8,6,8,7],[8,8,8,9],[8,10,8,11],[8,12,8,13],[21,12,24,13],[26,12,26,13],[27,12,27,13],[30,2,30,3],[11,10,11,11],[11,12,11,13],[11,4,11,5],[11,6,11,7],[11,8,11,9],[20,12,20,13],[30,10,30,11],[21,6,24,7],[27,2,27,3],[20,2,20,3],[26,2,26,3],[20,10,20,11],[28,0,28,1],[26,0,26,1],[27,0,27,1],[26,10,26,11],[21,0,24,1],[21,2,24,3],[21,4,24,5],[27,4,27,5],[27,6,27,7],[26,4,26,5],[26,6,26,7],[26,8,26,9],[39,6,39,7],[39,8,39,9],[11,0,11,1],[11,2,11,3],[21,8,24,9],[20,0,20,1],[39,0,39,1],[20,4,20,5],[20,6,20,7],[20,8,20,9],[30,0,30,1],[25,0,25,13],[21,10,24,11],[27,8,27,9],[27,10,27,11],[29,0,29,1],[4,0,4,1],[39,2,39,3],[30,12,30,13],[39,12,39,13],[40,0,43,1],[40,2,43,3],[40,4,43,5],[40,6,43,7],[40,8,43,9],[40,10,43,11],[40,12,43,13],[30,4,30,5],[30,6,30,7],[30,8,30,9],[39,10,39,11],[39,4,39,5]]}
[]
[null,null,"COMMONWEALTH OF PENNSYLVANIA",null,null,null,null,null,null,null,"DISTRICT",null,{"$f":"IF(ISBLANK('S1'!L2),\"\",'S1'!L2)","v":""}]
[null,null,"DEPARTMENT OF TRANSPORTATION",null,null,null,null,null,null,null,"PLANT CODE",null,{"$f":"IF(ISBLANK('S1'!L3),\"\",'S1'!L3)","v":""}]
[null,null,"PENNSYLVANIA TURNPIKE COMMISSION",null,null,null,null,null,null,null,"AGG SIZE",null,{"$f":"IF(ISBLANK('S1'!L4),\"\",'S1'!L4)","v":"Type AS4"}]
[{"$f":"'S1'!A5","v":"Aggregate 2023"}]
[null,null,null,{"$f":"'S1'!D6","v":"Material Test Results for Type AS4"}]
{"$rows_left_out":42}
{"sheet":"S8","index":7,"n_rows":47,"n_cols":14,"rows_kept":47,"cut":false,"hidden":true,"merged":[[3,10,3,11],[3,12,3,13],[0,0,3,1],[1,10,1,11],[1,12,1,13],[2,10,2,11],[2,12,2,13],[0,8,3,9],[1,2,1,7],[2,2,2,7],[3,2,3,7],[5,3,5,8],[7,0,7,1],[7,2,7,3],[7,4,7,5],[7,6,7,7],[7,8,7,9],[10,0,10,1],[9,0,9,1],[7,10,7,11],[7,12,7,13],[8,0,8,1],[8,2,8,3],[8,4,8,5],[8,6,8,7],[8,8,8,9],[8,10,8,11],[8,12,8,13],[21,12,24,13],[26,12,26,13],[27,12,27,13],[30,2,30,3],[11,10,11,11],[11,12,11,13],[11,4,11,5],[11,6,11,7],[11,8,11,9],[20,12,20,13],[30,10,30,11],[21,6,24,7],[27,2,27,3],[20,2,20,3],[26,2,26,3],[20,10,20,11],[28,0,28,1],[26,0,26,1],[27,0,27,1],[26,10,26,11],[21,0,24,1],[21,2,24,3],[21,4,24,5],[27,4,27,5],[27,6,27,7],[26,4,26,5],[26,6,26,7],[26,8,26,9],[39,6,39,7],[39,8,39,9],[11,0,11,1],[11,2,11,3],[21,8,24,9],[20,0,20,1],[39,0,39,1],[20,4,20,5],[20,6,20,7],[20,8,20,9],[30,0,30,1],[25,0,25,13],[21,10,24,11],[27,8,27,9],[27,10,27,11],[29,0,29,1],[4,0,4,1],[39,2,39,3],[30,12,30,13],[39,12,39,13],[40,0,43,1],[40,2,43,3],[40,4,43,5],[40,6,43,7],[40,8,43,9],[40,10,43,11],[40,12,43,13],[30,4,30,5],[30,6,30,7],[30,8,30,9],[39,10,39,11],[39,4,39,5]]}
[]
[null,null,"COMMONWEALTH OF PENNSYLVANIA",null,null,null,null,null,null,null,"DISTRICT",null,{"$f":"IF(ISBLANK('S1'!L2),\"\",'S1'!L2)","v":""}]
[null,null,"DEPARTMENT OF TRANSPORTATION",null,null,null,null,null,null,null,"PLANT CODE",null,{"$f":"IF(ISBLANK('S1'!L3),\"\",'S1'!L3)","v":""}]
[null,null,"PENNSYLVANIA TURNPIKE COMMISSION",null,null,null,null,null,null,null,"AGG SIZE",null,{"$f":"IF(ISBLANK('S1'!L4),\"\",'S1'!L4)","v":"Type AS4"}]
[{"$f":"'S1'!A5","v":"Aggregate 2023"}]
[null,null,null,{"$f":"'S1'!D6","v":"Material Test Results for Type AS4"}]
{"$rows_left_out":42}
{"sheet":"S9","index":8,"n_rows":47,"n_cols":14,"rows_kept":47,"cut":false,"hidden":true,"merged":[[3,10,3,11],[3,12,3,13],[0,0,3,1],[1,10,1,11],[1,12,1,13],[2,10,2,11],[2,12,2,13],[0,8,3,9],[1,2,1,7],[2,2,2,7],[3,2,3,7],[5,3,5,8],[7,0,7,1],[7,2,7,3],[7,4,7,5],[7,6,7,7],[7,8,7,9],[10,0,10,1],[9,0,9,1],[7,10,7,11],[7,12,7,13],[8,0,8,1],[8,2,8,3],[8,4,8,5],[8,6,8,7],[8,8,8,9],[8,10,8,11],[8,12,8,13],[21,12,24,13],[26,12,26,13],[27,12,27,13],[30,2,30,3],[11,10,11,11],[11,12,11,13],[11,4,11,5],[11,6,11,7],[11,8,11,9],[20,12,20,13],[30,10,30,11],[21,6,24,7],[27,2,27,3],[20,2,20,3],[26,2,26,3],[20,10,20,11],[28,0,28,1],[26,0,26,1],[27,0,27,1],[26,10,26,11],[21,0,24,1],[21,2,24,3],[21,4,24,5],[27,4,27,5],[27,6,27,7],[26,4,26,5],[26,6,26,7],[26,8,26,9],[39,6,39,7],[39,8,39,9],[11,0,11,1],[11,2,11,3],[21,8,24,9],[20,0,20,1],[39,0,39,1],[20,4,20,5],[20,6,20,7],[20,8,20,9],[30,0,30,1],[25,0,25,13],[21,10,24,11],[27,8,27,9],[27,10,27,11],[29,0,29,1],[4,0,4,1],[39,2,39,3],[30,12,30,13],[39,12,39,13],[40,0,43,1],[40,2,43,3],[40,4,43,5],[40,6,43,7],[40,8,43,9],[40,10,43,11],[40,12,43,13],[30,4,30,5],[30,6,30,7],[30,8,30,9],[39,10,39,11],[39,4,39,5]]}
[]
[null,null,"COMMONWEALTH OF PENNSYLVANIA",null,null,null,null,null,null,null,"DISTRICT",null,{"$f":"IF(ISBLANK('S1'!L2),\"\",'S1'!L2)","v":""}]
[null,null,"DEPARTMENT OF TRANSPORTATION",null,null,null,null,null,null,null,"PLANT CODE",null,{"$f":"IF(ISBLANK('S1'!L3),\"\",'S1'!L3)","v":""}]
[null,null,"PENNSYLVANIA TURNPIKE COMMISSION",null,null,null,null,null,null,null,"AGG SIZE",null,{"$f":"IF(ISBLANK('S1'!L4),\"\",'S1'!L4)","v":"Type AS4"}]
[{"$f":"'S1'!A5","v":"Aggregate 2023"}]
[null,null,null,{"$f":"'S1'!D6","v":"Material Test Results for Type AS4"}]
{"$rows_left_out":42}
{"sheet":"S10","index":9,"n_rows":47,"n_cols":14,"rows_kept":47,"cut":false,"hidden":true,"merged":[[3,10,3,11],[3,12,3,13],[0,0,3,1],[1,10,1,11],[1,12,1,13],[2,10,2,11],[2,12,2,13],[0,8,3,9],[1,2,1,7],[2,2,2,7],[3,2,3,7],[5,3,5,8],[7,0,7,1],[7,2,7,3],[7,4,7,5],[7,6,7,7],[7,8,7,9],[10,0,10,1],[9,0,9,1],[7,10,7,11],[7,12,7,13],[8,0,8,1],[8,2,8,3],[8,4,8,5],[8,6,8,7],[8,8,8,9],[8,10,8,11],[8,12,8,13],[21,12,24,13],[26,12,26,13],[27,12,27,13],[30,2,30,3],[11,10,11,11],[11,12,11,13],[11,4,11,5],[11,6,11,7],[11,8,11,9],[20,12,20,13],[30,10,30,11],[21,6,24,7],[27,2,27,3],[20,2,20,3],[26,2,26,3],[20,10,20,11],[28,0,28,1],[26,0,26,1],[27,0,27,1],[26,10,26,11],[21,0,24,1],[21,2,24,3],[21,4,24,5],[27,4,27,5],[27,6,27,7],[26,4,26,5],[26,6,26,7],[26,8,26,9],[39,6,39,7],[39,8,39,9],[11,0,11,1],[11,2,11,3],[21,8,24,9],[20,0,20,1],[39,0,39,1],[20,4,20,5],[20,6,20,7],[20,8,20,9],[30,0,30,1],[25,0,25,13],[21,10,24,11],[27,8,27,9],[27,10,27,11],[29,0,29,1],[4,0,4,1],[39,2,39,3],[30,12,30,13],[39,12,39,13],[40,0,43,1],[40,2,43,3],[40,4,43,5],[40,6,43,7],[40,8,43,9],[40,10,43,11],[40,12,43,13],[30,4,30,5],[30,6,30,7],[30,8,30,9],[39,10,39,11],[39,4,39,5]]}
[]
[null,null,"COMMONWEALTH OF PENNSYLVANIA",null,null,null,null,null,null,null,"DISTRICT",null,{"$f":"IF(ISBLANK('S1'!L2),\"\",'S1'!L2)","v":""}]
[null,null,"DEPARTMENT OF TRANSPORTATION",null,null,null,null,null,null,null,"PLANT CODE",null,{"$f":"IF(ISBLANK('S1'!L3),\"\",'S1'!L3)","v":""}]
[null,null,"PENNSYLVANIA TURNPIKE COMMISSION",null,null,null,null,null,null,null,"AGG SIZE",null,{"$f":"IF(ISBLANK('S1'!L4),\"\",'S1'!L4)","v":"Type AS4"}]
[{"$f":"'S1'!A5","v":"Aggregate 2023"}]
[null,null,null,{"$f":"'S1'!D6","v":"Material Test Results for Type AS4"}]
{"$rows_left_out":42}
{"sheet":"Chart 1-24","index":10,"n_rows":5,"n_cols":10,"rows_kept":5,"cut":false,"hidden":true,"merged":[[3,1,3,5],[3,7,3,8],[3,9,3,10],[4,0,4,1],[0,0,2,0],[1,1,1,5],[1,7,1,8],[1,9,1,10],[2,1,2,5],[2,7,2,8],[2,9,2,10]]}
[]
[null,"COMMONWEALTH OF PENNSYLVANIA",null,null,null,null,null,"DISTRICT",null,{"$f":"'S1'!L2","v":0}]
[null,"DEPARTMENT OF TRANSPORTATION",null,null,null,null,null,"PLANT CODE",null,{"$f":"'S1'!L3","v":0}]
[null,"PENNSYLVANIA TURNPIKE COMMISSION",null,null,null,null,null,"AGG SIZE",null,{"$f":"'S1'!L4","v":"Type AS4"}]
[{"$f":"'S1'!$A$5:$B$5","v":"Aggregate 2023"}]

{"sheet":"Chart 25-48","index":11,"n_rows":5,"n_cols":10,"rows_kept":5,"cut":false,"hidden":false,"merged":[[3,1,3,5],[3,7,3,8],[3,9,3,10],[4,0,4,1],[0,0,2,0],[1,1,1,5],[1,7,1,8],[1,9,1,10],[2,1,2,5],[2,7,2,8],[2,9,2,10]]}
[]
[null,"COMMONWEALTH OF PENNSYLVANIA",null,null,null,null,null,"DISTRICT",null,{"$f":"'S1'!L2","v":0}]
[null,"DEPARTMENT OF TRANSPORTATION",null,null,null,null,null,"PLANT CODE",null,{"$f":"'S1'!L3","v":0}]
[null,"PENNSYLVANIA TURNPIKE COMMISSION",null,null,null,null,null,"AGG SIZE",null,{"$f":"'S1'!L4","v":"Type AS4"}]
[{"$f":"'S1'!$A$5:$B$5","v":"Aggregate 2023"}]

{"sheet":"Chart 49-72","index":12,"n_rows":5,"n_cols":10,"rows_kept":5,"cut":false,"hidden":true,"merged":[[3,1,3,5],[3,7,3,8],[3,9,3,10],[4,0,4,1],[0,0,2,0],[1,1,1,5],[1,7,1,8],[1,9,1,10],[2,1,2,5],[2,7,2,8],[2,9,2,10]]}
[]
[null,"COMMONWEALTH OF PENNSYLVANIA",null,null,null,null,null,"DISTRICT",null,{"$f":"'S1'!L2","v":0}]
[null,"DEPARTMENT OF TRANSPORTATION",null,null,null,null,null,"PLANT CODE",null,{"$f":"'S1'!L3","v":0}]
[null,"PENNSYLVANIA TURNPIKE COMMISSION",null,null,null,null,null,"AGG SIZE",null,{"$f":"'S1'!L4","v":"Type AS4"}]
[{"$f":"'S1'!$A$5:$B$5","v":"Aggregate 2023"}]

{"sheet":"Chart 73-96","index":13,"n_rows":5,"n_cols":10,"rows_kept":5,"cut":false,"hidden":true,"merged":[[3,1,3,5],[3,7,3,8],[3,9,3,10],[4,0,4,1],[0,0,2,0],[1,1,1,5],[1,7,1,8],[1,9,1,10],[2,1,2,5],[2,7,2,8],[2,9,2,10]]}
[]
[null,"COMMONWEALTH OF PENNSYLVANIA",null,null,null,null,null,"DISTRICT",null,{"$f":"'S1'!L2","v":0}]
[null,"DEPARTMENT OF TRANSPORTATION",null,null,null,null,null,"PLANT CODE",null,{"$f":"'S1'!L3","v":0}]
[null,"PENNSYLVANIA TURNPIKE COMMISSION",null,null,null,null,null,"AGG SIZE",null,{"$f":"'S1'!L4","v":"Type AS4"}]
[{"$f":"'S1'!$A$5:$B$5","v":"Aggregate 2023"}]

{"sheet":"Chart 97-120","index":14,"n_rows":5,"n_cols":10,"rows_kept":5,"cut":false,"hidden":true,"merged":[[3,1,3,5],[3,7,3,8],[3,9,3,10],[4,0,4,1],[0,0,2,0],[1,1,1,5],[1,7,1,8],[1,9,1,10],[2,1,2,5],[2,7,2,8],[2,9,2,10]]}
[]
[null,"COMMONWEALTH OF PENNSYLVANIA",null,null,null,null,null,"DISTRICT",null,{"$f":"'S1'!L2","v":0}]
[null,"DEPARTMENT OF TRANSPORTATION",null,null,null,null,null,"PLANT CODE",null,{"$f":"'S1'!L3","v":0}]
[null,"PENNSYLVANIA TURNPIKE COMMISSION",null,null,null,null,null,"AGG SIZE",null,{"$f":"'S1'!L4","v":"Type AS4"}]
[{"$f":"'S1'!$A$5:$B$5","v":"Aggregate 2023"}]

{"sheet":"ST1","index":15,"n_rows":125,"n_cols":7,"rows_kept":125,"cut":false,"hidden":true,"merged":[]}
[]
[]
[]
["Samp #",200,100,8,4,0.25,0.375]
[]
[1,{"$f":"'S1'!$D$20","v":"  "},{"$f":"'S1'!$D$19","v":"  "},{"$f":"'S1'!$D$18","v":"  "},{"$f":"'S1'!$D$17","v":"  "},{"$f":"'S1'!$D$16","v":"  "},{"$f":"'S1'!$D$15","v":"  "}]
{"$rows_left_out":120}
{"sheet":"Avg","index":16,"n_rows":7,"n_cols":8,"rows_kept":7,"cut":false,"hidden":false,"merged":[[1,0,1,6],[1,7,1,8]]}
[]
["Average Gradations",null,null,null,null,null,null,{"$f":"IF(ISBLANK('S1'!L4),\" \",'S1'!L4)","v":"Type AS4"}]
[]
["Sieve",200,100,8,4,0.25,0.375]
["Count",{"$f":"COUNT('ST1'!B6:B125)","v":0},{"$f":"COUNT('ST1'!C6:C125)","v":0},{"$f":"COUNT('ST1'!D6:D125)","v":0},{"$f":"COUNT('ST1'!E6:E125)","v":0},{"$f":"COUNT('ST1'!F6:F125)","v":0},{"$f":"COUNT('ST1'!G6:G125)","v":0}]
["Avg",{"$f":"AVERAGE('ST1'!B6:B125)","v":{"$error":"#DIV/0!"}},{"$f":"AVERAGE('ST1'!C6:C125)","v":{"$error":"#DIV/0!"}},{"$f":"AVERAGE('ST1'!D6:D125)","v":{"$error":"#DIV/0!"}},{"$f":"AVERAGE('ST1'!E6:E125)","v":{"$error":"#DIV/0!"}},{"$f":"AVERAGE('ST1'!F6:F125)","v":{"$error":"#DIV/0!"}},{"$f":"AVERAGE('ST1'!G6:G125)","v":{"$error":"#DIV/0!"}}]
{"$rows_left_out":2}
{"sheet":"ST13","index":17,"n_rows":122,"n_cols":16,"rows_kept":122,"cut":false,"hidden":true,"merged":[[0,1,0,2],[0,3,0,4],[0,5,0,6],[0,7,0,8],[0,9,0,10]]}
["Sam. No.",0.375,null,4,null,8,null,100,null,200,null,null,null,null,null,{"$f":"'S1'!L4","v":"Type AS4"}]
[null,"N=1","N=3","N=1","N=3","N=1","N=3","N=1","N=3","N=1","N=3"]
[{"$f":"IF(ISBLANK('S1'!C$8),\" \",'S1'!C$8)","v":" "},{"$f":"IF(ISTEXT('S1'!$D$15),NA(),'S1'!$D$15)","v":{"$error":"#N/A"}},null,{"$f":"IF(ISTEXT('S1'!$D$17),NA(),'S1'!$D$17)","v":{"$error":"#N/A"}},{"$f":"D3","v":{"$error":"#N/A"}},{"$f":"IF(ISTEXT('S1'!$D$18),NA(),'S1'!$D$18)","v":{"$error":"#N/A"}},{"$f":"F3","v":{"$error":"#N/A"}},{"$f":"IF(ISTEXT('S1'!$D$19),NA(),'S1'!$D$19)","v":{"$error":"#N/A"}},null,{"$f":"IF(ISTEXT('S1'!$D$20),NA(),'S1'!$D$20)","v":{"$error":"#N/A"}},{"$f":"J3","v":{"$error":"#N/A"}}]
[{"$f":"IF(ISBLANK('S1'!E$8),\" \",'S1'!E$8)","v":" "},{"$f":"IF(ISTEXT('S1'!$F$15),NA(),'S1'!$F$15)","v":{"$error":"#N/A"}},null,{"$f":"IF(ISTEXT('S1'!$F$17),NA(),'S1'!$F$17)","v":{"$error":"#N/A"}},{"$f":"ROUND(AVERAGE(D3:D4),0)","v":{"$error":"#N/A"}},{"$f":"IF(ISTEXT('S1'!$F$18),NA(),'S1'!$F$18)","v":{"$error":"#N/A"}},{"$f":"ROUND(AVERAGE(F3:F4),0)","v":{"$error":"#N/A"}},{"$f":"IF(ISTEXT('S1'!$F$19),NA(),'S1'!$F$19)","v":{"$error":"#N/A"}},null,{"$f":"IF(ISTEXT('S1'!$F$20),NA(),'S1'!$F$20)","v":{"$error":"#N/A"}},{"$f":"ROUND(AVERAGE(J3:J4),1)","v":{"$error":"#N/A"}}]
[{"$f":"IF(ISBLANK('S1'!G$8),\" \",'S1'!G$8)","v":" "},{"$f":"IF(ISTEXT('S1'!$H$15),NA(),'S1'!$H$15)","v":{"$error":"#N/A"}},null,{"$f":"IF(ISTEXT('S1'!$H$17),NA(),'S1'!$H$17)","v":{"$error":"#N/A"}},{"$f":"ROUND(AVERAGE(D3:D5),0)","v":{"$error":"#N/A"}},{"$f":"IF(ISTEXT('S1'!$H$18),NA(),'S1'!$H$18)","v":{"$error":"#N/A"}},{"$f":"ROUND(AVERAGE(F3:F5),0)","v":{"$error":"#N/A"}},{"$f":"IF(ISTEXT('S1'!$H$19),NA(),'S1'!$H$19)","v":{"$error":"#N/A"}},null,{"$f":"IF(ISTEXT('S1'!$H$20),NA(),'S1'!$H$20)","v":{"$error":"#N/A"}},{"$f":"ROUND(AVERAGE(J3:J5),1)","v":{"$error":"#N/A"}}]
[{"$f":"IF(ISBLANK('S1'!I$8),\" \",'S1'!I$8)","v":" "},{"$f":"IF(ISTEXT('S1'!$J$15),NA(),'S1'!$J$15)","v":{"$error":"#N/A"}},null,{"$f":"IF(ISTEXT('S1'!$J$17),NA(),'S1'!$J$17)","v":{"$error":"#N/A"}},{"$f":"ROUND(AVERAGE(D4:D6),0)","v":{"$error":"#N/A"}},{"$f":"IF(ISTEXT('S1'!$J$18),NA(),'S1'!$J$18)","v":{"$error":"#N/A"}},{"$f":"ROUND(AVERAGE(F4:F6),0)","v":{"$error":"#N/A"}},{"$f":"IF(ISTEXT('S1'!$J$19),NA(),'S1'!$J$19)","v":{"$error":"#N/A"}},null,{"$f":"IF(ISTEXT('S1'!$J$20),NA(),'S1'!$J$20)","v":{"$error":"#N/A"}},{"$error":"#N/A"}]
{"$rows_left_out":117}
{"sheet":"AP","index":18,"n_rows":23,"n_cols":36,"rows_kept":23,"cut":false,"hidden":false,"merged":[[16,7,18,7],[20,7,22,7],[4,7,6,7],[8,7,10,7],[12,7,14,7]]}
[]
[null,null,null,null,null,null,null,null,null,{"$f":"'S1'!L4","v":"Type AS4"}]
[]
[]
[null,null,null,null,null,null,null,0.375,"Max",104]
[]
{"$rows_left_out":18}
{"sheet":"Spec","index":19,"n_rows":12,"n_cols":5,"rows_kept":12,"cut":false,"hidden":true,"merged":[[0,0,0,5],[1,0,1,5],[2,0,2,5],[3,0,3,5]]}
["Material Test Results for Type AS1"]
["Material Test Results for Type AS2"]
["Material Test Results for Type AS3"]
["Material Test Results for Type AS4"]
[]
[null,"AS1","AS2","AS3","AS4"]
{"$rows_left_out":6}