{"text_format":"1","workbook":"xlsx","n_sheets":20,"sheets":["S1","S2","S3","S4","S5","S6","S7","S8","S9","S10","Chart 1-24","Chart 25-48","Chart 49-72","Chart 73-96","Chart 97-120","ST1","Avg","ST13","AP","Spec"],"not_rendered":{"charts":25,"images":28,"macros":1,"external_links":0,"defined_names":2,"comments":0,"pivot_tables":0},"unopened":[],"bounds":{"document_bytes":16777216,"sheet_cells":100000,"rows_first":2000,"rows_last":500,"rows_between":2000,"halvings":0,"cell_chars":16384,"cell_head_chars":4096},"cells_cut":0,"cells_raw":0,"read":"whole","date_system":"1900"}

{"sheet":"S1","index":0,"n_rows":47,"n_cols":24,"rows_kept":47,"cut":false,"hidden":false,"merged":[[7,0,7,1],[7,2,7,3],[2,9,2,10],[3,9,3,10],[5,3,5,8],[7,4,7,5],[0,0,3,1],[4,0,4,1],[0,7,3,8],[1,11,1,12],[2,11,2,12],[3,11,3,12],[7,6,7,7],[7,10,7,11],[7,12,7,13],[7,8,7,9],[1,9,1,10],[1,2,1,6],[2,2,2,6],[3,2,3,6],[5,9,5,12],[9,0,9,1],[10,0,10,1],[8,8,8,9],[8,0,8,1],[8,2,8,3],[8,4,8,5],[8,6,8,7],[11,0,11,1],[11,2,11,3],[11,4,11,5],[11,6,11,7],[20,0,20,1],[20,2,20,3],[20,4,20,5],[20,6,20,7],[27,2,27,3],[27,4,27,5],[27,6,27,7],[21,0,24,1],[21,2,24,3],[21,4,24,5],[21,6,24,7],[25,0,25,13],[40,12,43,13],[27,10,27,11],[29,0,29,1],[27,12,27,13],[39,10,39,11],[39,12,39,13],[30,8,30,9],[30,10,30,11],[30,12,30,13],[27,8,27,9],[30,0,30,1],[30,2,30,3],[30,4,30,5],[39,8,39,9],[39,0,39,1],[39,2,39,3],[40,0,43,1],[40,2,43,3],[40,4,43,5],[40,6,43,7],[8,10,8,11],[39,6,39,7],[30,6,30,7],[40,8,43,9],[40,10,43,11],[39,4,39,5],[26,0,26,1],[26,2,26,3],[26,4,26,5],[26,6,26,7],[28,0,28,1],[27,0,27,1],[8,12,8,13],[26,10,26,11],[26,12,26,13],[20,8,20,9],[20,10,20,11],[20,12,20,13],[21,8,24,9],[21,12,24,13],[26,8,26,9],[11,12,11,13],[21,10,24,11],[11,8,11,9],[11,10,11,11]]}
[]
[null,null,"COMMONWEALTH OF PENNSYLVANIA",null,null,null,null,null,null,"DISTRICT"]
[null,null,"DEPARTMENT OF TRANSPORTATION",null,null,null,null,null,null,"PLANT CODE",null,null,null,null,null,null,null,null,"Type AS1"]
[null,null,"PENNSYLVANIA TURNPIKE COMMISSION",null,null,null,null,null,null,"AGG SIZE",null,"Type AS4",null,null,null,null,null,null,"Type AS2",null,null,null,null,{"$f":"IF(L4=\"TYPE AS1\",1,IF(L4=\"TYPE AS2\",2,IF(L4=\"TYPE AS3\",3,IF(L4=\"TYPE AS4\",1))))","v":1}]
["Aggregate 2023",null,null,null,null,null,null,null,null,null,null,null,null,null,null,null,null,null,"Type AS3"]
[null,null,null,{"$f":"IF(L4=\"Type AS1\",Spec!A1,IF(L4=\"Type AS2\",Spec!A2,IF(L4=\"Type AS3\",Spec!A3,IF(L4=\"Type AS4\",Spec!A4))))","v":"Material Test Results for Type AS4"},null,null,null,null,null,"Select Anti-Skid Type to be tested",null,null,null,null,null,null,null,null,"Type AS4"]
[]
["Sample No."]
["Date"]
[{"$f":"IF($L$4=\"Type AS3\",\"Starting Wt.\",\"St. Wt. Before Wash.\")","v":"St. Wt. Before Wash."},null,null,"% Loss",null,"% Loss",null,"% Loss",null,"% Loss",null,"% Loss",null,"% Loss"]
[{"$f":"IF($L$4=\"Type AS3\",\"Ending Wt.\",\"Dry. Wt. After Wash.\")","v":"Dry. Wt. After Wash."},null,null,{"$f":"IF(ISBLANK(C10),\" \",IF(ISBLANK(C15),\" \",IF($L$4=\"Type AS3\",(C10-C11)/C10*100,(C11-C46)/C11*100)))","v":" "},null,{"$f":"IF(ISBLANK(E10),\" \",IF(ISBLANK(E15),\" \",IF($L$4=\"Type AS3\",(E10-E11)/E10*100,(E11-E46)/E11*100)))","v":" "},null,{"$f":"IF(ISBLANK(G10),\" \",IF(ISBLANK(G15),\" \",IF($L$4=\"Type AS3\",(G10-G11)/G10*100,(G11-G46)/G11*100)))","v":" "},null,{"$f":"IF(ISBLANK(I10),\" \",IF(ISBLANK(I15),\" \",IF($L$4=\"Type AS3\",(I10-I11)/I10*100,(I11-I46)/I11*100)))","v":" "},null,{"$f":"IF(ISBLANK(K10),\" \",IF(ISBLANK(K15),\" \",IF($L$4=\"Type AS3\",(K10-K11)/K10*100,(K11-K46)/K11*100)))","v":" "},null,{"$f":"IF(ISBLANK(M10),\" \",IF(ISBLANK(M15),\" \",IF($L$4=\"Type AS3\",(M10-M11)/M10*100,(M11-M46)/M11*100)))","v":" "},null,null,null,null,"0-3"]
["Wt. Loss",null,{"$f":"IF($L$4=\"Type AS3\",0,IF(ISBLANK(C10),\" \",IF(ISBLANK(C11),\" \",C10-C11)))","v":" "},null,{"$f":"IF($L$4=\"Type AS3\",0,IF(ISBLANK(E10),\" \",IF(ISBLANK(E11),\" \",E10-E11)))","v":" "},null,{"$f":"IF($L$4=\"Type AS3\",0,IF(ISBLANK(G10),\" \",IF(ISBLANK(G11),\" \",G10-G11)))","v":" "},null,{"$f":"IF($L$4=\"Type AS3\",0,IF(ISBLANK(I10),\" \",IF(ISBLANK(I11),\" \",I10-I11)))","v":" "},null,{"$f":"IF($L$4=\"Type AS3\",0,IF(ISBLANK(K10),\" \",IF(ISBLANK(K11),\" \",K10-K11)))","v":" "},null,{"$f":"IF($L$4=\"Type AS3\",0,IF(ISBLANK(M10),\" \",IF(ISBLANK(M11),\" \",M10-M11)))","v":" "},null,null,null,null,null,"0-4"]
["Spec","Sieve","Wt","% Passing","Wt","% Passing","Wt","% Passing","Wt","% Passing","Wt","% Passing","Wt","% Passing",null,null,null,null,"0-5"]
[100,0.5,null,{"$f":"IF(ISBLANK(C$10),\"  \",IF(ISBLANK(C$11),\" \",IF(ISBLANK(C14),\" \",ROUND((C14+C$12)/C$10*100,1))))","v":"  "},null,{"$f":"IF(ISBLANK(E$10),\"  \",IF(ISBLANK(E$11),\" \",IF(ISBLANK(E14),\" \",ROUND((E14+E$12)/E$10*100,0))))","v":"  "},null,{"$f":"IF(ISBLANK(G$10),\"  \",IF(ISBLANK(G$11),\" \",IF(ISBLANK(G14),\" \",ROUND((G14+G$12)/G$10*100,1))))","v":"  "},null,{"$f":"IF(ISBLANK(I$10),\"  \",IF(ISBLANK(I$11),\" \",IF(ISBLANK(I14),\" \",ROUND((I14+I$12)/I$10*100,1))))","v":"  "},null,{"$f":"IF(ISBLANK(K$10),\"  \",IF(ISBLANK(K$11),\" \",IF(ISBLANK(K14),\" \",ROUND((K14+K$12)/K$10*100,1))))","v":"  "},null,{"$f":"IF(ISBLANK(M$10),\"  \",IF(ISBLANK(M$11),\" \",IF(ISBLANK(M14),\" \",ROUND((M14+M$12)/M$10*100,1))))","v":"  "}]
[{"$f":"IF(L$4=\"Type AS3\",\"90-100\",\"100\")","v":"100"},0.375,null,{"$f":"IF(ISBLANK(C$10),\"  \",IF(ISBLANK(C$11),\" \",IF(ISBLANK(C15),\" \",ROUND((C15+C$12)/C$10*100,1))))","v":"  "},null,"  ",null,{"$f":"IF(ISBLANK(G$10),\"  \",IF(ISBLANK(G$11),\" \",IF(ISBLANK(G15),\" \",ROUND((G15+G$12)/G$10*100,1))))","v":"  "},null,{"$f":"IF(ISBLANK(I$10),\"  \",IF(ISBLANK(I$11),\" \",IF(ISBLANK(I15),\" \",ROUND((I15+I$12)/I$10*100,1))))","v":"  "},null,{"$f":"IF(ISBLANK(K$10),\"  \",IF(ISBLANK(K$11),\" \",IF(ISBLANK(K15),\" \",ROUND((K15+K$12)/K$10*100,1))))","v":"  "},null,{"$f":"IF(ISBLANK(M$10),\"  \",IF(ISBLANK(M$11),\" \",IF(ISBLANK(M15),\" \",ROUND((M15+M$12)/M$10*100,1))))","v":"  "}]
["Breaker",0.25,null,{"$f":"IF(ISBLANK(C$10),\"  \",IF(ISBLANK(C$11),\" \",IF(ISBLANK(C16),\" \",ROUND((C16+C$12)/C$10*100,0))))","v":"  "},null,"  ",null,{"$f":"IF(ISBLANK(G$10),\"  \",IF(ISBLANK(G$11),\" \",IF(ISBLANK(G16),\" \",ROUND((G16+G$12)/G$10*100,0))))","v":"  "},null,{"$f":"IF(ISBLANK(I$10),\"  \",IF(ISBLANK(I$11),\" \",IF(ISBLANK(I16),\" \",ROUND((I16+I$12)/I$10*100,0))))","v":"  "},null,{"$f":"IF(ISBLANK(K$10),\"  \",IF(ISBLANK(K$11),\" \",IF(ISBLANK(K16),\" \",ROUND((K16+K$12)/K$10*100,0))))","v":"  "},null,{"$f":"IF(ISBLANK(M$10),\"  \",IF(ISBLANK(M$11),\" \",IF(ISBLANK(M16),\" \",ROUND((M16+M$12)/M$10*100,0))))","v":"  "}]
[{"$f":"IF(L$4=\"Type AS1\",Spec!B$9,IF(L$4=\"Type AS2\",Spec!C$9,IF(L$4=\"Type AS3\",Spec!D$9,IF(L$4=\"Type AS4\",Spec!E$9))))","v":0},4,null,{"$f":"IF(ISBLANK(C$10),\"  \",IF(ISBLANK(C$11),\" \",IF(ISBLANK(C17),\" \",ROUND((C17+C$12)/C$10*100,0))))","v":"  "},null,"  ",null,{"$f":"IF(ISBLANK(G$10),\"  \",IF(ISBLANK(G$11),\" \",IF(ISBLANK(G17),\" \",ROUND((G17+G$12)/G$10*100,0))))","v":"  "},null,{"$f":"IF(ISBLANK(I$10),\"  \",IF(ISBLANK(I$11),\" \",IF(ISBLANK(I17),\" \",ROUND((I17+I$12)/I$10*100,0))))","v":"  "},null,{"$f":"IF(ISBLANK(K$10),\"  \",IF(ISBLANK(K$11),\" \",IF(ISBLANK(K17),\" \",ROUND((K17+K$12)/K$10*100,0))))","v":"  "},null,{"$f":"IF(ISBLANK(M$10),\"  \",IF(ISBLANK(M$11),\" \",IF(ISBLANK(M17),\" \",ROUND((M17+M$12)/M$10*100,0))))","v":"  "}]
[{"$f":"IF(L$4=\"Type AS1\",Spec!B$10,IF(L$4=\"Type AS2\",Spec!C$10,IF(L$4=\"Type AS3\",Spec!D$10,IF(L$4=\"Type AS4\",Spec!E$10))))","v":"0-30"},8,null,{"$f":"IF(ISBLANK(C$10),\"  \",IF(ISBLANK(C$11),\" \",IF(ISBLANK(C18),\" \",ROUND((C18+C$12)/C$10*100,0))))","v":"  "},null,"  ",null,{"$f":"IF(ISBLANK(G$10),\"  \",IF(ISBLANK(G$11),\" \",IF(ISBLANK(G18),\" \",ROUND((G18+G$12)/G$10*100,0))))","v":"  "},null,{"$f":"IF(ISBLANK(I$10),\"  \",IF(ISBLANK(I$11),\" \",IF(ISBLANK(I18),\" \",ROUND((I18+I$12)/I$10*100,0))))","v":"  "},null,{"$f":"IF(ISBLANK(K$10),\"  \",IF(ISBLANK(K$11),\" \",IF(ISBLANK(K18),\" \",ROUND((K18+K$12)/K$10*100,0))))","v":"  "},null,{"$f":"IF(ISBLANK(M$10),\"  \",IF(ISBLANK(M$11),\" \",IF(ISBLANK(M18),\" \",ROUND((M18+M$12)/M$10*100,0))))","v":"  "}]
[{"$f":"IF(L$4=\"Type AS1\",Spec!B$11,IF(L$4=\"Type AS2\",Spec!C$11,IF(L$4=\"Type AS3\",Spec!D$11,IF(L$4=\"Type AS4\",Spec!E$11))))","v":"0-8"},100,null,{"$f":"IF(ISBLANK(C$10),\"  \",IF(ISBLANK(C$11),\" \",IF(ISBLANK(C19),\" \",ROUND((C19+C$12)/C$10*100,0))))","v":"  "},null,"  ",null,{"$f":"IF(ISBLANK(G$10),\"  \",IF(ISBLANK(G$11),\" \",IF(ISBLANK(G19),\" \",ROUND((G19+G$12)/G$10*100,0))))","v":"  "},null,{"$f":"IF(ISBLANK(I$10),\"  \",IF(ISBLANK(I$11),\" \",IF(ISBLANK(I19),\" \",ROUND((I19+I$12)/I$10*100,0))))","v":"  "},null,{"$f":"IF(ISBLANK(K$10),\"  \",IF(ISBLANK(K$11),\" \",IF(ISBLANK(K19),\" \",ROUND((K19+K$12)/K$10*100,0))))","v":"  "},null,{"$f":"IF(ISBLANK(M$10),\"  \",IF(ISBLANK(M$11),\" \",IF(ISBLANK(M19),\" \",ROUND((M19+M$12)/M$10*100,0))))","v":"  "}]
[{"$f":"IF(L$4=\"Type AS1\",Spec!B$12,IF(L$4=\"Type AS2\",Spec!C$12,IF(L$4=\"Type AS3\",Spec!D$12,IF(L$4=\"Type AS4\",Spec!E$12))))","v":"0-5"},200,null,{"$f":"IF(ISBLANK(C$10),\"  \",IF(ISBLANK(C$11),\" \",IF(ISBLANK(C20),\" \",ROUND((C20+C$12)/C$10*100,2))))","v":"  "},null,{"$f":"IF(ISBLANK(E$10),\"  \",IF(ISBLANK(E$11),\" \",IF(ISBLANK(E20),\" \",ROUND((E20+E$12)/E$10*100,2))))","v":"  "},null,{"$f":"IF(ISBLANK(G$10),\"  \",IF(ISBLANK(G$11),\" \",IF(ISBLANK(G20),\" \",ROUND((G20+G$12)/G$10*100,2))))","v":"  "},null,{"$f":"IF(ISBLANK(I$10),\"  \",IF(ISBLANK(I$11),\" \",IF(ISBLANK(I20),\" \",ROUND((I20+I$12)/I$10*100,2))))","v":"  "},null,{"$f":"IF(ISBLANK(K$10),\"  \",IF(ISBLANK(K$11),\" \",IF(ISBLANK(K20),\" \",ROUND((K20+K$12)/K$10*100,2))))","v":"  "},null,{"$f":"IF(ISBLANK(M$10),\"  \",IF(ISBLANK(M$11),\" \",IF(ISBLANK(M20),\" \",ROUND((M20+M$12)/M$10*100,2))))","v":"  "}]
["Tested By"]
["Remarks"]
[]
[]
[]
[{"$f":"IF(L4=\"Type AS2\",\"** For Type AS2, if total % passing the No. 8 sieve is less than 25%, then the the total % passing the No. 200 sieve is permitted to be 0-5\",\"\")","v":""}]
["Sample No."]
["Date"]
[{"$f":"IF($L$4=\"Type AS3\",\"Starting Wt.\",\"St. Wt. Before Wash.\")","v":"St. Wt. Before Wash."},null,null,"% Loss",null,"% Loss",null,"% Loss",null,"% Loss",null,"% Loss",null,"% Loss"]
[{"$f":"IF($L$4=\"Type AS3\",\"Ending Wt.\",\"Dry. Wt. After Wash.\")","v":"Dry. Wt. After Wash."},null,null,{"$f":"IF(ISBLANK(C29),\" \",IF(ISBLANK(C34),\" \",IF($L$4=\"Type AS3\",(C29-C30)/C29*100,(C30-C47)/C30*100)))","v":" "},null,{"$f":"IF(ISBLANK(E29),\" \",IF(ISBLANK(E34),\" \",IF($L$4=\"Type AS3\",(E29-E30)/E29*100,(E30-E47)/E30*100)))","v":" "},null,{"$f":"IF(ISBLANK(G29),\" \",IF(ISBLANK(G34),\" \",IF($L$4=\"Type AS3\",(G29-G30)/G29*100,(G30-G47)/G30*100)))","v":" "},null,{"$f":"IF(ISBLANK(I29),\" \",IF(ISBLANK(I34),\" \",IF($L$4=\"Type AS3\",(I29-I30)/I29*100,(I30-I47)/I30*100)))","v":" "},null,{"$f":"IF(ISBLANK(K29),\" \",IF(ISBLANK(K34),\" \",IF($L$4=\"Type AS3\",(K29-K30)/K29*100,(K30-K47)/K30*100)))","v":" "},null,{"$f":"IF(ISBLANK(M29),\" \",IF(ISBLANK(M34),\" \",IF($L$4=\"Type AS3\",(M29-M30)/M29*100,(M30-M47)/M30*100)))","v":" "}]
["Wt. Loss",null,{"$f":"IF($L$4=\"Type AS3\",0,IF(ISBLANK(C29),\" \",IF(ISBLANK(C30),\" \",C29-C30)))","v":" "},null,{"$f":"IF($L$4=\"Type AS3\",0,IF(ISBLANK(E29),\" \",IF(ISBLANK(E30),\" \",E29-E30)))","v":" "},null,{"$f":"IF($L$4=\"Type AS3\",0,IF(ISBLANK(G29),\" \",IF(ISBLANK(G30),\" \",G29-G30)))","v":" "},null,{"$f":"IF($L$4=\"Type AS3\",0,IF(ISBLANK(I29),\" \",IF(ISBLANK(I30),\" \",I29-I30)))","v":" "},null,{"$f":"IF($L$4=\"Type AS3\",0,IF(ISBLANK(K29),\" \",IF(ISBLANK(K30),\" \",K29-K30)))","v":" "},null,{"$f":"IF($L$4=\"Type AS3\",0,IF(ISBLANK(M29),\" \",IF(ISBLANK(M30),\" \",M29-M30)))","v":" "}]
["Spec","Sieve","Wt","% Passing","Wt","% Passing","Wt","% Passing","Wt","% Passing","Wt","% Passing","Wt","% Passing"]
[100,0.5,null,{"$f":"IF(ISBLANK(C$29),\"  \",IF(ISBLANK(C$30),\" \",IF(ISBLANK(C33),\" \",ROUND((C33+C$31)/C$29*100,1))))","v":"  "},null,{"$f":"IF(ISBLANK(E$29),\"  \",IF(ISBLANK(E$30),\" \",IF(ISBLANK(E33),\" \",ROUND((E33+E$31)/E$29*100,1))))","v":"  "},null,{"$f":"IF(ISBLANK(G$29),\"  \",IF(ISBLANK(G$30),\" \",IF(ISBLANK(G33),\" \",ROUND((G33+G$31)/G$29*100,1))))","v":"  "},null,{"$f":"IF(ISBLANK(I$29),\"  \",IF(ISBLANK(I$30),\" \",IF(ISBLANK(I33),\" \",ROUND((I33+I$31)/I$29*100,1))))","v":"  "},null,{"$f":"IF(ISBLANK(K$29),\"  \",IF(ISBLANK(K$30),\" \",IF(ISBLANK(K33),\" \",ROUND((K33+K$31)/K$29*100,1))))","v":"  "},null,{"$f":"IF(ISBLANK(M$29),\"  \",IF(ISBLANK(M$30),\" \",IF(ISBLANK(M33),\" \",ROUND((M33+M$31)/M$29*100,1))))","v":"  "}]
[{"$f":"IF(L$4=\"Type AS3\",\"90-100\",\"100\")","v":"100"},0.375,null,{"$f":"IF(ISBLANK(C$29),\"  \",IF(ISBLANK(C$30),\" \",IF(ISBLANK(C34),\" \",ROUND((C34+C$31)/C$29*100,1))))","v":"  "},null,{"$f":"IF(ISBLANK(E$29),\"  \",IF(ISBLANK(E$30),\" \",IF(ISBLANK(E34),\" \",ROUND((E34+E$31)/E$29*100,1))))","v":"  "},null,{"$f":"IF(ISBLANK(G$29),\"  \",IF(ISBLANK(G$30),\" \",IF(ISBLANK(G34),\" \",ROUND((G34+G$31)/G$29*100,1))))","v":"  "},null,{"$f":"IF(ISBLANK(I$29),\"  \",IF(ISBLANK(I$30),\" \",IF(ISBLANK(I34),\" \",ROUND((I34+I$31)/I$29*100,1))))","v":"  "},null,{"$f":"IF(ISBLANK(K$29),\"  \",IF(ISBLANK(K$30),\" \",IF(ISBLANK(K34),\" \",ROUND((K34+K$31)/K$29*100,1))))","v":"  "},null,{"$f":"IF(ISBLANK(M$29),\"  \",IF(ISBLANK(M$30),\" \",IF(ISBLANK(M34),\" \",ROUND((M34+M$31)/M$29*100,1))))","v":"  "}]
["Breaker",0.25,null,{"$f":"IF(ISBLANK(C$29),\"  \",IF(ISBLANK(C$30),\" \",IF(ISBLANK(C35),\" \",ROUND((C35+C$31)/C$29*100,0))))","v":"  "},null,{"$f":"IF(ISBLANK(E$29),\"  \",IF(ISBLANK(E$30),\" \",IF(ISBLANK(E35),\" \",ROUND((E35+E$31)/E$29*100,0))))","v":"  "},null,{"$f":"IF(ISBLANK(G$29),\"  \",IF(ISBLANK(G$30),\" \",IF(ISBLANK(G35),\" \",ROUND((G35+G$31)/G$29*100,0))))","v":"  "},null,{"$f":"IF(ISBLANK(I$29),\"  \",IF(ISBLANK(I$30),\" \",IF(ISBLANK(I35),\" \",ROUND((I35+I$31)/I$29*100,0))))","v":"  "},null,{"$f":"IF(ISBLANK(K$29),\"  \",IF(ISBLANK(K$30),\" \",IF(ISBLANK(K35),\" \",ROUND((K35+K$31)/K$29*100,0))))","v":"  "},null,{"$f":"IF(ISBLANK(M$29),\"  \",IF(ISBLANK(M$30),\" \",IF(ISBLANK(M35),\" \",ROUND((M35+M$31)/M$29*100,0))))","v":"  "}]
[{"$f":"IF(L$4=\"Type AS1\",Spec!B$9,IF(L$4=\"Type AS2\",Spec!C$9,IF(L$4=\"Type AS3\",Spec!D$9,IF(L$4=\"Type AS4\",Spec!E$9))))","v":0},4,null,{"$f":"IF(ISBLANK(C$29),\"  \",IF(ISBLANK(C$30),\" \",IF(ISBLANK(C36),\" \",ROUND((C36+C$31)/C$29*100,0))))","v":"  "},null,{"$f":"IF(ISBLANK(E$29),\"  \",IF(ISBLANK(E$30),\" \",IF(ISBLANK(E36),\" \",ROUND((E36+E$31)/E$29*100,0))))","v":"  "},null,{"$f":"IF(ISBLANK(G$29),\"  \",IF(ISBLANK(G$30),\" \",IF(ISBLANK(G36),\" \",ROUND((G36+G$31)/G$29*100,0))))","v":"  "},null,{"$f":"IF(ISBLANK(I$29),\"  \",IF(ISBLANK(I$30),\" \",IF(ISBLANK(I36),\" \",ROUND((I36+I$31)/I$29*100,0))))","v":"  "},null,{"$f":"IF(ISBLANK(K$29),\"  \",IF(ISBLANK(K$30),\" \",IF(ISBLANK(K36),\" \",ROUND((K36+K$31)/K$29*100,0))))","v":"  "},null,{"$f":"IF(ISBLANK(M$29),\"  \",IF(ISBLANK(M$30),\" \",IF(ISBLANK(M36),\" \",ROUND((M36+M$31)/M$29*100,0))))","v":"  "}]
[{"$f":"IF(L$4=\"Type AS1\",Spec!B$10,IF(L$4=\"Type AS2\",Spec!C$10,IF(L$4=\"Type AS3\",Spec!D$10,IF(L$4=\"Type AS4\",Spec!E$10))))","v":"0-30"},8,null,{"$f":"IF(ISBLANK(C$29),\"  \",IF(ISBLANK(C$30),\" \",IF(ISBLANK(C37),\" \",ROUND((C37+C$31)/C$29*100,0))))","v":"  "},null,{"$f":"IF(ISBLANK(E$29),\"  \",IF(ISBLANK(E$30),\" \",IF(ISBLANK(E37),\" \",ROUND((E37+E$31)/E$29*100,0))))","v":"  "},null,{"$f":"IF(ISBLANK(G$29),\"  \",IF(ISBLANK(G$30),\" \",IF(ISBLANK(G37),\" \",ROUND((G37+G$31)/G$29*100,0))))","v":"  "},null,{"$f":"IF(ISBLANK(I$29),\"  \",IF(ISBLANK(I$30),\" \",IF(ISBLANK(I37),\" \",ROUND((I37+I$31)/I$29*100,0))))","v":"  "},null,{"$f":"IF(ISBLANK(K$29),\"  \",IF(ISBLANK(K$30),\" \",IF(ISBLANK(K37),\" \",ROUND((K37+K$31)/K$29*100,0))))","v":"  "},null,{"$f":"IF(ISBLANK(M$29),\"  \",IF(ISBLANK(M$30),\" \",IF(ISBLANK(M37),\" \",ROUND((M37+M$31)/M$29*100,0))))","v":"  "}]
[{"$f":"IF(L$4=\"Type AS1\",Spec!B$11,IF(L$4=\"Type AS2\",Spec!C$11,IF(L$4=\"Type AS3\",Spec!D$11,IF(L$4=\"Type AS4\",Spec!E$11))))","v":"0-8"},100,null,{"$f":"IF(ISBLANK(C$29),\"  \",IF(ISBLANK(C$30),\" \",IF(ISBLANK(C38),\" \",ROUND((C38+C$31)/C$29*100,0))))","v":"  "},null,{"$f":"IF(ISBLANK(E$29),\"  \",IF(ISBLANK(E$30),\" \",IF(ISBLANK(E38),\" \",ROUND((E38+E$31)/E$29*100,0))))","v":"  "},null,{"$f":"IF(ISBLANK(G$29),\"  \",IF(ISBLANK(G$30),\" \",IF(ISBLANK(G38),\" \",ROUND((G38+G$31)/G$29*100,0))))","v":"  "},null,{"$f":"IF(ISBLANK(I$29),\"  \",IF(ISBLANK(I$30),\" \",IF(ISBLANK(I38),\" \",ROUND((I38+I$31)/I$29*100,0))))","v":"  "},null,{"$f":"IF(ISBLANK(K$29),\"  \",IF(ISBLANK(K$30),\" \",IF(ISBLANK(K38),\" \",ROUND((K38+K$31)/K$29*100,0))))","v":"  "},null,{"$f":"IF(ISBLANK(M$29),\"  \",IF(ISBLANK(M$30),\" \",IF(ISBLANK(M38),\" \",ROUND((M38+M$31)/M$29*100,0))))","v":"  "}]
[{"$f":"IF(L$4=\"Type AS1\",Spec!B$12,IF(L$4=\"Type AS2\",Spec!C$12,IF(L$4=\"Type AS3\",Spec!D$12,IF(L$4=\"Type AS4\",Spec!E$12))))","v":"0-5"},200,null,{"$f":"IF(ISBLANK(C$29),\"  \",IF(ISBLANK(C$30),\" \",IF(ISBLANK(C39),\" \",ROUND((C39+C$31)/C$29*100,2))))","v":"  "},null,{"$f":"IF(ISBLANK(E$29),\"  \",IF(ISBLANK(E$30),\" \",IF(ISBLANK(E39),\" \",ROUND((E39+E$31)/E$29*100,2))))","v":"  "},null,{"$f":"IF(ISBLANK(G$29),\"  \",IF(ISBLANK(G$30),\" \",IF(ISBLANK(G39),\" \",ROUND((G39+G$31)/G$29*100,2))))","v":"  "},null,{"$f":"IF(ISBLANK(I$29),\"  \",IF(ISBLANK(I$30),\" \",IF(ISBLANK(I39),\" \",ROUND((I39+I$31)/I$29*100,2))))","v":"  "},null,{"$f":"IF(ISBLANK(K$29),\"  \",IF(ISBLANK(K$30),\" \",IF(ISBLANK(K39),\" \",ROUND((K39+K$31)/K$29*100,2))))","v":"  "},null,{"$f":"IF(ISBLANK(M$29),\"  \",IF(ISBLANK(M$30),\" \",IF(ISBLANK(M39),\" \",ROUND((M39+M$31)/M$29*100,2))))","v":"  "}]
["Tested By"]
["Remarks"]
[]
[]
[]
[]
[null,null,{"$f":"MAX(C14:C15)","v":0},null,{"$f":"MAX(E14:E15)","v":0},null,{"$f":"MAX(G14:G15)","v":0},null,{"$f":"MAX(I14:I15)","v":0},null,{"$f":"MAX(K14:K15)","v":0},null,{"$f":"MAX(M14:M15)","v":0}]
[null,null,{"$f":"MAX(C33:C34)","v":0},null,{"$f":"MAX(E33:E34)","v":0},null,{"$f":"MAX(G33:G34)","v":0},null,{"$f":"MAX(I33:I34)","v":0},null,{"$f":"MAX(K33:K34)","v":0},null,{"$f":"MAX(M33:M34)","v":0}]

{"sheet":"S2","index":1,"n_rows":47,"n_cols":14,"rows_kept":47,"cut":false,"hidden":true,"merged":[[27,12,27,13],[27,10,27,11],[20,12,20,13],[27,6,27,7],[26,12,26,13],[20,10,20,11],[20,8,20,9],[21,6,24,7],[21,8,24,9],[26,10,26,11],[21,10,24,11],[21,12,24,13],[27,8,27,9],[26,8,26,9],[25,0,25,13],[10,0,10,1],[20,2,20,3],[20,4,20,5],[20,0,20,1],[21,0,24,1],[21,2,24,3],[21,4,24,5],[11,0,11,1],[11,2,11,3],[11,4,11,5],[8,4,8,5],[8,6,8,7],[8,8,8,9],[9,0,9,1],[8,0,8,1],[8,2,8,3],[1,2,1,7],[5,3,5,8],[7,0,7,1],[7,2,7,3],[7,4,7,5],[7,6,7,7],[7,8,7,9],[2,2,2,7],[3,2,3,7],[4,0,4,1],[0,0,3,1],[11,8,11,9],[1,10,1,11],[1,12,1,13],[2,10,2,11],[2,12,2,13],[3,10,3,11],[3,12,3,13],[7,10,7,11],[7,12,7,13],[11,12,11,13],[8,10,8,11],[8,12,8,13],[11,10,11,11],[0,8,3,9],[39,12,39,13],[30,12,30,13],[30,8,30,9],[30,10,30,11],[39,8,39,9],[40,12,43,13],[40,0,43,1],[40,2,43,3],[40,4,43,5],[40,6,43,7],[40,8,43,9],[39,0,39,1],[39,2,39,3],[39,4,39,5],[39,6,39,7],[40,10,43,11],[39,10,39,11],[11,6,11,7],[28,0,28,1],[29,0,29,1],[30,0,30,1],[30,2,30,3],[30,4,30,5],[30,6,30,7],[26,0,26,1],[27,0,27,1],[20,6,20,7],[26,2,26,3],[26,4,26,5],[26,6,26,7],[27,4,27,5],[27,2,27,3]]}
[]
[null,null,"COMMONWEALTH OF PENNSYLVANIA",null,null,null,null,null,null,null,"DISTRICT",null,{"$f":"IF(ISBLANK('S1'!L2),\"\",'S1'!L2)","v":""}]
[null,null,"DEPARTMENT OF TRANSPORTATION",null,null,null,null,null,null,null,"PLANT CODE",null,{"$f":"IF(ISBLANK('S1'!L3),\"\",'S1'!L3)","v":""}]
[null,null,"PENNSYLVANIA TURNPIKE COMMISSION",null,null,null,null,null,null,null,"AGG SIZE",null,{"$f":"IF(ISBLANK('S1'!L4),\"\",'S1'!L4)","v":"Type AS4"}]
[{"$f":"'S1'!A5","v":"Aggregate 2023"}]
[null,null,null,{"$f":"'S1'!D6","v":"Material Test Results for Type AS4"}]
[]
["Sample No."]
["Date"]
[{"$f":"IF($M$4=\"Type AS3\",\"Starting Wt.\",\"St. Wt. Before Wash.\")","v":"St. Wt. Before Wash."},null,null,"% Loss",null,"% Loss",null,"% Loss",null,"% Loss",null,"% Loss",null,"% Loss"]
[{"$f":"IF($M$4=\"Type AS3\",\"Ending Wt.\",\"Dry. Wt. After Wash.\")","v":"Dry. Wt. After Wash."},null,null,{"$f":"IF(ISBLANK(C10),\" \",IF(ISBLANK(C15),\" \",IF($M$4=\"Type AS3\",(C10-C11)/C10*100,(C11-C46)/C11*100)))","v":" "},null,{"$f":"IF(ISBLANK(E10),\" \",IF(ISBLANK(E15),\" \",IF($M$4=\"Type AS3\",(E10-E11)/E10*100,(E11-E46)/E11*100)))","v":" "},null,{"$f":"IF(ISBLANK(G10),\" \",IF(ISBLANK(G15),\" \",IF($M$4=\"Type AS3\",(G10-G11)/G10*100,(G11-G46)/G11*100)))","v":" "},null,{"$f":"IF(ISBLANK(I10),\" \",IF(ISBLANK(I15),\" \",IF($M$4=\"Type AS3\",(I10-I11)/I10*100,(I11-I46)/I11*100)))","v":" "},null,{"$f":"IF(ISBLANK(K10),\" \",IF(ISBLANK(K15),\" \",IF($M$4=\"Type AS3\",(K10-K11)/K10*100,(K11-K46)/K11*100)))","v":" "},null,{"$f":"IF(ISBLANK(M10),\" \",IF(ISBLANK(M15),\" \",IF($M$4=\"Type AS3\",(M10-M11)/M10*100,(M11-M46)/M11*100)))","v":" "}]
["Wt. Loss",null,{"$f":"IF($M$4=\"Type AS3\",0,IF(ISBLANK(C10),\" \",IF(ISBLANK(C11),\" \",C10-C11)))","v":" "},null,{"$f":"IF($M$4=\"Type AS3\",0,IF(ISBLANK(E10),\" \",IF(ISBLANK(E11),\" \",E10-E11)))","v":" "},null,{"$f":"IF($M$4=\"Type AS3\",0,IF(ISBLANK(G10),\" \",IF(ISBLANK(G11),\" \",G10-G11)))","v":" "},null,{"$f":"IF($M$4=\"Type AS3\",0,IF(ISBLANK(I10),\" \",IF(ISBLANK(I11),\" \",I10-I11)))","v":" "},null,{"$f":"IF($M$4=\"Type AS3\",0,IF(ISBLANK(K10),\" \",IF(ISBLANK(K11),\" \",K10-K11)))","v":" "},null,{"$f":"IF($M$4=\"Type AS3\",0,IF(ISBLANK(M10),\" \",IF(ISBLANK(M11),\" \",M10-M11)))","v":" "}]
["Spec","Sieve","Wt","% Passing","Wt","% Passing","Wt","% Passing","Wt","% Passing","Wt","% Passing","Wt","% Passing"]
[100,0.5,null,{"$f":"IF(ISBLANK(C$10),\"  \",IF(ISBLANK(C$11),\" \",IF(ISBLANK(C14),\" \",ROUND((C14+C$12)/C$10*100,1))))","v":"  "},null,{"$f":"IF(ISBLANK(E$10),\"  \",IF(ISBLANK(E$11),\" \",IF(ISBLANK(E14),\" \",ROUND((E14+E$12)/E$10*100,0))))","v":"  "},null,{"$f":"IF(ISBLANK(G$10),\"  \",IF(ISBLANK(G$11),\" \",IF(ISBLANK(G14),\" \",ROUND((G14+G$12)/G$10*100,1))))","v":"  "},null,{"$f":"IF(ISBLANK(I$10),\"  \",IF(ISBLANK(I$11),\" \",IF(ISBLANK(I14),\" \",ROUND((I14+I$12)/I$10*100,1))))","v":"  "},null,{"$f":"IF(ISBLANK(K$10),\"  \",IF(ISBLANK(K$11),\" \",IF(ISBLANK(K14),\" \",ROUND((K14+K$12)/K$10*100,1))))","v":"  "},null,{"$f":"IF(ISBLANK(M$10),\"  \",IF(ISBLANK(M$11),\" \",IF(ISBLANK(M14),\" \",ROUND((M14+M$12)/M$10*100,1))))","v":"  "}]
[{"$f":"IF(M$4=\"Type AS3\",\"90-100\",\"100\")","v":"100"},0.375,null,{"$f":"IF(ISBLANK(C$10),\"  \",IF(ISBLANK(C$11),\" \",IF(ISBLANK(C15),\" \",ROUND((C15+C$12)/C$10*100,1))))","v":"  "},null,"  ",null,{"$f":"IF(ISBLANK(G$10),\"  \",IF(ISBLANK(G$11),\" \",IF(ISBLANK(G15),\" \",ROUND((G15+G$12)/G$10*100,1))))","v":"  "},null,{"$f":"IF(ISBLANK(I$10),\"  \",IF(ISBLANK(I$11),\" \",IF(ISBLANK(I15),\" \",ROUND((I15+I$12)/I$10*100,1))))","v":"  "},null,{"$f":"IF(ISBLANK(K$10),\"  \",IF(ISBLANK(K$11),\" \",IF(ISBLANK(K15),\" \",ROUND((K15+K$12)/K$10*100,1))))","v":"  "},null,{"$f":"IF(ISBLANK(M$10),\"  \",IF(ISBLANK(M$11),\" \",IF(ISBLANK(M15),\" \",ROUND((M15+M$12)/M$10*100,1))))","v":"  "}]
["Breaker",0.25,null,{"$f":"IF(ISBLANK(C$10),\"  \",IF(ISBLANK(C$11),\" \",IF(ISBLANK(C16),\" \",ROUND((C16+C$12)/C$10*100,0))))","v":"  "},null,"  ",null,{"$f":"IF(ISBLANK(G$10),\"  \",IF(ISBLANK(G$11),\" \",IF(ISBLANK(G16),\" \",ROUND((G16+G$12)/G$10*100,0))))","v":"  "},null,{"$f":"IF(ISBLANK(I$10),\"  \",IF(ISBLANK(I$11),\" \",IF(ISBLANK(I16),\" \",ROUND((I16+I$12)/I$10*100,0))))","v":"  "},null,{"$f":"IF(ISBLANK(K$10),\"  \",IF(ISBLANK(K$11),\" \",IF(ISBLANK(K16),\" \",ROUND((K16+K$12)/K$10*100,0))))","v":"  "},null,{"$f":"IF(ISBLANK(M$10),\"  \",IF(ISBLANK(M$11),\" \",IF(ISBLANK(M16),\" \",ROUND((M16+M$12)/M$10*100,0))))","v":"  "}]
[{"$f":"IF(M4=\"Type AS1\",Spec!B$9,IF(M4=\"Type AS2\",Spec!C$9,IF(M4=\"Type AS3\",Spec!D$9,IF(M4=\"Type AS4\",Spec!E$9))))","v":0},4,null,{"$f":"IF(ISBLANK(C$10),\"  \",IF(ISBLANK(C$11),\" \",IF(ISBLANK(C17),\" \",ROUND((C17+C$12)/C$10*100,0))))","v":"  "},null,"  ",null,{"$f":"IF(ISBLANK(G$10),\"  \",IF(ISBLANK(G$11),\" \",IF(ISBLANK(G17),\" \",ROUND((G17+G$12)/G$10*100,0))))","v":"  "},null,{"$f":"IF(ISBLANK(I$10),\"  \",IF(ISBLANK(I$11),\" \",IF(ISBLANK(I17),\" \",ROUND((I17+I$12)/I$10*100,0))))","v":"  "},null,{"$f":"IF(ISBLANK(K$10),\"  \",IF(ISBLANK(K$11),\" \",IF(ISBLANK(K17),\" \",ROUND((K17+K$12)/K$10*100,0))))","v":"  "},null,{"$f":"IF(ISBLANK(M$10),\"  \",IF(ISBLANK(M$11),\" \",IF(ISBLANK(M17),\" \",ROUND((M17+M$12)/M$10*100,0))))","v":"  "}]
[{"$f":"IF(M4=\"Type AS1\",Spec!B$10,IF(M4=\"Type AS2\",Spec!C$10,IF(M4=\"Type AS3\",Spec!D$10,IF(M4=\"Type AS4\",Spec!E$10))))","v":"0-30"},8,null,{"$f":"IF(ISBLANK(C$10),\"  \",IF(ISBLANK(C$11),\" \",IF(ISBLANK(C18),\" \",ROUND((C18+C$12)/C$10*100,0))))","v":"  "},null,"  ",null,{"$f":"IF(ISBLANK(G$10),\"  \",IF(ISBLANK(G$11),\" \",IF(ISBLANK(G18),\" \",ROUND((G18+G$12)/G$10*100,0))))","v":"  "},null,{"$f":"IF(ISBLANK(I$10),\"  \",IF(ISBLANK(I$11),\" \",IF(ISBLANK(I18),\" \",ROUND((I18+I$12)/I$10*100,0))))","v":"  "},null,{"$f":"IF(ISBLANK(K$10),\"  \",IF(ISBLANK(K$11),\" \",IF(ISBLANK(K18),\" \",ROUND((K18+K$12)/K$10*100,0))))","v":"  "},null,{"$f":"IF(ISBLANK(M$10),\"  \",IF(ISBLANK(M$11),\" \",IF(ISBLANK(M18),\" \",ROUND((M18+M$12)/M$10*100,0))))","v":"  "}]
[{"$f":"IF(M4=\"Type AS1\",Spec!B$11,IF(M4=\"Type AS2\",Spec!C$11,IF(M4=\"Type AS3\",Spec!D$11,IF(M4=\"Type AS4\",Spec!E$11))))","v":"0-8"},100,null,{"$f":"IF(ISBLANK(C$10),\"  \",IF(ISBLANK(C$11),\" \",IF(ISBLANK(C19),\" \",ROUND((C19+C$12)/C$10*100,0))))","v":"  "},null,"  ",null,{"$f":"IF(ISBLANK(G$10),\"  \",IF(ISBLANK(G$11),\" \",IF(ISBLANK(G19),\" \",ROUND((G19+G$12)/G$10*100,0))))","v":"  "},null,{"$f":"IF(ISBLANK(I$10),\"  \",IF(ISBLANK(I$11),\" \",IF(ISBLANK(I19),\" \",ROUND((I19+I$12)/I$10*100,0))))","v":"  "},null,{"$f":"IF(ISBLANK(K$10),\"  \",IF(ISBLANK(K$11),\" \",IF(ISBLANK(K19),\" \",ROUND((K19+K$12)/K$10*100,0))))","v":"  "},null,{"$f":"IF(ISBLANK(M$10),\"  \",IF(ISBLANK(M$11),\" \",IF(ISBLANK(M19),\" \",ROUND((M19+M$12)/M$10*100,0))))","v":"  "}]
[{"$f":"IF(M4=\"Type AS1\",Spec!B$12,IF(M4=\"Type AS2\",Spec!C$12,IF(M4=\"Type AS3\",Spec!D$12,IF(M4=\"Type AS4\",Spec!E$12))))","v":"0-5"},200,null,{"$f":"IF(ISBLANK(C$10),\"  \",IF(ISBLANK(C$11),\" \",IF(ISBLANK(C20),\" \",ROUND((C20+C$12)/C$10*100,2))))","v":"  "},null,{"$f":"IF(ISBLANK(E$10),\"  \",IF(ISBLANK(E$11),\" \",IF(ISBLANK(E20),\" \",ROUND((E20+E$12)/E$10*100,2))))","v":"  "},null,{"$f":"IF(ISBLANK(G$10),\"  \",IF(ISBLANK(G$11),\" \",IF(ISBLANK(G20),\" \",ROUND((G20+G$12)/G$10*100,2))))","v":"  "},null,{"$f":"IF(ISBLANK(I$10),\"  \",IF(ISBLANK(I$11),\" \",IF(ISBLANK(I20),\" \",ROUND((I20+I$12)/I$10*100,2))))","v":"  "},null,{"$f":"IF(ISBLANK(K$10),\"  \",IF(ISBLANK(K$11),\" \",IF(ISBLANK(K20),\" \",ROUND((K20+K$12)/K$10*100,2))))","v":"  "},null,{"$f":"IF(ISBLANK(M$10),\"  \",IF(ISBLANK(M$11),\" \",IF(ISBLANK(M20),\" \",ROUND((M20+M$12)/M$10*100,2))))","v":"  "}]
["Tested By"]
["Remarks"]
[]
[]
[]
[{"$f":"'S1'!A26","v":""}]
["Sample No."]
["Date"]
[{"$f":"IF($M$4=\"Type AS3\",\"Starting Wt.\",\"St. Wt. Before Wash.\")","v":"St. Wt. Before Wash."},null,null,"% Loss",null,"% Loss",null,"% Loss",null,"% Loss",null,"% Loss",null,"% Loss"]
[{"$f":"IF($M$4=\"Type AS3\",\"Ending Wt.\",\"Dry. Wt. After Wash.\")","v":"Dry. Wt. After Wash."},null,null,{"$f":"IF(ISBLANK(C29),\" \",IF(ISBLANK(C34),\" \",IF($M$4=\"Type AS3\",(C29-C30)/C29*100,(C30-C47)/C30*100)))","v":" "},null,{"$f":"IF(ISBLANK(E29),\" \",IF(ISBLANK(E34),\" \",IF($M$4=\"Type AS3\",(E29-E30)/E29*100,(E30-E47)/E30*100)))","v":" "},null,{"$f":"IF(ISBLANK(G29),\" \",IF(ISBLANK(G34),\" \",IF($M$4=\"Type AS3\",(G29-G30)/G29*100,(G30-G47)/G30*100)))","v":" "},null,{"$f":"IF(ISBLANK(I29),\" \",IF(ISBLANK(I34),\" \",IF($M$4=\"Type AS3\",(I29-I30)/I29*100,(I30-I47)/I30*100)))","v":" "},null,{"$f":"IF(ISBLANK(K29),\" \",IF(ISBLANK(K34),\" \",IF($M$4=\"Type AS3\",(K29-K30)/K29*100,(K30-K47)/K30*100)))","v":" "},null,{"$f":"IF(ISBLANK(M29),\" \",IF(ISBLANK(M34),\" \",IF($M$4=\"Type AS3\",(M29-M30)/M29*100,(M30-M47)/M30*100)))","v":" "}]
["Wt. Loss",null,{"$f":"IF($M$4=\"Type AS3\",0,IF(ISBLANK(C29),\" \",IF(ISBLANK(C30),\" \",C29-C30)))","v":" "},null,{"$f":"IF($M$4=\"Type AS3\",0,IF(ISBLANK(E29),\" \",IF(ISBLANK(E30),\" \",E29-E30)))","v":" "},null,{"$f":"IF($M$4=\"Type AS3\",0,IF(ISBLANK(G29),\" \",IF(ISBLANK(G30),\" \",G29-G30)))","v":" "},null,{"$f":"IF($M$4=\"Type AS3\",0,IF(ISBLANK(I29),\" \",IF(ISBLANK(I30),\" \",I29-I30)))","v":" "},null,{"$f":"IF($M$4=\"Type AS3\",0,IF(ISBLANK(K29),\" \",IF(ISBLANK(K30),\" \",K29-K30)))","v":" "},null,{"$f":"IF($M$4=\"Type AS3\",0,IF(ISBLANK(M29),\" \",IF(ISBLANK(M30),\" \",M29-M30)))","v":" "}]
["Spec","Sieve","Wt","% Passing","Wt","% Passing","Wt","% Passing","Wt","% Passing","Wt","% Passing","Wt","% Passing"]
[100,0.5,null,{"$f":"IF(ISBLANK(C$29),\"  \",IF(ISBLANK(C$30),\" \",IF(ISBLANK(C33),\" \",ROUND((C33+C$31)/C$29*100,1))))","v":"  "},null,{"$f":"IF(ISBLANK(E$29),\"  \",IF(ISBLANK(E$30),\" \",IF(ISBLANK(E33),\" \",ROUND((E33+E$31)/E$29*100,1))))","v":"  "},null,{"$f":"IF(ISBLANK(G$29),\"  \",IF(ISBLANK(G$30),\" \",IF(ISBLANK(G33),\" \",ROUND((G33+G$31)/G$29*100,1))))","v":"  "},null,{"$f":"IF(ISBLANK(I$29),\"  \",IF(ISBLANK(I$30),\" \",IF(ISBLANK(I33),\" \",ROUND((I33+I$31)/I$29*100,1))))","v":"  "},null,{"$f":"IF(ISBLANK(K$29),\"  \",IF(ISBLANK(K$30),\" \",IF(ISBLANK(K33),\" \",ROUND((K33+K$31)/K$29*100,1))))","v":"  "},null,{"$f":"IF(ISBLANK(M$29),\"  \",IF(ISBLANK(M$30),\" \",IF(ISBLANK(M33),\" \",ROUND((M33+M$31)/M$29*100,1))))","v":"  "}]
[{"$f":"IF(M$4=\"Type AS3\",\"90-100\",\"100\")","v":"100"},0.375,null,{"$f":"IF(ISBLANK(C$29),\"  \",IF(ISBLANK(C$30),\" \",IF(ISBLANK(C34),\" \",ROUND((C34+C$31)/C$29*100,1))))","v":"  "},null,{"$f":"IF(ISBLANK(E$29),\"  \",IF(ISBLANK(E$30),\" \",IF(ISBLANK(E34),\" \",ROUND((E34+E$31)/E$29*100,1))))","v":"  "},null,{"$f":"IF(ISBLANK(G$29),\"  \",IF(ISBLANK(G$30),\" \",IF(ISBLANK(G34),\" \",ROUND((G34+G$31)/G$29*100,1))))","v":"  "},null,{"$f":"IF(ISBLANK(I$29),\"  \",IF(ISBLANK(I$30),\" \",IF(ISBLANK(I34),\" \",ROUND((I34+I$31)/I$29*100,1))))","v":"  "},null,{"$f":"IF(ISBLANK(K$29),\"  \",IF(ISBLANK(K$30),\" \",IF(ISBLANK(K34),\" \",ROUND((K34+K$31)/K$29*100,1))))","v":"  "},null,{"$f":"IF(ISBLANK(M$29),\"  \",IF(ISBLANK(M$30),\" \",IF(ISBLANK(M34),\" \",ROUND((M34+M$31)/M$29*100,1))))","v":"  "}]
["Breaker",0.25,null,{"$f":"IF(ISBLANK(C$29),\"  \",IF(ISBLANK(C$30),\" \",IF(ISBLANK(C35),\" \",ROUND((C35+C$31)/C$29*100,0))))","v":"  "},null,{"$f":"IF(ISBLANK(E$29),\"  \",IF(ISBLANK(E$30),\" \",IF(ISBLANK(E35),\" \",ROUND((E35+E$31)/E$29*100,0))))","v":"  "},null,{"$f":"IF(ISBLANK(G$29),\"  \",IF(ISBLANK(G$30),\" \",IF(ISBLANK(G35),\" \",ROUND((G35+G$31)/G$29*100,0))))","v":"  "},null,{"$f":"IF(ISBLANK(I$29),\"  \",IF(ISBLANK(I$30),\" \",IF(ISBLANK(I35),\" \",ROUND((I35+I$31)/I$29*100,0))))","v":"  "},null,{"$f":"IF(ISBLANK(K$29),\"  \",IF(ISBLANK(K$30),\" \",IF(ISBLANK(K35),\" \",ROUND((K35+K$31)/K$29*100,0))))","v":"  "},null,{"$f":"IF(ISBLANK(M$29),\"  \",IF(ISBLANK(M$30),\" \",IF(ISBLANK(M35),\" \",ROUND((M35+M$31)/M$29*100,0))))","v":"  "}]
[{"$f":"IF(M4=\"Type AS1\",Spec!B$9,IF(M4=\"Type AS2\",Spec!C$9,IF(M4=\"Type AS3\",Spec!D$9,IF(M4=\"Type AS4\",Spec!E$9))))","v":0},4,null,{"$f":"IF(ISBLANK(C$29),\"  \",IF(ISBLANK(C$30),\" \",IF(ISBLANK(C36),\" \",ROUND((C36+C$31)/C$29*100,0))))","v":"  "},null,{"$f":"IF(ISBLANK(E$29),\"  \",IF(ISBLANK(E$30),\" \",IF(ISBLANK(E36),\" \",ROUND((E36+E$31)/E$29*100,0))))","v":"  "},null,{"$f":"IF(ISBLANK(G$29),\"  \",IF(ISBLANK(G$30),\" \",IF(ISBLANK(G36),\" \",ROUND((G36+G$31)/G$29*100,0))))","v":"  "},null,{"$f":"IF(ISBLANK(I$29),\"  \",IF(ISBLANK(I$30),\" \",IF(ISBLANK(I36),\" \",ROUND((I36+I$31)/I$29*100,0))))","v":"  "},null,{"$f":"IF(ISBLANK(K$29),\"  \",IF(ISBLANK(K$30),\" \",IF(ISBLANK(K36),\" \",ROUND((K36+K$31)/K$29*100,0))))","v":"  "},null,{"$f":"IF(ISBLANK(M$29),\"  \",IF(ISBLANK(M$30),\" \",IF(ISBLANK(M36),\" \",ROUND((M36+M$31)/M$29*100,0))))","v":"  "}]
[{"$f":"IF(M4=\"Type AS1\",Spec!B$10,IF(M4=\"Type AS2\",Spec!C$10,IF(M4=\"Type AS3\",Spec!D$10,IF(M4=\"Type AS4\",Spec!E$10))))","v":"0-30"},8,null,{"$f":"IF(ISBLANK(C$29),\"  \",IF(ISBLANK(C$30),\" \",IF(ISBLANK(C37),\" \",ROUND((C37+C$31)/C$29*100,0))))","v":"  "},null,{"$f":"IF(ISBLANK(E$29),\"  \",IF(ISBLANK(E$30),\" \",IF(ISBLANK(E37),\" \",ROUND((E37+E$31)/E$29*100,0))))","v":"  "},null,{"$f":"IF(ISBLANK(G$29),\"  \",IF(ISBLANK(G$30),\" \",IF(ISBLANK(G37),\" \",ROUND((G37+G$31)/G$29*100,0))))","v":"  "},null,{"$f":"IF(ISBLANK(I$29),\"  \",IF(ISBLANK(I$30),\" \",IF(ISBLANK(I37),\" \",ROUND((I37+I$31)/I$29*100,0))))","v":"  "},null,{"$f":"IF(ISBLANK(K$29),\"  \",IF(ISBLANK(K$30),\" \",IF(ISBLANK(K37),\" \",ROUND((K37+K$31)/K$29*100,0))))","v":"  "},null,{"$f":"IF(ISBLANK(M$29),\"  \",IF(ISBLANK(M$30),\" \",IF(ISBLANK(M37),\" \",ROUND((M37+M$31)/M$29*100,0))))","v":"  "}]
[{"$f":"IF(M4=\"Type AS1\",Spec!B$11,IF(M4=\"Type AS2\",Spec!C$11,IF(M4=\"Type AS3\",Spec!D$11,IF(M4=\"Type AS4\",Spec!E$11))))","v":"0-8"},100,null,{"$f":"IF(ISBLANK(C$29),\"  \",IF(ISBLANK(C$30),\" \",IF(ISBLANK(C38),\" \",ROUND((C38+C$31)/C$29*100,0))))","v":"  "},null,{"$f":"IF(ISBLANK(E$29),\"  \",IF(ISBLANK(E$30),\" \",IF(ISBLANK(E38),\" \",ROUND((E38+E$31)/E$29*100,0))))","v":"  "},null,{"$f":"IF(ISBLANK(G$29),\"  \",IF(ISBLANK(G$30),\" \",IF(ISBLANK(G38),\" \",ROUND((G38+G$31)/G$29*100,0))))","v":"  "},null,{"$f":"IF(ISBLANK(I$29),\"  \",IF(ISBLANK(I$30),\" \",IF(ISBLANK(I38),\" \",ROUND((I38+I$31)/I$29*100,0))))","v":"  "},null,{"$f":"IF(ISBLANK(K$29),\"  \",IF(ISBLANK(K$30),\" \",IF(ISBLANK(K38),\" \",ROUND((K38+K$31)/K$29*100,0))))","v":"  "},null,{"$f":"IF(ISBLANK(M$29),\"  \",IF(ISBLANK(M$30),\" \",IF(ISBLANK(M38),\" \",ROUND((M38+M$31)/M$29*100,0))))","v":"  "}]
[{"$f":"IF(M4=\"Type AS1\",Spec!B$12,IF(M4=\"Type AS2\",Spec!C$12,IF(M4=\"Type AS3\",Spec!D$12,IF(M4=\"Type AS4\",Spec!E$12))))","v":"0-5"},200,null,{"$f":"IF(ISBLANK(C$29),\"  \",IF(ISBLANK(C$30),\" \",IF(ISBLANK(C39),\" \",ROUND((C39+C$31)/C$29*100,2))))","v":"  "},null,{"$f":"IF(ISBLANK(E$29),\"  \",IF(ISBLANK(E$30),\" \",IF(ISBLANK(E39),\" \",ROUND((E39+E$31)/E$29*100,2))))","v":"  "},null,{"$f":"IF(ISBLANK(G$29),\"  \",IF(ISBLANK(G$30),\" \",IF(ISBLANK(G39),\" \",ROUND((G39+G$31)/G$29*100,2))))","v":"  "},null,{"$f":"IF(ISBLANK(I$29),\"  \",IF(ISBLANK(I$30),\" \",IF(ISBLANK(I39),\" \",ROUND((I39+I$31)/I$29*100,2))))","v":"  "},null,{"$f":"IF(ISBLANK(K$29),\"  \",IF(ISBLANK(K$30),\" \",IF(ISBLANK(K39),\" \",ROUND((K39+K$31)/K$29*100,2))))","v":"  "},null,{"$f":"IF(ISBLANK(M$29),\"  \",IF(ISBLANK(M$30),\" \",IF(ISBLANK(M39),\" \",ROUND((M39+M$31)/M$29*100,2))))","v":"  "}]
["Tested By"]
["Remarks"]
[]
[]
[]
[]
[null,null,{"$f":"MAX(C14:C15)","v":0},null,{"$f":"MAX(E14:E15)","v":0},null,{"$f":"MAX(G14:G15)","v":0},null,{"$f":"MAX(I14:I15)","v":0},null,{"$f":"MAX(K14:K15)","v":0},null,{"$f":"MAX(M14:M15)","v":0}]
[null,null,{"$f":"MAX(C33:C34)","v":0},null,{"$f":"MAX(E33:E34)","v":0},null,{"$f":"MAX(G33:G34)","v":0},null,{"$f":"MAX(I33:I34)","v":0},null,{"$f":"MAX(K33:K34)","v":0},null,{"$f":"MAX(M33:M34)","v":0}]

{"sheet":"S3","index":2,"n_rows":47,"n_cols":14,"rows_kept":47,"cut":false,"hidden":true,"merged":[[3,10,3,11],[3,12,3,13],[0,0,3,1],[1,10,1,11],[1,12,1,13],[2,10,2,11],[2,12,2,13],[0,8,3,9],[1,2,1,7],[2,2,2,7],[3,2,3,7],[5,3,5,8],[7,0,7,1],[7,2,7,3],[7,4,7,5],[7,6,7,7],[7,8,7,9],[10,0,10,1],[9,0,9,1],[7,10,7,11],[7,12,7,13],[8,0,8,1],[8,2,8,3],[8,4,8,5],[8,6,8,7],[8,8,8,9],[8,10,8,11],[8,12,8,13],[21,12,24,13],[26,12,26,13],[27,12,27,13],[30,2,30,3],[11,10,11,11],[11,12,11,13],[11,4,11,5],[11,6,11,7],[11,8,11,9],[20,12,20,13],[30,10,30,11],[21,6,24,7],[27,2,27,3],[20,2,20,3],[26,2,26,3],[20,10,20,11],[28,0,28,1],[26,0,26,1],[27,0,27,1],[26,10,26,11],[21,0,24,1],[21,2,24,3],[21,4,24,5],[27,4,27,5],[27,6,27,7],[26,4,26,5],[26,6,26,7],[26,8,26,9],[39,6,39,7],[39,8,39,9],[11,0,11,1],[11,2,11,3],[21,8,24,9],[20,0,20,1],[39,0,39,1],[20,4,20,5],[20,6,20,7],[20,8,20,9],[30,0,30,1],[25,0,25,13],[21,10,24,11],[27,8,27,9],[27,10,27,11],[29,0,29,1],[4,0,4,1],[39,2,39,3],[30,12,30,13],[39,12,39,13],[40,0,43,1],[40,2,43,3],[40,4,43,5],[40,6,43,7],[40,8,43,9],[40,10,43,11],[40,12,43,13],[30,4,30,5],[30,6,30,7],[30,8,30,9],[39,10,39,11],[39,4,39,5]]}
[]
[null,null,"COMMONWEALTH OF PENNSYLVANIA",null,null,null,null,null,null,null,"DISTRICT",null,{"$f":"IF(ISBLANK('S1'!L2),\"\",'S1'!L2)","v":""}]
[null,null,"DEPARTMENT OF TRANSPORTATION",null,null,null,null,null,null,null,"PLANT CODE",null,{"$f":"IF(ISBLANK('S1'!L3),\"\",'S1'!L3)","v":""}]
[null,null,"PENNSYLVANIA TURNPIKE COMMISSION",null,null,null,null,null,null,null,"AGG SIZE",null,{"$f":"IF(ISBLANK('S1'!L4),\"\",'S1'!L4)","v":"Type AS4"}]
[{"$f":"'S1'!A5","v":"Aggregate 2023"}]
[null,null,null,{"$f":"'S1'!D6","v":"Material Test Results for Type AS4"}]
[]
["Sample No."]
["Date"]
[{"$f":"IF($M$4=\"Type AS3\",\"Starting Wt.\",\"St. Wt. Before Wash.\")","v":"St. Wt. Before Wash."},null,null,"% Loss",null,"% Loss",null,"% Loss",null,"% Loss",null,"% Loss",null,"% Loss"]
[{"$f":"IF($M$4=\"Type AS3\",\"Ending Wt.\",\"Dry. Wt. After Wash.\")","v":"Dry. Wt. After Wash."},null,null,{"$f":"IF(ISBLANK(C10),\" \",IF(ISBLANK(C15),\" \",IF($M$4=\"Type AS3\",(C10-C11)/C10*100,(C11-C46)/C11*100)))","v":" "},null,{"$f":"IF(ISBLANK(E10),\" \",IF(ISBLANK(E15),\" \",IF($M$4=\"Type AS3\",(E10-E11)/E10*100,(E11-E46)/E11*100)))","v":" "},null,{"$f":"IF(ISBLANK(G10),\" \",IF(ISBLANK(G15),\" \",IF($M$4=\"Type AS3\",(G10-G11)/G10*100,(G11-G46)/G11*100)))","v":" "},null,{"$f":"IF(ISBLANK(I10),\" \",IF(ISBLANK(I15),\" \",IF($M$4=\"Type AS3\",(I10-I11)/I10*100,(I11-I46)/I11*100)))","v":" "},null,{"$f":"IF(ISBLANK(K10),\" \",IF(ISBLANK(K15),\" \",IF($M$4=\"Type AS3\",(K10-K11)/K10*100,(K11-K46)/K11*100)))","v":" "},null,{"$f":"IF(ISBLANK(M10),\" \",IF(ISBLANK(M15),\" \",IF($M$4=\"Type AS3\",(M10-M11)/M10*100,(M11-M46)/M11*100)))","v":" "}]
["Wt. Loss",null,{"$f":"IF($M$4=\"Type AS3\",0,IF(ISBLANK(C10),\" \",IF(ISBLANK(C11),\" \",C10-C11)))","v":" "},null,{"$f":"IF($M$4=\"Type AS3\",0,IF(ISBLANK(E10),\" \",IF(ISBLANK(E11),\" \",E10-E11)))","v":" "},null,{"$f":"IF($M$4=\"Type AS3\",0,IF(ISBLANK(G10),\" \",IF(ISBLANK(G11),\" \",G10-G11)))","v":" "},null,{"$f":"IF($M$4=\"Type AS3\",0,IF(ISBLANK(I10),\" \",IF(ISBLANK(I11),\" \",I10-I11)))","v":" "},null,{"$f":"IF($M$4=\"Type AS3\",0,IF(ISBLANK(K10),\" \",IF(ISBLANK(K11),\" \",K10-K11)))","v":" "},null,{"$f":"IF($M$4=\"Type AS3\",0,IF(ISBLANK(M10),\" \",IF(ISBLANK(M11),\" \",M10-M11)))","v":" "}]
["Spec","Sieve","Wt","% Passing","Wt","% Passing","Wt","% Passing","Wt","% Passing","Wt","% Passing","Wt","% Passing"]
[100,0.5,null,{"$f":"IF(ISBLANK(C$10),\"  \",IF(ISBLANK(C$11),\" \",IF(ISBLANK(C14),\" \",ROUND((C14+C$12)/C$10*100,1))))","v":"  "},null,{"$f":"IF(ISBLANK(E$10),\"  \",IF(ISBLANK(E$11),\" \",IF(ISBLANK(E14),\" \",ROUND((E14+E$12)/E$10*100,0))))","v":"  "},null,{"$f":"IF(ISBLANK(G$10),\"  \",IF(ISBLANK(G$11),\" \",IF(ISBLANK(G14),\" \",ROUND((G14+G$12)/G$10*100,1))))","v":"  "},null,{"$f":"IF(ISBLANK(I$10),\"  \",IF(ISBLANK(I$11),\" \",IF(ISBLANK(I14),\" \",ROUND((I14+I$12)/I$10*100,1))))","v":"  "},null,{"$f":"IF(ISBLANK(K$10),\"  \",IF(ISBLANK(K$11),\" \",IF(ISBLANK(K14),\" \",ROUND((K14+K$12)/K$10*100,1))))","v":"  "},null,{"$f":"IF(ISBLANK(M$10),\"  \",IF(ISBLANK(M$11),\" \",IF(ISBLANK(M14),\" \",ROUND((M14+M$12)/M$10*100,1))))","v":"  "}]
[{"$f":"IF(M$4=\"Type AS3\",\"90-100\",\"100\")","v":"100"},0.375,null,{"$f":"IF(ISBLANK(C$10),\"  \",IF(ISBLANK(C$11),\" \",IF(ISBLANK(C15),\" \",ROUND((C15+C$12)/C$10*100,1))))","v":"  "},null,"  ",null,{"$f":"IF(ISBLANK(G$10),\"  \",IF(ISBLANK(G$11),\" \",IF(ISBLANK(G15),\" \",ROUND((G15+G$12)/G$10*100,1))))","v":"  "},null,{"$f":"IF(ISBLANK(I$10),\"  \",IF(ISBLANK(I$11),\" \",IF(ISBLANK(I15),\" \",ROUND((I15+I$12)/I$10*100,1))))","v":"  "},null,{"$f":"IF(ISBLANK(K$10),\"  \",IF(ISBLANK(K$11),\" \",IF(ISBLANK(K15),\" \",ROUND((K15+K$12)/K$10*100,1))))","v":"  "},null,{"$f":"IF(ISBLANK(M$10),\"  \",IF(ISBLANK(M$11),\" \",IF(ISBLANK(M15),\" \",ROUND((M15+M$12)/M$10*100,1))))","v":"  "}]
["Breaker",0.25,null,{"$f":"IF(ISBLANK(C$10),\"  \",IF(ISBLANK(C$11),\" \",IF(ISBLANK(C16),\" \",ROUND((C16+C$12)/C$10*100,0))))","v":"  "},null,"  ",null,{"$f":"IF(ISBLANK(G$10),\"  \",IF(ISBLANK(G$11),\" \",IF(ISBLANK(G16),\" \",ROUND((G16+G$12)/G$10*100,0))))","v":"  "},null,{"$f":"IF(ISBLANK(I$10),\"  \",IF(ISBLANK(I$11),\" \",IF(ISBLANK(I16),\" \",ROUND((I16+I$12)/I$10*100,0))))","v":"  "},null,{"$f":"IF(ISBLANK(K$10),\"  \",IF(ISBLANK(K$11),\" \",IF(ISBLANK(K16),\" \",ROUND((K16+K$12)/K$10*100,0))))","v":"  "},null,{"$f":"IF(ISBLANK(M$10),\"  \",IF(ISBLANK(M$11),\" \",IF(ISBLANK(M16),\" \",ROUND((M16+M$12)/M$10*100,0))))","v":"  "}]
[{"$f":"IF(M4=\"Type AS1\",Spec!B$9,IF(M4=\"Type AS2\",Spec!C$9,IF(M4=\"Type AS3\",Spec!D$9,IF(M4=\"Type AS4\",Spec!E$9))))","v":0},4,null,{"$f":"IF(ISBLANK(C$10),\"  \",IF(ISBLANK(C$11),\" \",IF(ISBLANK(C17),\" \",ROUND((C17+C$12)/C$10*100,0))))","v":"  "},null,"  ",null,{"$f":"IF(ISBLANK(G$10),\"  \",IF(ISBLANK(G$11),\" \",IF(ISBLANK(G17),\" \",ROUND((G17+G$12)/G$10*100,0))))","v":"  "},null,{"$f":"IF(ISBLANK(I$10),\"  \",IF(ISBLANK(I$11),\" \",IF(ISBLANK(I17),\" \",ROUND((I17+I$12)/I$10*100,0))))","v":"  "},null,{"$f":"IF(ISBLANK(K$10),\"  \",IF(ISBLANK(K$11),\" \",IF(ISBLANK(K17),\" \",ROUND((K17+K$12)/K$10*100,0))))","v":"  "},null,{"$f":"IF(ISBLANK(M$10),\"  \",IF(ISBLANK(M$11),\" \",IF(ISBLANK(M17),\" \",ROUND((M17+M$12)/M$10*100,0))))","v":"  "}]
[{"$f":"IF(M4=\"Type AS1\",Spec!B$10,IF(M4=\"Type AS2\",Spec!C$10,IF(M4=\"Type AS3\",Spec!D$10,IF(M4=\"Type AS4\",Spec!E$10))))","v":"0-30"},8,null,{"$f":"IF(ISBLANK(C$10),\"  \",IF(ISBLANK(C$11),\" \",IF(ISBLANK(C18),\" \",ROUND((C18+C$12)/C$10*100,0))))","v":"  "},null,"  ",null,{"$f":"IF(ISBLANK(G$10),\"  \",IF(ISBLANK(G$11),\" \",IF(ISBLANK(G18),\" \",ROUND((G18+G$12)/G$10*100,0))))","v":"  "},null,{"$f":"IF(ISBLANK(I$10),\"  \",IF(ISBLANK(I$11),\" \",IF(ISBLANK(I18),\" \",ROUND((I18+I$12)/I$10*100,0))))","v":"  "},null,{"$f":"IF(ISBLANK(K$10),\"  \",IF(ISBLANK(K$11),\" \",IF(ISBLANK(K18),\" \",ROUND((K18+K$12)/K$10*100,0))))","v":"  "},null,{"$f":"IF(ISBLANK(M$10),\"  \",IF(ISBLANK(M$11),\" \",IF(ISBLANK(M18),\" \",ROUND((M18+M$12)/M$10*100,0))))","v":"  "}]
[{"$f":"IF(M4=\"Type AS1\",Spec!B$11,IF(M4=\"Type AS2\",Spec!C$11,IF(M4=\"Type AS3\",Spec!D$11,IF(M4=\"Type AS4\",Spec!E$11))))","v":"0-8"},100,null,{"$f":"IF(ISBLANK(C$10),\"  \",IF(ISBLANK(C$11),\" \",IF(ISBLANK(C19),\" \",ROUND((C19+C$12)/C$10*100,0))))","v":"  "},null,"  ",null,{"$f":"IF(ISBLANK(G$10),\"  \",IF(ISBLANK(G$11),\" \",IF(ISBLANK(G19),\" \",ROUND((G19+G$12)/G$10*100,0))))","v":"  "},null,{"$f":"IF(ISBLANK(I$10),\"  \",IF(ISBLANK(I$11),\" \",IF(ISBLANK(I19),\" \",ROUND((I19+I$12)/I$10*100,0))))","v":"  "},null,{"$f":"IF(ISBLANK(K$10),\"  \",IF(ISBLANK(K$11),\" \",IF(ISBLANK(K19),\" \",ROUND((K19+K$12)/K$10*100,0))))","v":"  "},null,{"$f":"IF(ISBLANK(M$10),\"  \",IF(ISBLANK(M$11),\" \",IF(ISBLANK(M19),\" \",ROUND((M19+M$12)/M$10*100,0))))","v":"  "}]
[{"$f":"IF(M4=\"Type AS1\",Spec!B$12,IF(M4=\"Type AS2\",Spec!C$12,IF(M4=\"Type AS3\",Spec!D$12,IF(M4=\"Type AS4\",Spec!E$12))))","v":"0-5"},200,null,{"$f":"IF(ISBLANK(C$10),\"  \",IF(ISBLANK(C$11),\" \",IF(ISBLANK(C20),\" \",ROUND((C20+C$12)/C$10*100,2))))","v":"  "},null,{"$f":"IF(ISBLANK(E$10),\"  \",IF(ISBLANK(E$11),\" \",IF(ISBLANK(E20),\" \",ROUND((E20+E$12)/E$10*100,2))))","v":"  "},null,{"$f":"IF(ISBLANK(G$10),\"  \",IF(ISBLANK(G$11),\" \",IF(ISBLANK(G20),\" \",ROUND((G20+G$12)/G$10*100,2))))","v":"  "},null,{"$f":"IF(ISBLANK(I$10),\"  \",IF(ISBLANK(I$11),\" \",IF(ISBLANK(I20),\" \",ROUND((I20+I$12)/I$10*100,2))))","v":"  "},null,{"$f":"IF(ISBLANK(K$10),\"  \",IF(ISBLANK(K$11),\" \",IF(ISBLANK(K20),\" \",ROUND((K20+K$12)/K$10*100,2))))","v":"  "},null,{"$f":"IF(ISBLANK(M$10),\"  \",IF(ISBLANK(M$11),\" \",IF(ISBLANK(M20),\" \",ROUND((M20+M$12)/M$10*100,2))))","v":"  "}]
["Tested By"]
["Remarks"]
[]
[]
[]
[{"$f":"'S1'!A26","v":""}]
["Sample No."]
["Date"]
[{"$f":"IF($M$4=\"Type AS3\",\"Starting Wt.\",\"St. Wt. Before Wash.\")","v":"St. Wt. Before Wash."},null,null,"% Loss",null,"% Loss",null,"% Loss",null,"% Loss",null,"% Loss",null,"% Loss"]
[{"$f":"IF($M$4=\"Type AS3\",\"Ending Wt.\",\"Dry. Wt. After Wash.\")","v":"Dry. Wt. After Wash."},null,null,{"$f":"IF(ISBLANK(C29),\" \",IF(ISBLANK(C34),\" \",IF($M$4=\"Type AS3\",(C29-C30)/C29*100,(C30-C47)/C30*100)))","v":" "},null,{"$f":"IF(ISBLANK(E29),\" \",IF(ISBLANK(E34),\" \",IF($M$4=\"Type AS3\",(E29-E30)/E29*100,(E30-E47)/E30*100)))","v":" "},null,{"$f":"IF(ISBLANK(G29),\" \",IF(ISBLANK(G34),\" \",IF($M$4=\"Type AS3\",(G29-G30)/G29*100,(G30-G47)/G30*100)))","v":" "},null,{"$f":"IF(ISBLANK(I29),\" \",IF(ISBLANK(I34),\" \",IF($M$4=\"Type AS3\",(I29-I30)/I29*100,(I30-I47)/I30*100)))","v":" "},null,{"$f":"IF(ISBLANK(K29),\" \",IF(ISBLANK(K34),\" \",IF($M$4=\"Type AS3\",(K29-K30)/K29*100,(K30-K47)/K30*100)))","v":" "},null,{"$f":"IF(ISBLANK(M29),\" \",IF(ISBLANK(M34),\" \",IF($M$4=\"Type AS3\",(M29-M30)/M29*100,(M30-M47)/M30*100)))","v":" "}]
["Wt. Loss",null,{"$f":"IF($M$4=\"Type AS3\",0,IF(ISBLANK(C29),\" \",IF(ISBLANK(C30),\" \",C29-C30)))","v":" "},null,{"$f":"IF($M$4=\"Type AS3\",0,IF(ISBLANK(E29),\" \",IF(ISBLANK(E30),\" \",E29-E30)))","v":" "},null,{"$f":"IF($M$4=\"Type AS3\",0,IF(ISBLANK(G29),\" \",IF(ISBLANK(G30),\" \",G29-G30)))","v":" "},null,{"$f":"IF($M$4=\"Type AS3\",0,IF(ISBLANK(I29),\" \",IF(ISBLANK(I30),\" \",I29-I30)))","v":" "},null,{"$f":"IF($M$4=\"Type AS3\",0,IF(ISBLANK(K29),\" \",IF(ISBLANK(K30),\" \",K29-K30)))","v":" "},null,{"$f":"IF($M$4=\"Type AS3\",0,IF(ISBLANK(M29),\" \",IF(ISBLANK(M30),\" \",M29-M30)))","v":" "}]
["Spec","Sieve","Wt","% Passing","Wt","% Passing","Wt","% Passing","Wt","% Passing","Wt","% Passing","Wt","% Passing"]
[100,0.5,null,{"$f":"IF(ISBLANK(C$29),\"  \",IF(ISBLANK(C$30),\" \",IF(ISBLANK(C33),\" \",ROUND((C33+C$31)/C$29*100,1))))","v":"  "},null,{"$f":"IF(ISBLANK(E$29),\"  \",IF(ISBLANK(E$30),\" \",IF(ISBLANK(E33),\" \",ROUND((E33+E$31)/E$29*100,1))))","v":"  "},null,{"$f":"IF(ISBLANK(G$29),\"  \",IF(ISBLANK(G$30),\" \",IF(ISBLANK(G33),\" \",ROUND((G33+G$31)/G$29*100,1))))","v":"  "},null,{"$f":"IF(ISBLANK(I$29),\"  \",IF(ISBLANK(I$30),\" \",IF(ISBLANK(I33),\" \",ROUND((I33+I$31)/I$29*100,1))))","v":"  "},null,{"$f":"IF(ISBLANK(K$29),\"  \",IF(ISBLANK(K$30),\" \",IF(ISBLANK(K33),\" \",ROUND((K33+K$31)/K$29*100,1))))","v":"  "},null,{"$f":"IF(ISBLANK(M$29),\"  \",IF(ISBLANK(M$30),\" \",IF(ISBLANK(M33),\" \",ROUND((M33+M$31)/M$29*100,1))))","v":"  "}]
[{"$f":"IF(M$4=\"Type AS3\",\"90-100\",\"100\")","v":"100"},0.375,null,{"$f":"IF(ISBLANK(C$29),\"  \",IF(ISBLANK(C$30),\" \",IF(ISBLANK(C34),\" \",ROUND((C34+C$31)/C$29*100,1))))","v":"  "},null,{"$f":"IF(ISBLANK(E$29),\"  \",IF(ISBLANK(E$30),\" \",IF(ISBLANK(E34),\" \",ROUND((E34+E$31)/E$29*100,1))))","v":"  "},null,{"$f":"IF(ISBLANK(G$29),\"  \",IF(ISBLANK(G$30),\" \",IF(ISBLANK(G34),\" \",ROUND((G34+G$31)/G$29*100,1))))","v":"  "},null,{"$f":"IF(ISBLANK(I$29),\"  \",IF(ISBLANK(I$30),\" \",IF(ISBLANK(I34),\" \",ROUND((I34+I$31)/I$29*100,1))))","v":"  "},null,{"$f":"IF(ISBLANK(K$29),\"  \",IF(ISBLANK(K$30),\" \",IF(ISBLANK(K34),\" \",ROUND((K34+K$31)/K$29*100,1))))","v":"  "},null,{"$f":"IF(ISBLANK(M$29),\"  \",IF(ISBLANK(M$30),\" \",IF(ISBLANK(M34),\" \",ROUND((M34+M$31)/M$29*100,1))))","v":"  "}]
["Breaker",0.25,null,{"$f":"IF(ISBLANK(C$29),\"  \",IF(ISBLANK(C$30),\" \",IF(ISBLANK(C35),\" \",ROUND((C35+C$31)/C$29*100,0))))","v":"  "},null,{"$f":"IF(ISBLANK(E$29),\"  \",IF(ISBLANK(E$30),\" \",IF(ISBLANK(E35),\" \",ROUND((E35+E$31)/E$29*100,0))))","v":"  "},null,{"$f":"IF(ISBLANK(G$29),\"  \",IF(ISBLANK(G$30),\" \",IF(ISBLANK(G35),\" \",ROUND((G35+G$31)/G$29*100,0))))","v":"  "},null,{"$f":"IF(ISBLANK(I$29),\"  \",IF(ISBLANK(I$30),\" \",IF(ISBLANK(I35),\" \",ROUND((I35+I$31)/I$29*100,0))))","v":"  "},null,{"$f":"IF(ISBLANK(K$29),\"  \",IF(ISBLANK(K$30),\" \",IF(ISBLANK(K35),\" \",ROUND((K35+K$31)/K$29*100,0))))","v":"  "},null,{"$f":"IF(ISBLANK(M$29),\"  \",IF(ISBLANK(M$30),\" \",IF(ISBLANK(M35),\" \",ROUND((M35+M$31)/M$29*100,0))))","v":"  "}]
[{"$f":"IF(M4=\"Type AS1\",Spec!B$9,IF(M4=\"Type AS2\",Spec!C$9,IF(M4=\"Type AS3\",Spec!D$9,IF(M4=\"Type AS4\",Spec!E$9))))","v":0},4,null,{"$f":"IF(ISBLANK(C$29),\"  \",IF(ISBLANK(C$30),\" \",IF(ISBLANK(C36),\" \",ROUND((C36+C$31)/C$29*100,0))))","v":"  "},null,{"$f":"IF(ISBLANK(E$29),\"  \",IF(ISBLANK(E$30),\" \",IF(ISBLANK(E36),\" \",ROUND((E36+E$31)/E$29*100,0))))","v":"  "},null,{"$f":"IF(ISBLANK(G$29),\"  \",IF(ISBLANK(G$30),\" \",IF(ISBLANK(G36),\" \",ROUND((G36+G$31)/G$29*100,0))))","v":"  "},null,{"$f":"IF(ISBLANK(I$29),\"  \",IF(ISBLANK(I$30),\" \",IF(ISBLANK(I36),\" \",ROUND((I36+I$31)/I$29*100,0))))","v":"  "},null,{"$f":"IF(ISBLANK(K$29),\"  \",IF(ISBLANK(K$30),\" \",IF(ISBLANK(K36),\" \",ROUND((K36+K$31)/K$29*100,0))))","v":"  "},null,{"$f":"IF(ISBLANK(M$29),\"  \",IF(ISBLANK(M$30),\" \",IF(ISBLANK(M36),\" \",ROUND((M36+M$31)/M$29*100,0))))","v":"  "}]
[{"$f":"IF(M4=\"Type AS1\",Spec!B$10,IF(M4=\"Type AS2\",Spec!C$10,IF(M4=\"Type AS3\",Spec!D$10,IF(M4=\"Type AS4\",Spec!E$10))))","v":"0-30"},8,null,{"$f":"IF(ISBLANK(C$29),\"  \",IF(ISBLANK(C$30),\" \",IF(ISBLANK(C37),\" \",ROUND((C37+C$31)/C$29*100,0))))","v":"  "},null,{"$f":"IF(ISBLANK(E$29),\"  \",IF(ISBLANK(E$30),\" \",IF(ISBLANK(E37),\" \",ROUND((E37+E$31)/E$29*100,0))))","v":"  "},null,{"$f":"IF(ISBLANK(G$29),\"  \",IF(ISBLANK(G$30),\" \",IF(ISBLANK(G37),\" \",ROUND((G37+G$31)/G$29*100,0))))","v":"  "},null,{"$f":"IF(ISBLANK(I$29),\"  \",IF(ISBLANK(I$30),\" \",IF(ISBLANK(I37),\" \",ROUND((I37+I$31)/I$29*100,0))))","v":"  "},null,{"$f":"IF(ISBLANK(K$29),\"  \",IF(ISBLANK(K$30),\" \",IF(ISBLANK(K37),\" \",ROUND((K37+K$31)/K$29*100,0))))","v":"  "},null,{"$f":"IF(ISBLANK(M$29),\"  \",IF(ISBLANK(M$30),\" \",IF(ISBLANK(M37),\" \",ROUND((M37+M$31)/M$29*100,0))))","v":"  "}]
[{"$f":"IF(M4=\"Type AS1\",Spec!B$11,IF(M4=\"Type AS2\",Spec!C$11,IF(M4=\"Type AS3\",Spec!D$11,IF(M4=\"Type AS4\",Spec!E$11))))","v":"0-8"},100,null,{"$f":"IF(ISBLANK(C$29),\"  \",IF(ISBLANK(C$30),\" \",IF(ISBLANK(C38),\" \",ROUND((C38+C$31)/C$29*100,0))))","v":"  "},null,{"$f":"IF(ISBLANK(E$29),\"  \",IF(ISBLANK(E$30),\" \",IF(ISBLANK(E38),\" \",ROUND((E38+E$31)/E$29*100,0))))","v":"  "},null,{"$f":"IF(ISBLANK(G$29),\"  \",IF(ISBLANK(G$30),\" \",IF(ISBLANK(G38),\" \",ROUND((G38+G$31)/G$29*100,0))))","v":"  "},null,{"$f":"IF(ISBLANK(I$29),\"  \",IF(ISBLANK(I$30),\" \",IF(ISBLANK(I38),\" \",ROUND((I38+I$31)/I$29*100,0))))","v":"  "},null,{"$f":"IF(ISBLANK(K$29),\"  \",IF(ISBLANK(K$30),\" \",IF(ISBLANK(K38),\" \",ROUND((K38+K$31)/K$29*100,0))))","v":"  "},null,{"$f":"IF(ISBLANK(M$29),\"  \",IF(ISBLANK(M$30),\" \",IF(ISBLANK(M38),\" \",ROUND((M38+M$31)/M$29*100,0))))","v":"  "}]
[{"$f":"IF(M4=\"Type AS1\",Spec!B$12,IF(M4=\"Type AS2\",Spec!C$12,IF(M4=\"Type AS3\",Spec!D$12,IF(M4=\"Type AS4\",Spec!E$12))))","v":"0-5"},200,null,{"$f":"IF(ISBLANK(C$29),\"  \",IF(ISBLANK(C$30),\" \",IF(ISBLANK(C39),\" \",ROUND((C39+C$31)/C$29*100,2))))","v":"  "},null,{"$f":"IF(ISBLANK(E$29),\"  \",IF(ISBLANK(E$30),\" \",IF(ISBLANK(E39),\" \",ROUND((E39+E$31)/E$29*100,2))))","v":"  "},null,{"$f":"IF(ISBLANK(G$29),\"  \",IF(ISBLANK(G$30),\" \",IF(ISBLANK(G39),\" \",ROUND((G39+G$31)/G$29*100,2))))","v":"  "},null,{"$f":"IF(ISBLANK(I$29),\"  \",IF(ISBLANK(I$30),\" \",IF(ISBLANK(I39),\" \",ROUND((I39+I$31)/I$29*100,2))))","v":"  "},null,{"$f":"IF(ISBLANK(K$29),\"  \",IF(ISBLANK(K$30),\" \",IF(ISBLANK(K39),\" \",ROUND((K39+K$31)/K$29*100,2))))","v":"  "},null,{"$f":"IF(ISBLANK(M$29),\"  \",IF(ISBLANK(M$30),\" \",IF(ISBLANK(M39),\" \",ROUND((M39+M$31)/M$29*100,2))))","v":"  "}]
["Tested By"]
["Remarks"]
[]
[]
[]
[]
[null,null,{"$f":"MAX(C14:C15)","v":0},null,{"$f":"MAX(E14:E15)","v":0},null,{"$f":"MAX(G14:G15)","v":0},null,{"$f":"MAX(I14:I15)","v":0},null,{"$f":"MAX(K14:K15)","v":0},null,{"$f":"MAX(M14:M15)","v":0}]
[null,null,{"$f":"MAX(C33:C34)","v":0},null,{"$f":"MAX(E33:E34)","v":0},null,{"$f":"MAX(G33:G34)","v":0},null,{"$f":"MAX(I33:I34)","v":0},null,{"$f":"MAX(K33:K34)","v":0},null,{"$f":"MAX(M33:M34)","v":0}]

{"sheet":"S4","index":3,"n_rows":47,"n_cols":14,"rows_kept":47,"cut":false,"hidden":true,"merged":[[3,10,3,11],[3,12,3,13],[0,0,3,1],[1,10,1,11],[1,12,1,13],[2,10,2,11],[2,12,2,13],[0,8,3,9],[1,2,1,7],[2,2,2,7],[3,2,3,7],[5,3,5,8],[7,0,7,1],[7,2,7,3],[7,4,7,5],[7,6,7,7],[7,8,7,9],[10,0,10,1],[9,0,9,1],[7,10,7,11],[7,12,7,13],[8,0,8,1],[8,2,8,3],[8,4,8,5],[8,6,8,7],[8,8,8,9],[8,10,8,11],[8,12,8,13],[21,12,24,13],[26,12,26,13],[27,12,27,13],[30,2,30,3],[11,10,11,11],[11,12,11,13],[11,4,11,5],[11,6,11,7],[11,8,11,9],[20,12,20,13],[30,10,30,11],[21,6,24,7],[27,2,27,3],[20,2,20,3],[26,2,26,3],[20,10,20,11],[28,0,28,1],[26,0,26,1],[27,0,27,1],[26,10,26,11],[21,0,24,1],[21,2,24,3],[21,4,24,5],[27,4,27,5],[27,6,27,7],[26,4,26,5],[26,6,26,7],[26,8,26,9],[39,6,39,7],[39,8,39,9],[11,0,11,1],[11,2,11,3],[21,8,24,9],[20,0,20,1],[39,0,39,1],[20,4,20,5],[20,6,20,7],[20,8,20,9],[30,0,30,1],[25,0,25,13],[21,10,24,11],[27,8,27,9],[27,10,27,11],[29,0,29,1],[4,0,4,1],[39,2,39,3],[30,12,30,13],[39,12,39,13],[40,0,43,1],[40,2,43,3],[40,4,43,5],[40,6,43,7],[40,8,43,9],[40,10,43,11],[40,12,43,13],[30,4,30,5],[30,6,30,7],[30,8,30,9],[39,10,39,11],[39,4,39,5]]}
[]
[null,null,"COMMONWEALTH OF PENNSYLVANIA",null,null,null,null,null,null,null,"DISTRICT",null,{"$f":"IF(ISBLANK('S1'!L2),\"\",'S1'!L2)","v":""}]
[null,null,"DEPARTMENT OF TRANSPORTATION",null,null,null,null,null,null,null,"PLANT CODE",null,{"$f":"IF(ISBLANK('S1'!L3),\"\",'S1'!L3)","v":""}]
[null,null,"PENNSYLVANIA TURNPIKE COMMISSION",null,null,null,null,null,null,null,"AGG SIZE",null,{"$f":"IF(ISBLANK('S1'!L4),\"\",'S1'!L4)","v":"Type AS4"}]
[{"$f":"'S1'!A5","v":"Aggregate 2023"}]
[null,null,null,{"$f":"'S1'!D6","v":"Material Test Results for Type AS4"}]
[]
["Sample No."]
["Date"]
[{"$f":"IF($M$4=\"Type AS3\",\"Starting Wt.\",\"St. Wt. Before Wash.\")","v":"St. Wt. Before Wash."},null,null,"% Loss",null,"% Loss",null,"% Loss",null,"% Loss",null,"% Loss",null,"% Loss"]
[{"$f":"IF($M$4=\"Type AS3\",\"Ending Wt.\",\"Dry. Wt. After Wash.\")","v":"Dry. Wt. After Wash."},null,null,{"$f":"IF(ISBLANK(C10),\" \",IF(ISBLANK(C15),\" \",IF($M$4=\"Type AS3\",(C10-C11)/C10*100,(C11-C46)/C11*100)))","v":" "},null,{"$f":"IF(ISBLANK(E10),\" \",IF(ISBLANK(E15),\" \",IF($M$4=\"Type AS3\",(E10-E11)/E10*100,(E11-E46)/E11*100)))","v":" "},null,{"$f":"IF(ISBLANK(G10),\" \",IF(ISBLANK(G15),\" \",IF($M$4=\"Type AS3\",(G10-G11)/G10*100,(G11-G46)/G11*100)))","v":" "},null,{"$f":"IF(ISBLANK(I10),\" \",IF(ISBLANK(I15),\" \",IF($M$4=\"Type AS3\",(I10-I11)/I10*100,(I11-I46)/I11*100)))","v":" "},null,{"$f":"IF(ISBLANK(K10),\" \",IF(ISBLANK(K15),\" \",IF($M$4=\"Type AS3\",(K10-K11)/K10*100,(K11-K46)/K11*100)))","v":" "},null,{"$f":"IF(ISBLANK(M10),\" \",IF(ISBLANK(M15),\" \",IF($M$4=\"Type AS3\",(M10-M11)/M10*100,(M11-M46)/M11*100)))","v":" "}]
["Wt. Loss",null,{"$f":"IF($M$4=\"Type AS3\",0,IF(ISBLANK(C10),\" \",IF(ISBLANK(C11),\" \",C10-C11)))","v":" "},null,{"$f":"IF($M$4=\"Type AS3\",0,IF(ISBLANK(E10),\" \",IF(ISBLANK(E11),\" \",E10-E11)))","v":" "},null,{"$f":"IF($M$4=\"Type AS3\",0,IF(ISBLANK(G10),\" \",IF(ISBLANK(G11),\" \",G10-G11)))","v":" "},null,{"$f":"IF($M$4=\"Type AS3\",0,IF(ISBLANK(I10),\" \",IF(ISBLANK(I11),\" \",I10-I11)))","v":" "},null,{"$f":"IF($M$4=\"Type AS3\",0,IF(ISBLANK(K10),\" \",IF(ISBLANK(K11),\" \",K10-K11)))","v":" "},null,{"$f":"IF($M$4=\"Type AS3\",0,IF(ISBLANK(M10),\" \",IF(ISBLANK(M11),\" \",M10-M11)))","v":" "}]
["Spec","Sieve","Wt","% Passing","Wt","% Passing","Wt","% Passing","Wt","% Passing","Wt","% Passing","Wt","% Passing"]
[100,0.5,null,{"$f":"IF(ISBLANK(C$10),\"  \",IF(ISBLANK(C$11),\" \",IF(ISBLANK(C14),\" \",ROUND((C14+C$12)/C$10*100,1))))","v":"  "},null,{"$f":"IF(ISBLANK(E$10),\"  \",IF(ISBLANK(E$11),\" \",IF(ISBLANK(E14),\" \",ROUND((E14+E$12)/E$10*100,0))))","v":"  "},null,{"$f":"IF(ISBLANK(G$10),\"  \",IF(ISBLANK(G$11),\" \",IF(ISBLANK(G14),\" \",ROUND((G14+G$12)/G$10*100,1))))","v":"  "},null,{"$f":"IF(ISBLANK(I$10),\"  \",IF(ISBLANK(I$11),\" \",IF(ISBLANK(I14),\" \",ROUND((I14+I$12)/I$10*100,1))))","v":"  "},null,{"$f":"IF(ISBLANK(K$10),\"  \",IF(ISBLANK(K$11),\" \",IF(ISBLANK(K14),\" \",ROUND((K14+K$12)/K$10*100,1))))","v":"  "},null,{"$f":"IF(ISBLANK(M$10),\"  \",IF(ISBLANK(M$11),\" \",IF(ISBLANK(M14),\" \",ROUND((M14+M$12)/M$10*100,1))))","v":"  "}]
[{"$f":"IF(M$4=\"Type AS3\",\"90-100\",\"100\")","v":"100"},0.375,null,{"$f":"IF(ISBLANK(C$10),\"  \",IF(ISBLANK(C$11),\" \",IF(ISBLANK(C15),\" \",ROUND((C15+C$12)/C$10*100,1))))","v":"  "},null,"  ",null,{"$f":"IF(ISBLANK(G$10),\"  \",IF(ISBLANK(G$11),\" \",IF(ISBLANK(G15),\" \",ROUND((G15+G$12)/G$10*100,1))))","v":"  "},null,{"$f":"IF(ISBLANK(I$10),\"  \",IF(ISBLANK(I$11),\" \",IF(ISBLANK(I15),\" \",ROUND((I15+I$12)/I$10*100,1))))","v":"  "},null,{"$f":"IF(ISBLANK(K$10),\"  \",IF(ISBLANK(K$11),\" \",IF(ISBLANK(K15),\" \",ROUND((K15+K$12)/K$10*100,1))))","v":"  "},null,{"$f":"IF(ISBLANK(M$10),\"  \",IF(ISBLANK(M$11),\" \",IF(ISBLANK(M15),\" \",ROUND((M15+M$12)/M$10*100,1))))","v":"  "}]
["Breaker",0.25,null,{"$f":"IF(ISBLANK(C$10),\"  \",IF(ISBLANK(C$11),\" \",IF(ISBLANK(C16),\" \",ROUND((C16+C$12)/C$10*100,0))))","v":"  "},null,"  ",null,{"$f":"IF(ISBLANK(G$10),\"  \",IF(ISBLANK(G$11),\" \",IF(ISBLANK(G16),\" \",ROUND((G16+G$12)/G$10*100,0))))","v":"  "},null,{"$f":"IF(ISBLANK(I$10),\"  \",IF(ISBLANK(I$11),\" \",IF(ISBLANK(I16),\" \",ROUND((I16+I$12)/I$10*100,0))))","v":"  "},null,{"$f":"IF(ISBLANK(K$10),\"  \",IF(ISBLANK(K$11),\" \",IF(ISBLANK(K16),\" \",ROUND((K16+K$12)/K$10*100,0))))","v":"  "},null,{"$f":"IF(ISBLANK(M$10),\"  \",IF(ISBLANK(M$11),\" \",IF(ISBLANK(M16),\" \",ROUND((M16+M$12)/M$10*100,0))))","v":"  "}]
[{"$f":"IF(M4=\"Type AS1\",Spec!B$9,IF(M4=\"Type AS2\",Spec!C$9,IF(M4=\"Type AS3\",Spec!D$9,IF(M4=\"Type AS4\",Spec!E$9))))","v":0},4,null,{"$f":"IF(ISBLANK(C$10),\"  \",IF(ISBLANK(C$11),\" \",IF(ISBLANK(C17),\" \",ROUND((C17+C$12)/C$10*100,0))))","v":"  "},null,"  ",null,{"$f":"IF(ISBLANK(G$10),\"  \",IF(ISBLANK(G$11),\" \",IF(ISBLANK(G17),\" \",ROUND((G17+G$12)/G$10*100,0))))","v":"  "},null,{"$f":"IF(ISBLANK(I$10),\"  \",IF(ISBLANK(I$11),\" \",IF(ISBLANK(I17),\" \",ROUND((I17+I$12)/I$10*100,0))))","v":"  "},null,{"$f":"IF(ISBLANK(K$10),\"  \",IF(ISBLANK(K$11),\" \",IF(ISBLANK(K17),\" \",ROUND((K17+K$12)/K$10*100,0))))","v":"  "},null,{"$f":"IF(ISBLANK(M$10),\"  \",IF(ISBLANK(M$11),\" \",IF(ISBLANK(M17),\" \",ROUND((M17+M$12)/M$10*100,0))))","v":"  "}]
[{"$f":"IF(M4=\"Type AS1\",Spec!B$10,IF(M4=\"Type AS2\",Spec!C$10,IF(M4=\"Type AS3\",Spec!D$10,IF(M4=\"Type AS4\",Spec!E$10))))","v":"0-30"},8,null,{"$f":"IF(ISBLANK(C$10),\"  \",IF(ISBLANK(C$11),\" \",IF(ISBLANK(C18),\" \",ROUND((C18+C$12)/C$10*100,0))))","v":"  "},null,"  ",null,{"$f":"IF(ISBLANK(G$10),\"  \",IF(ISBLANK(G$11),\" \",IF(ISBLANK(G18),\" \",ROUND((G18+G$12)/G$10*100,0))))","v":"  "},null,{"$f":"IF(ISBLANK(I$10),\"  \",IF(ISBLANK(I$11),\" \",IF(ISBLANK(I18),\" \",ROUND((I18+I$12)/I$10*100,0))))","v":"  "},null,{"$f":"IF(ISBLANK(K$10),\"  \",IF(ISBLANK(K$11),\" \",IF(ISBLANK(K18),\" \",ROUND((K18+K$12)/K$10*100,0))))","v":"  "},null,{"$f":"IF(ISBLANK(M$10),\"  \",IF(ISBLANK(M$11),\" \",IF(ISBLANK(M18),\" \",ROUND((M18+M$12)/M$10*100,0))))","v":"  "}]
[{"$f":"IF(M4=\"Type AS1\",Spec!B$11,IF(M4=\"Type AS2\",Spec!C$11,IF(M4=\"Type AS3\",Spec!D$11,IF(M4=\"Type AS4\",Spec!E$11))))","v":"0-8"},100,null,{"$f":"IF(ISBLANK(C$10),\"  \",IF(ISBLANK(C$11),\" \",IF(ISBLANK(C19),\" \",ROUND((C19+C$12)/C$10*100,0))))","v":"  "},null,"  ",null,{"$f":"IF(ISBLANK(G$10),\"  \",IF(ISBLANK(G$11),\" \",IF(ISBLANK(G19),\" \",ROUND((G19+G$12)/G$10*100,0))))","v":"  "},null,{"$f":"IF(ISBLANK(I$10),\"  \",IF(ISBLANK(I$11),\" \",IF(ISBLANK(I19),\" \",ROUND((I19+I$12)/I$10*100,0))))","v":"  "},null,{"$f":"IF(ISBLANK(K$10),\"  \",IF(ISBLANK(K$11),\" \",IF(ISBLANK(K19),\" \",ROUND((K19+K$12)/K$10*100,0))))","v":"  "},null,{"$f":"IF(ISBLANK(M$10),\"  \",IF(ISBLANK(M$11),\" \",IF(ISBLANK(M19),\" \",ROUND((M19+M$12)/M$10*100,0))))","v":"  "}]
[{"$f":"IF(M4=\"Type AS1\",Spec!B$12,IF(M4=\"Type AS2\",Spec!C$12,IF(M4=\"Type AS3\",Spec!D$12,IF(M4=\"Type AS4\",Spec!E$12))))","v":"0-5"},200,null,{"$f":"IF(ISBLANK(C$10),\"  \",IF(ISBLANK(C$11),\" \",IF(ISBLANK(C20),\" \",ROUND((C20+C$12)/C$10*100,2))))","v":"  "},null,{"$f":"IF(ISBLANK(E$10),\"  \",IF(ISBLANK(E$11),\" \",IF(ISBLANK(E20),\" \",ROUND((E20+E$12)/E$10*100,2))))","v":"  "},null,{"$f":"IF(ISBLANK(G$10),\"  \",IF(ISBLANK(G$11),\" \",IF(ISBLANK(G20),\" \",ROUND((G20+G$12)/G$10*100,2))))","v":"  "},null,{"$f":"IF(ISBLANK(I$10),\"  \",IF(ISBLANK(I$11),\" \",IF(ISBLANK(I20),\" \",ROUND((I20+I$12)/I$10*100,2))))","v":"  "},null,{"$f":"IF(ISBLANK(K$10),\"  \",IF(ISBLANK(K$11),\" \",IF(ISBLANK(K20),\" \",ROUND((K20+K$12)/K$10*100,2))))","v":"  "},null,{"$f":"IF(ISBLANK(M$10),\"  \",IF(ISBLANK(M$11),\" \",IF(ISBLANK(M20),\" \",ROUND((M20+M$12)/M$10*100,2))))","v":"  "}]
["Tested By"]
["Remarks"]
[]
[]
[]
[{"$f":"'S1'!A26","v":""}]
["Sample No."]
["Date"]
[{"$f":"IF($M$4=\"Type AS3\",\"Starting Wt.\",\"St. Wt. Before Wash.\")","v":"St. Wt. Before Wash."},null,null,"% Loss",null,"% Loss",null,"% Loss",null,"% Loss",null,"% Loss",null,"% Loss"]
[{"$f":"IF($M$4=\"Type AS3\",\"Ending Wt.\",\"Dry. Wt. After Wash.\")","v":"Dry. Wt. After Wash."},null,null,{"$f":"IF(ISBLANK(C29),\" \",IF(ISBLANK(C34),\" \",IF($M$4=\"Type AS3\",(C29-C30)/C29*100,(C30-C47)/C30*100)))","v":" "},null,{"$f":"IF(ISBLANK(E29),\" \",IF(ISBLANK(E34),\" \",IF($M$4=\"Type AS3\",(E29-E30)/E29*100,(E30-E47)/E30*100)))","v":" "},null,{"$f":"IF(ISBLANK(G29),\" \",IF(ISBLANK(G34),\" \",IF($M$4=\"Type AS3\",(G29-G30)/G29*100,(G30-G47)/G30*100)))","v":" "},null,{"$f":"IF(ISBLANK(I29),\" \",IF(ISBLANK(I34),\" \",IF($M$4=\"Type AS3\",(I29-I30)/I29*100,(I30-I47)/I30*100)))","v":" "},null,{"$f":"IF(ISBLANK(K29),\" \",IF(ISBLANK(K34),\" \",IF($M$4=\"Type AS3\",(K29-K30)/K29*100,(K30-K47)/K30*100)))","v":" "},null,{"$f":"IF(ISBLANK(M29),\" \",IF(ISBLANK(M34),\" \",IF($M$4=\"Type AS3\",(M29-M30)/M29*100,(M30-M47)/M30*100)))","v":" "}]
["Wt. Loss",null,{"$f":"IF($M$4=\"Type AS3\",0,IF(ISBLANK(C29),\" \",IF(ISBLANK(C30),\" \",C29-C30)))","v":" "},null,{"$f":"IF($M$4=\"Type AS3\",0,IF(ISBLANK(E29),\" \",IF(ISBLANK(E30),\" \",E29-E30)))","v":" "},null,{"$f":"IF($M$4=\"Type AS3\",0,IF(ISBLANK(G29),\" \",IF(ISBLANK(G30),\" \",G29-G30)))","v":" "},null,{"$f":"IF($M$4=\"Type AS3\",0,IF(ISBLANK(I29),\" \",IF(ISBLANK(I30),\" \",I29-I30)))","v":" "},null,{"$f":"IF($M$4=\"Type AS3\",0,IF(ISBLANK(K29),\" \",IF(ISBLANK(K30),\" \",K29-K30)))","v":" "},null,{"$f":"IF($M$4=\"Type AS3\",0,IF(ISBLANK(M29),\" \",IF(ISBLANK(M30),\" \",M29-M30)))","v":" "}]
["Spec","Sieve","Wt","% Passing","Wt","% Passing","Wt","% Passing","Wt","% Passing","Wt","% Passing","Wt","% Passing"]
[100,0.5,null,{"$f":"IF(ISBLANK(C$29),\"  \",IF(ISBLANK(C$30),\" \",IF(ISBLANK(C33),\" \",ROUND((C33+C$31)/C$29*100,1))))","v":"  "},null,{"$f":"IF(ISBLANK(E$29),\"  \",IF(ISBLANK(E$30),\" \",IF(ISBLANK(E33),\" \",ROUND((E33+E$31)/E$29*100,1))))","v":"  "},null,{"$f":"IF(ISBLANK(G$29),\"  \",IF(ISBLANK(G$30),\" \",IF(ISBLANK(G33),\" \",ROUND((G33+G$31)/G$29*100,1))))","v":"  "},null,{"$f":"IF(ISBLANK(I$29),\"  \",IF(ISBLANK(I$30),\" \",IF(ISBLANK(I33),\" \",ROUND((I33+I$31)/I$29*100,1))))","v":"  "},null,{"$f":"IF(ISBLANK(K$29),\"  \",IF(ISBLANK(K$30),\" \",IF(ISBLANK(K33),\" \",ROUND((K33+K$31)/K$29*100,1))))","v":"  "},null,{"$f":"IF(ISBLANK(M$29),\"  \",IF(ISBLANK(M$30),\" \",IF(ISBLANK(M33),\" \",ROUND((M33+M$31)/M$29*100,1))))","v":"  "}]
[{"$f":"IF(M$4=\"Type AS3\",\"90-100\",\"100\")","v":"100"},0.375,null,{"$f":"IF(ISBLANK(C$29),\"  \",IF(ISBLANK(C$30),\" \",IF(ISBLANK(C34),\" \",ROUND((C34+C$31)/C$29*100,1))))","v":"  "},null,{"$f":"IF(ISBLANK(E$29),\"  \",IF(ISBLANK(E$30),\" \",IF(ISBLANK(E34),\" \",ROUND((E34+E$31)/E$29*100,1))))","v":"  "},null,{"$f":"IF(ISBLANK(G$29),\"  \",IF(ISBLANK(G$30),\" \",IF(ISBLANK(G34),\" \",ROUND((G34+G$31)/G$29*100,1))))","v":"  "},null,{"$f":"IF(ISBLANK(I$29),\"  \",IF(ISBLANK(I$30),\" \",IF(ISBLANK(I34),\" \",ROUND((I34+I$31)/I$29*100,1))))","v":"  "},null,{"$f":"IF(ISBLANK(K$29),\"  \",IF(ISBLANK(K$30),\" \",IF(ISBLANK(K34),\" \",ROUND((K34+K$31)/K$29*100,1))))","v":"  "},null,{"$f":"IF(ISBLANK(M$29),\"  \",IF(ISBLANK(M$30),\" \",IF(ISBLANK(M34),\" \",ROUND((M34+M$31)/M$29*100,1))))","v":"  "}]
["Breaker",0.25,null,{"$f":"IF(ISBLANK(C$29),\"  \",IF(ISBLANK(C$30),\" \",IF(ISBLANK(C35),\" \",ROUND((C35+C$31)/C$29*100,0))))","v":"  "},null,{"$f":"IF(ISBLANK(E$29),\"  \",IF(ISBLANK(E$30),\" \",IF(ISBLANK(E35),\" \",ROUND((E35+E$31)/E$29*100,0))))","v":"  "},null,{"$f":"IF(ISBLANK(G$29),\"  \",IF(ISBLANK(G$30),\" \",IF(ISBLANK(G35),\" \",ROUND((G35+G$31)/G$29*100,0))))","v":"  "},null,{"$f":"IF(ISBLANK(I$29),\"  \",IF(ISBLANK(I$30),\" \",IF(ISBLANK(I35),\" \",ROUND((I35+I$31)/I$29*100,0))))","v":"  "},null,{"$f":"IF(ISBLANK(K$29),\"  \",IF(ISBLANK(K$30),\" \",IF(ISBLANK(K35),\" \",ROUND((K35+K$31)/K$29*100,0))))","v":"  "},null,{"$f":"IF(ISBLANK(M$29),\"  \",IF(ISBLANK(M$30),\" \",IF(ISBLANK(M35),\" \",ROUND((M35+M$31)/M$29*100,0))))","v":"  "}]
[{"$f":"IF(M4=\"Type AS1\",Spec!B$9,IF(M4=\"Type AS2\",Spec!C$9,IF(M4=\"Type AS3\",Spec!D$9,IF(M4=\"Type AS4\",Spec!E$9))))","v":0},4,null,{"$f":"IF(ISBLANK(C$29),\"  \",IF(ISBLANK(C$30),\" \",IF(ISBLANK(C36),\" \",ROUND((C36+C$31)/C$29*100,0))))","v":"  "},null,{"$f":"IF(ISBLANK(E$29),\"  \",IF(ISBLANK(E$30),\" \",IF(ISBLANK(E36),\" \",ROUND((E36+E$31)/E$29*100,0))))","v":"  "},null,{"$f":"IF(ISBLANK(G$29),\"  \",IF(ISBLANK(G$30),\" \",IF(ISBLANK(G36),\" \",ROUND((G36+G$31)/G$29*100,0))))","v":"  "},null,{"$f":"IF(ISBLANK(I$29),\"  \",IF(ISBLANK(I$30),\" \",IF(ISBLANK(I36),\" \",ROUND((I36+I$31)/I$29*100,0))))","v":"  "},null,{"$f":"IF(ISBLANK(K$29),\"  \",IF(ISBLANK(K$30),\" \",IF(ISBLANK(K36),\" \",ROUND((K36+K$31)/K$29*100,0))))","v":"  "},null,{"$f":"IF(ISBLANK(M$29),\"  \",IF(ISBLANK(M$30),\" \",IF(ISBLANK(M36),\" \",ROUND((M36+M$31)/M$29*100,0))))","v":"  "}]
[{"$f":"IF(M4=\"Type AS1\",Spec!B$10,IF(M4=\"Type AS2\",Spec!C$10,IF(M4=\"Type AS3\",Spec!D$10,IF(M4=\"Type AS4\",Spec!E$10))))","v":"0-30"},8,null,{"$f":"IF(ISBLANK(C$29),\"  \",IF(ISBLANK(C$30),\" \",IF(ISBLANK(C37),\" \",ROUND((C37+C$31)/C$29*100,0))))","v":"  "},null,{"$f":"IF(ISBLANK(E$29),\"  \",IF(ISBLANK(E$30),\" \",IF(ISBLANK(E37),\" \",ROUND((E37+E$31)/E$29*100,0))))","v":"  "},null,{"$f":"IF(ISBLANK(G$29),\"  \",IF(ISBLANK(G$30),\" \",IF(ISBLANK(G37),\" \",ROUND((G37+G$31)/G$29*100,0))))","v":"  "},null,{"$f":"IF(ISBLANK(I$29),\"  \",IF(ISBLANK(I$30),\" \",IF(ISBLANK(I37),\" \",ROUND((I37+I$31)/I$29*100,0))))","v":"  "},null,{"$f":"IF(ISBLANK(K$29),\"  \",IF(ISBLANK(K$30),\" \",IF(ISBLANK(K37),\" \",ROUND((K37+K$31)/K$29*100,0))))","v":"  "},null,{"$f":"IF(ISBLANK(M$29),\"  \",IF(ISBLANK(M$30),\" \",IF(ISBLANK(M37),\" \",ROUND((M37+M$31)/M$29*100,0))))","v":"  "}]
[{"$f":"IF(M4=\"Type AS1\",Spec!B$11,IF(M4=\"Type AS2\",Spec!C$11,IF(M4=\"Type AS3\",Spec!D$11,IF(M4=\"Type AS4\",Spec!E$11))))","v":"0-8"},100,null,{"$f":"IF(ISBLANK(C$29),\"  \",IF(ISBLANK(C$30),\" \",IF(ISBLANK(C38),\" \",ROUND((C38+C$31)/C$29*100,0))))","v":"  "},null,{"$f":"IF(ISBLANK(E$29),\"  \",IF(ISBLANK(E$30),\" \",IF(ISBLANK(E38),\" \",ROUND((E38+E$31)/E$29*100,0))))","v":"  "},null,{"$f":"IF(ISBLANK(G$29),\"  \",IF(ISBLANK(G$30),\" \",IF(ISBLANK(G38),\" \",ROUND((G38+G$31)/G$29*100,0))))","v":"  "},null,{"$f":"IF(ISBLANK(I$29),\"  \",IF(ISBLANK(I$30),\" \",IF(ISBLANK(I38),\" \",ROUND((I38+I$31)/I$29*100,0))))","v":"  "},null,{"$f":"IF(ISBLANK(K$29),\"  \",IF(ISBLANK(K$30),\" \",IF(ISBLANK(K38),\" \",ROUND((K38+K$31)/K$29*100,0))))","v":"  "},null,{"$f":"IF(ISBLANK(M$29),\"  \",IF(ISBLANK(M$30),\" \",IF(ISBLANK(M38),\" \",ROUND((M38+M$31)/M$29*100,0))))","v":"  "}]
[{"$f":"IF(M4=\"Type AS1\",Spec!B$12,IF(M4=\"Type AS2\",Spec!C$12,IF(M4=\"Type AS3\",Spec!D$12,IF(M4=\"Type AS4\",Spec!E$12))))","v":"0-5"},200,null,{"$f":"IF(ISBLANK(C$29),\"  \",IF(ISBLANK(C$30),\" \",IF(ISBLANK(C39),\" \",ROUND((C39+C$31)/C$29*100,2))))","v":"  "},null,{"$f":"IF(ISBLANK(E$29),\"  \",IF(ISBLANK(E$30),\" \",IF(ISBLANK(E39),\" \",ROUND((E39+E$31)/E$29*100,2))))","v":"  "},null,{"$f":"IF(ISBLANK(G$29),\"  \",IF(ISBLANK(G$30),\" \",IF(ISBLANK(G39),\" \",ROUND((G39+G$31)/G$29*100,2))))","v":"  "},null,{"$f":"IF(ISBLANK(I$29),\"  \",IF(ISBLANK(I$30),\" \",IF(ISBLANK(I39),\" \",ROUND((I39+I$31)/I$29*100,2))))","v":"  "},null,{"$f":"IF(ISBLANK(K$29),\"  \",IF(ISBLANK(K$30),\" \",IF(ISBLANK(K39),\" \",ROUND((K39+K$31)/K$29*100,2))))","v":"  "},null,{"$f":"IF(ISBLANK(M$29),\"  \",IF(ISBLANK(M$30),\" \",IF(ISBLANK(M39),\" \",ROUND((M39+M$31)/M$29*100,2))))","v":"  "}]
["Tested By"]
["Remarks"]
[]
[]
[]
[]
[null,null,{"$f":"MAX(C14:C15)","v":0},null,{"$f":"MAX(E14:E15)","v":0},null,{"$f":"MAX(G14:G15)","v":0},null,{"$f":"MAX(I14:I15)","v":0},null,{"$f":"MAX(K14:K15)","v":0},null,{"$f":"MAX(M14:M15)","v":0}]
[null,null,{"$f":"MAX(C33:C34)","v":0},null,{"$f":"MAX(E33:E34)","v":0},null,{"$f":"MAX(G33:G34)","v":0},null,{"$f":"MAX(I33:I34)","v":0},null,{"$f":"MAX(K33:K34)","v":0},null,{"$f":"MAX(M33:M34)","v":0}]

{"sheet":"S5","index":4,"n_rows":47,"n_cols":14,"rows_kept":47,"cut":false,"hidden":true,"merged":[[3,10,3,11],[3,12,3,13],[0,0,3,1],[1,10,1,11],[1,12,1,13],[2,10,2,11],[2,12,2,13],[0,8,3,9],[1,2,1,7],[2,2,2,7],[3,2,3,7],[5,3,5,8],[7,0,7,1],[7,2,7,3],[7,4,7,5],[7,6,7,7],[7,8,7,9],[10,0,10,1],[9,0,9,1],[7,10,7,11],[7,12,7,13],[8,0,8,1],[8,2,8,3],[8,4,8,5],[8,6,8,7],[8,8,8,9],[8,10,8,11],[8,12,8,13],[21,12,24,13],[26,12,26,13],[27,12,27,13],[30,2,30,3],[11,10,11,11],[11,12,11,13],[11,4,11,5],[11,6,11,7],[11,8,11,9],[20,12,20,13],[30,10,30,11],[21,6,24,7],[27,2,27,3],[20,2,20,3],[26,2,26,3],[20,10,20,11],[28,0,28,1],[26,0,26,1],[27,0,27,1],[26,10,26,11],[21,0,24,1],[21,2,24,3],[21,4,24,5],[27,4,27,5],[27,6,27,7],[26,4,26,5],[26,6,26,7],[26,8,26,9],[39,6,39,7],[39,8,39,9],[11,0,11,1],[11,2,11,3],[21,8,24,9],[20,0,20,1],[39,0,39,1],[20,4,20,5],[20,6,20,7],[20,8,20,9],[30,0,30,1],[25,0,25,13],[21,10,24,11],[27,8,27,9],[27,10,27,11],[29,0,29,1],[4,0,4,1],[39,2,39,3],[30,12,30,13],[39,12,39,13],[40,0,43,1],[40,2,43,3],[40,4,43,5],[40,6,43,7],[40,8,43,9],[40,10,43,11],[40,12,43,13],[30,4,30,5],[30,6,30,7],[30,8,30,9],[39,10,39,11],[39,4,39,5]]}
[]
[null,null,"COMMONWEALTH OF PENNSYLVANIA",null,null,null,null,null,null,null,"DISTRICT",null,{"$f":"IF(ISBLANK('S1'!L2),\"\",'S1'!L2)","v":""}]
[null,null,"DEPARTMENT OF TRANSPORTATION",null,null,null,null,null,null,null,"PLANT CODE",null,{"$f":"IF(ISBLANK('S1'!L3),\"\",'S1'!L3)","v":""}]
[null,null,"PENNSYLVANIA TURNPIKE COMMISSION",null,null,null,null,null,null,null,"AGG SIZE",null,{"$f":"IF(ISBLANK('S1'!L4),\"\",'S1'!L4)","v":"Type AS4"}]
[{"$f":"'S1'!A5","v":"Aggregate 2023"}]
[null,null,null,{"$f":"'S1'!D6","v":"Material Test Results for Type AS4"}]
[]
["Sample No."]
["Date"]
[{"$f":"IF($M$4=\"Type AS3\",\"Starting Wt.\",\"St. Wt. Before Wash.\")","v":"St. Wt. Before Wash."},null,null,"% Loss",null,"% Loss",null,"% Loss",null,"% Loss",null,"% Loss",null,"% Loss"]
[{"$f":"IF($M$4=\"Type AS3\",\"Ending Wt.\",\"Dry. Wt. After Wash.\")","v":"Dry. Wt. After Wash."},null,null,{"$f":"IF(ISBLANK(C10),\" \",IF(ISBLANK(C15),\" \",IF($M$4=\"Type AS3\",(C10-C11)/C10*100,(C11-C46)/C11*100)))","v":" "},null,{"$f":"IF(ISBLANK(E10),\" \",IF(ISBLANK(E15),\" \",IF($M$4=\"Type AS3\",(E10-E11)/E10*100,(E11-E46)/E11*100)))","v":" "},null,{"$f":"IF(ISBLANK(G10),\" \",IF(ISBLANK(G15),\" \",IF($M$4=\"Type AS3\",(G10-G11)/G10*100,(G11-G46)/G11*100)))","v":" "},null,{"$f":"IF(ISBLANK(I10),\" \",IF(ISBLANK(I15),\" \",IF($M$4=\"Type AS3\",(I10-I11)/I10*100,(I11-I46)/I11*100)))","v":" "},null,{"$f":"IF(ISBLANK(K10),\" \",IF(ISBLANK(K15),\" \",IF($M$4=\"Type AS3\",(K10-K11)/K10*100,(K11-K46)/K11*100)))","v":" "},null,{"$f":"IF(ISBLANK(M10),\" \",IF(ISBLANK(M15),\" \",IF($M$4=\"Type AS3\",(M10-M11)/M10*100,(M11-M46)/M11*100)))","v":" "}]
["Wt. Loss",null,{"$f":"IF($M$4=\"Type AS3\",0,IF(ISBLANK(C10),\" \",IF(ISBLANK(C11),\" \",C10-C11)))","v":" "},null,{"$f":"IF($M$4=\"Type AS3\",0,IF(ISBLANK(E10),\" \",IF(ISBLANK(E11),\" \",E10-E11)))","v":" "},null,{"$f":"IF($M$4=\"Type AS3\",0,IF(ISBLANK(G10),\" \",IF(ISBLANK(G11),\" \",G10-G11)))","v":" "},null,{"$f":"IF($M$4=\"Type AS3\",0,IF(ISBLANK(I10),\" \",IF(ISBLANK(I11),\" \",I10-I11)))","v":" "},null,{"$f":"IF($M$4=\"Type AS3\",0,IF(ISBLANK(K10),\" \",IF(ISBLANK(K11),\" \",K10-K11)))","v":" "},null,{"$f":"IF($M$4=\"Type AS3\",0,IF(ISBLANK(M10),\" \",IF(ISBLANK(M11),\" \",M10-M11)))","v":" "}]
["Spec","Sieve","Wt","% Passing","Wt","% Passing","Wt","% Passing","Wt","% Passing","Wt","% Passing","Wt","% Passing"]
[100,0.5,null,{"$f":"IF(ISBLANK(C$10),\"  \",IF(ISBLANK(C$11),\" \",IF(ISBLANK(C14),\" \",ROUND((C14+C$12)/C$10*100,1))))","v":"  "},null,{"$f":"IF(ISBLANK(E$10),\"  \",IF(ISBLANK(E$11),\" \",IF(ISBLANK(E14),\" \",ROUND((E14+E$12)/E$10*100,0))))","v":"  "},null,{"$f":"IF(ISBLANK(G$10),\"  \",IF(ISBLANK(G$11),\" \",IF(ISBLANK(G14),\" \",ROUND((G14+G$12)/G$10*100,1))))","v":"  "},null,{"$f":"IF(ISBLANK(I$10),\"  \",IF(ISBLANK(I$11),\" \",IF(ISBLANK(I14),\" \",ROUND((I14+I$12)/I$10*100,1))))","v":"  "},null,{"$f":"IF(ISBLANK(K$10),\"  \",IF(ISBLANK(K$11),\" \",IF(ISBLANK(K14),\" \",ROUND((K14+K$12)/K$10*100,1))))","v":"  "},null,{"$f":"IF(ISBLANK(M$10),\"  \",IF(ISBLANK(M$11),\" \",IF(ISBLANK(M14),\" \",ROUND((M14+M$12)/M$10*100,1))))","v":"  "}]
[{"$f":"IF(M$4=\"Type AS3\",\"90-100\",\"100\")","v":"100"},0.375,null,{"$f":"IF(ISBLANK(C$10),\"  \",IF(ISBLANK(C$11),\" \",IF(ISBLANK(C15),\" \",ROUND((C15+C$12)/C$10*100,1))))","v":"  "},null,"  ",null,{"$f":"IF(ISBLANK(G$10),\"  \",IF(ISBLANK(G$11),\" \",IF(ISBLANK(G15),\" \",ROUND((G15+G$12)/G$10*100,1))))","v":"  "},null,{"$f":"IF(ISBLANK(I$10),\"  \",IF(ISBLANK(I$11),\" \",IF(ISBLANK(I15),\" \",ROUND((I15+I$12)/I$10*100,1))))","v":"  "},null,{"$f":"IF(ISBLANK(K$10),\"  \",IF(ISBLANK(K$11),\" \",IF(ISBLANK(K15),\" \",ROUND((K15+K$12)/K$10*100,1))))","v":"  "},null,{"$f":"IF(ISBLANK(M$10),\"  \",IF(ISBLANK(M$11),\" \",IF(ISBLANK(M15),\" \",ROUND((M15+M$12)/M$10*100,1))))","v":"  "}]
["Breaker",0.25,null,{"$f":"IF(ISBLANK(C$10),\"  \",IF(ISBLANK(C$11),\" \",IF(ISBLANK(C16),\" \",ROUND((C16+C$12)/C$10*100,0))))","v":"  "},null,"  ",null,{"$f":"IF(ISBLANK(G$10),\"  \",IF(ISBLANK(G$11),\" \",IF(ISBLANK(G16),\" \",ROUND((G16+G$12)/G$10*100,0))))","v":"  "},null,{"$f":"IF(ISBLANK(I$10),\"  \",IF(ISBLANK(I$11),\" \",IF(ISBLANK(I16),\" \",ROUND((I16+I$12)/I$10*100,0))))","v":"  "},null,{"$f":"IF(ISBLANK(K$10),\"  \",IF(ISBLANK(K$11),\" \",IF(ISBLANK(K16),\" \",ROUND((K16+K$12)/K$10*100,0))))","v":"  "},null,{"$f":"IF(ISBLANK(M$10),\"  \",IF(ISBLANK(M$11),\" \",IF(ISBLANK(M16),\" \",ROUND((M16+M$12)/M$10*100,0))))","v":"  "}]
[{"$f":"IF(M4=\"Type AS1\",Spec!B$9,IF(M4=\"Type AS2\",Spec!C$9,IF(M4=\"Type AS3\",Spec!D$9,IF(M4=\"Type AS4\",Spec!E$9))))","v":0},4,null,{"$f":"IF(ISBLANK(C$10),\"  \",IF(ISBLANK(C$11),\" \",IF(ISBLANK(C17),\" \",ROUND((C17+C$12)/C$10*100,0))))","v":"  "},null,"  ",null,{"$f":"IF(ISBLANK(G$10),\"  \",IF(ISBLANK(G$11),\" \",IF(ISBLANK(G17),\" \",ROUND((G17+G$12)/G$10*100,0))))","v":"  "},null,{"$f":"IF(ISBLANK(I$10),\"  \",IF(ISBLANK(I$11),\" \",IF(ISBLANK(I17),\" \",ROUND((I17+I$12)/I$10*100,0))))","v":"  "},null,{"$f":"IF(ISBLANK(K$10),\"  \",IF(ISBLANK(K$11),\" \",IF(ISBLANK(K17),\" \",ROUND((K17+K$12)/K$10*100,0))))","v":"  "},null,{"$f":"IF(ISBLANK(M$10),\"  \",IF(ISBLANK(M$11),\" \",IF(ISBLANK(M17),\" \",ROUND((M17+M$12)/M$10*100,0))))","v":"  "}]
[{"$f":"IF(M4=\"Type AS1\",Spec!B$10,IF(M4=\"Type AS2\",Spec!C$10,IF(M4=\"Type AS3\",Spec!D$10,IF(M4=\"Type AS4\",Spec!E$10))))","v":"0-30"},8,null,{"$f":"IF(ISBLANK(C$10),\"  \",IF(ISBLANK(C$11),\" \",IF(ISBLANK(C18),\" \",ROUND((C18+C$12)/C$10*100,0))))","v":"  "},null,"  ",null,{"$f":"IF(ISBLANK(G$10),\"  \",IF(ISBLANK(G$11),\" \",IF(ISBLANK(G18),\" \",ROUND((G18+G$12)/G$10*100,0))))","v":"  "},null,{"$f":"IF(ISBLANK(I$10),\"  \",IF(ISBLANK(I$11),\" \",IF(ISBLANK(I18),\" \",ROUND((I18+I$12)/I$10*100,0))))","v":"  "},null,{"$f":"IF(ISBLANK(K$10),\"  \",IF(ISBLANK(K$11),\" \",IF(ISBLANK(K18),\" \",ROUND((K18+K$12)/K$10*100,0))))","v":"  "},null,{"$f":"IF(ISBLANK(M$10),\"  \",IF(ISBLANK(M$11),\" \",IF(ISBLANK(M18),\" \",ROUND((M18+M$12)/M$10*100,0))))","v":"  "}]
[{"$f":"IF(M4=\"Type AS1\",Spec!B$11,IF(M4=\"Type AS2\",Spec!C$11,IF(M4=\"Type AS3\",Spec!D$11,IF(M4=\"Type AS4\",Spec!E$11))))","v":"0-8"},100,null,{"$f":"IF(ISBLANK(C$10),\"  \",IF(ISBLANK(C$11),\" \",IF(ISBLANK(C19),\" \",ROUND((C19+C$12)/C$10*100,0))))","v":"  "},null,"  ",null,{"$f":"IF(ISBLANK(G$10),\"  \",IF(ISBLANK(G$11),\" \",IF(ISBLANK(G19),\" \",ROUND((G19+G$12)/G$10*100,0))))","v":"  "},null,{"$f":"IF(ISBLANK(I$10),\"  \",IF(ISBLANK(I$11),\" \",IF(ISBLANK(I19),\" \",ROUND((I19+I$12)/I$10*100,0))))","v":"  "},null,{"$f":"IF(ISBLANK(K$10),\"  \",IF(ISBLANK(K$11),\" \",IF(ISBLANK(K19),\" \",ROUND((K19+K$12)/K$10*100,0))))","v":"  "},null,{"$f":"IF(ISBLANK(M$10),\"  \",IF(ISBLANK(M$11),\" \",IF(ISBLANK(M19),\" \",ROUND((M19+M$12)/M$10*100,0))))","v":"  "}]
[{"$f":"IF(M4=\"Type AS1\",Spec!B$12,IF(M4=\"Type AS2\",Spec!C$12,IF(M4=\"Type AS3\",Spec!D$12,IF(M4=\"Type AS4\",Spec!E$12))))","v":"0-5"},200,null,{"$f":"IF(ISBLANK(C$10),\"  \",IF(ISBLANK(C$11),\" \",IF(ISBLANK(C20),\" \",ROUND((C20+C$12)/C$10*100,2))))","v":"  "},null,{"$f":"IF(ISBLANK(E$10),\"  \",IF(ISBLANK(E$11),\" \",IF(ISBLANK(E20),\" \",ROUND((E20+E$12)/E$10*100,2))))","v":"  "},null,{"$f":"IF(ISBLANK(G$10),\"  \",IF(ISBLANK(G$11),\" \",IF(ISBLANK(G20),\" \",ROUND((G20+G$12)/G$10*100,2))))","v":"  "},null,{"$f":"IF(ISBLANK(I$10),\"  \",IF(ISBLANK(I$11),\" \",IF(ISBLANK(I20),\" \",ROUND((I20+I$12)/I$10*100,2))))","v":"  "},null,{"$f":"IF(ISBLANK(K$10),\"  \",IF(ISBLANK(K$11),\" \",IF(ISBLANK(K20),\" \",ROUND((K20+K$12)/K$10*100,2))))","v":"  "},null,{"$f":"IF(ISBLANK(M$10),\"  \",IF(ISBLANK(M$11),\" \",IF(ISBLANK(M20),\" \",ROUND((M20+M$12)/M$10*100,2))))","v":"  "}]
["Tested By"]
["Remarks"]
[]
[]
[]
[{"$f":"'S1'!A26","v":""}]
["Sample No."]
["Date"]
[{"$f":"IF($M$4=\"Type AS3\",\"Starting Wt.\",\"St. Wt. Before Wash.\")","v":"St. Wt. Before Wash."},null,null,"% Loss",null,"% Loss",null,"% Loss",null,"% Loss",null,"% Loss",null,"% Loss"]
[{"$f":"IF($M$4=\"Type AS3\",\"Ending Wt.\",\"Dry. Wt. After Wash.\")","v":"Dry. Wt. After Wash."},null,null,{"$f":"IF(ISBLANK(C29),\" \",IF(ISBLANK(C34),\" \",IF($M$4=\"Type AS3\",(C29-C30)/C29*100,(C30-C47)/C30*100)))","v":" "},null,{"$f":"IF(ISBLANK(E29),\" \",IF(ISBLANK(E34),\" \",IF($M$4=\"Type AS3\",(E29-E30)/E29*100,(E30-E47)/E30*100)))","v":" "},null,{"$f":"IF(ISBLANK(G29),\" \",IF(ISBLANK(G34),\" \",IF($M$4=\"Type AS3\",(G29-G30)/G29*100,(G30-G47)/G30*100)))","v":" "},null,{"$f":"IF(ISBLANK(I29),\" \",IF(ISBLANK(I34),\" \",IF($M$4=\"Type AS3\",(I29-I30)/I29*100,(I30-I47)/I30*100)))","v":" "},null,{"$f":"IF(ISBLANK(K29),\" \",IF(ISBLANK(K34),\" \",IF($M$4=\"Type AS3\",(K29-K30)/K29*100,(K30-K47)/K30*100)))","v":" "},null,{"$f":"IF(ISBLANK(M29),\" \",IF(ISBLANK(M34),\" \",IF($M$4=\"Type AS3\",(M29-M30)/M29*100,(M30-M47)/M30*100)))","v":" "}]
["Wt. Loss",null,{"$f":"IF($M$4=\"Type AS3\",0,IF(ISBLANK(C29),\" \",IF(ISBLANK(C30),\" \",C29-C30)))","v":" "},null,{"$f":"IF($M$4=\"Type AS3\",0,IF(ISBLANK(E29),\" \",IF(ISBLANK(E30),\" \",E29-E30)))","v":" "},null,{"$f":"IF($M$4=\"Type AS3\",0,IF(ISBLANK(G29),\" \",IF(ISBLANK(G30),\" \",G29-G30)))","v":" "},null,{"$f":"IF($M$4=\"Type AS3\",0,IF(ISBLANK(I29),\" \",IF(ISBLANK(I30),\" \",I29-I30)))","v":" "},null,{"$f":"IF($M$4=\"Type AS3\",0,IF(ISBLANK(K29),\" \",IF(ISBLANK(K30),\" \",K29-K30)))","v":" "},null,{"$f":"IF($M$4=\"Type AS3\",0,IF(ISBLANK(M29),\" \",IF(ISBLANK(M30),\" \",M29-M30)))","v":" "}]
["Spec","Sieve","Wt","% Passing","Wt","% Passing","Wt","% Passing","Wt","% Passing","Wt","% Passing","Wt","% Passing"]
[100,0.5,null,{"$f":"IF(ISBLANK(C$29),\"  \",IF(ISBLANK(C$30),\" \",IF(ISBLANK(C33),\" \",ROUND((C33+C$31)/C$29*100,1))))","v":"  "},null,{"$f":"IF(ISBLANK(E$29),\"  \",IF(ISBLANK(E$30),\" \",IF(ISBLANK(E33),\" \",ROUND((E33+E$31)/E$29*100,1))))","v":"  "},null,{"$f":"IF(ISBLANK(G$29),\"  \",IF(ISBLANK(G$30),\" \",IF(ISBLANK(G33),\" \",ROUND((G33+G$31)/G$29*100,1))))","v":"  "},null,{"$f":"IF(ISBLANK(I$29),\"  \",IF(ISBLANK(I$30),\" \",IF(ISBLANK(I33),\" \",ROUND((I33+I$31)/I$29*100,1))))","v":"  "},null,{"$f":"IF(ISBLANK(K$29),\"  \",IF(ISBLANK(K$30),\" \",IF(ISBLANK(K33),\" \",ROUND((K33+K$31)/K$29*100,1))))","v":"  "},null,{"$f":"IF(ISBLANK(M$29),\"  \",IF(ISBLANK(M$30),\" \",IF(ISBLANK(M33),\" \",ROUND((M33+M$31)/M$29*100,1))))","v":"  "}]
[{"$f":"IF(M$4=\"Type AS3\",\"90-100\",\"100\")","v":"100"},0.375,null,{"$f":"IF(ISBLANK(C$29),\"  \",IF(ISBLANK(C$30),\" \",IF(ISBLANK(C34),\" \",ROUND((C34+C$31)/C$29*100,1))))","v":"  "},null,{"$f":"IF(ISBLANK(E$29),\"  \",IF(ISBLANK(E$30),\" \",IF(ISBLANK(E34),\" \",ROUND((E34+E$31)/E$29*100,1))))","v":"  "},null,{"$f":"IF(ISBLANK(G$29),\"  \",IF(ISBLANK(G$30),\" \",IF(ISBLANK(G34),\" \",ROUND((G34+G$31)/G$29*100,1))))","v":"  "},null,{"$f":"IF(ISBLANK(I$29),\"  \",IF(ISBLANK(I$30),\" \",IF(ISBLANK(I34),\" \",ROUND((I34+I$31)/I$29*100,1))))","v":"  "},null,{"$f":"IF(ISBLANK(K$29),\"  \",IF(ISBLANK(K$30),\" \",IF(ISBLANK(K34),\" \",ROUND((K34+K$31)/K$29*100,1))))","v":"  "},null,{"$f":"IF(ISBLANK(M$29),\"  \",IF(ISBLANK(M$30),\" \",IF(ISBLANK(M34),\" \",ROUND((M34+M$31)/M$29*100,1))))","v":"  "}]
["Breaker",0.25,null,{"$f":"IF(ISBLANK(C$29),\"  \",IF(ISBLANK(C$30),\" \",IF(ISBLANK(C35),\" \",ROUND((C35+C$31)/C$29*100,0))))","v":"  "},null,{"$f":"IF(ISBLANK(E$29),\"  \",IF(ISBLANK(E$30),\" \",IF(ISBLANK(E35),\" \",ROUND((E35+E$31)/E$29*100,0))))","v":"  "},null,{"$f":"IF(ISBLANK(G$29),\"  \",IF(ISBLANK(G$30),\" \",IF(ISBLANK(G35),\" \",ROUND((G35+G$31)/G$29*100,0))))","v":"  "},null,{"$f":"IF(ISBLANK(I$29),\"  \",IF(ISBLANK(I$30),\" \",IF(ISBLANK(I35),\" \",ROUND((I35+I$31)/I$29*100,0))))","v":"  "},null,{"$f":"IF(ISBLANK(K$29),\"  \",IF(ISBLANK(K$30),\" \",IF(ISBLANK(K35),\" \",ROUND((K35+K$31)/K$29*100,0))))","v":"  "},null,{"$f":"IF(ISBLANK(M$29),\"  \",IF(ISBLANK(M$30),\" \",IF(ISBLANK(M35),\" \",ROUND((M35+M$31)/M$29*100,0))))","v":"  "}]
[{"$f":"IF(M4=\"Type AS1\",Spec!B$9,IF(M4=\"Type AS2\",Spec!C$9,IF(M4=\"Type AS3\",Spec!D$9,IF(M4=\"Type AS4\",Spec!E$9))))","v":0},4,null,{"$f":"IF(ISBLANK(C$29),\"  \",IF(ISBLANK(C$30),\" \",IF(ISBLANK(C36),\" \",ROUND((C36+C$31)/C$29*100,0))))","v":"  "},null,{"$f":"IF(ISBLANK(E$29),\"  \",IF(ISBLANK(E$30),\" \",IF(ISBLANK(E36),\" \",ROUND((E36+E$31)/E$29*100,0))))","v":"  "},null,{"$f":"IF(ISBLANK(G$29),\"  \",IF(ISBLANK(G$30),\" \",IF(ISBLANK(G36),\" \",ROUND((G36+G$31)/G$29*100,0))))","v":"  "},null,{"$f":"IF(ISBLANK(I$29),\"  \",IF(ISBLANK(I$30),\" \",IF(ISBLANK(I36),\" \",ROUND((I36+I$31)/I$29*100,0))))","v":"  "},null,{"$f":"IF(ISBLANK(K$29),\"  \",IF(ISBLANK(K$30),\" \",IF(ISBLANK(K36),\" \",ROUND((K36+K$31)/K$29*100,0))))","v":"  "},null,{"$f":"IF(ISBLANK(M$29),\"  \",IF(ISBLANK(M$30),\" \",IF(ISBLANK(M36),\" \",ROUND((M36+M$31)/M$29*100,0))))","v":"  "}]
[{"$f":"IF(M4=\"Type AS1\",Spec!B$10,IF(M4=\"Type AS2\",Spec!C$10,IF(M4=\"Type AS3\",Spec!D$10,IF(M4=\"Type AS4\",Spec!E$10))))","v":"0-30"},8,null,{"$f":"IF(ISBLANK(C$29),\"  \",IF(ISBLANK(C$30),\" \",IF(ISBLANK(C37),\" \",ROUND((C37+C$31)/C$29*100,0))))","v":"  "},null,{"$f":"IF(ISBLANK(E$29),\"  \",IF(ISBLANK(E$30),\" \",IF(ISBLANK(E37),\" \",ROUND((E37+E$31)/E$29*100,0))))","v":"  "},null,{"$f":"IF(ISBLANK(G$29),\"  \",IF(ISBLANK(G$30),\" \",IF(ISBLANK(G37),\" \",ROUND((G37+G$31)/G$29*100,0))))","v":"  "},null,{"$f":"IF(ISBLANK(I$29),\"  \",IF(ISBLANK(I$30),\" \",IF(ISBLANK(I37),\" \",ROUND((I37+I$31)/I$29*100,0))))","v":"  "},null,{"$f":"IF(ISBLANK(K$29),\"  \",IF(ISBLANK(K$30),\" \",IF(ISBLANK(K37),\" \",ROUND((K37+K$31)/K$29*100,0))))","v":"  "},null,{"$f":"IF(ISBLANK(M$29),\"  \",IF(ISBLANK(M$30),\" \",IF(ISBLANK(M37),\" \",ROUND((M37+M$31)/M$29*100,0))))","v":"  "}]
[{"$f":"IF(M4=\"Type AS1\",Spec!B$11,IF(M4=\"Type AS2\",Spec!C$11,IF(M4=\"Type AS3\",Spec!D$11,IF(M4=\"Type AS4\",Spec!E$11))))","v":"0-8"},100,null,{"$f":"IF(ISBLANK(C$29),\"  \",IF(ISBLANK(C$30),\" \",IF(ISBLANK(C38),\" \",ROUND((C38+C$31)/C$29*100,0))))","v":"  "},null,{"$f":"IF(ISBLANK(E$29),\"  \",IF(ISBLANK(E$30),\" \",IF(ISBLANK(E38),\" \",ROUND((E38+E$31)/E$29*100,0))))","v":"  "},null,{"$f":"IF(ISBLANK(G$29),\"  \",IF(ISBLANK(G$30),\" \",IF(ISBLANK(G38),\" \",ROUND((G38+G$31)/G$29*100,0))))","v":"  "},null,{"$f":"IF(ISBLANK(I$29),\"  \",IF(ISBLANK(I$30),\" \",IF(ISBLANK(I38),\" \",ROUND((I38+I$31)/I$29*100,0))))","v":"  "},null,{"$f":"IF(ISBLANK(K$29),\"  \",IF(ISBLANK(K$30),\" \",IF(ISBLANK(K38),\" \",ROUND((K38+K$31)/K$29*100,0))))","v":"  "},null,{"$f":"IF(ISBLANK(M$29),\"  \",IF(ISBLANK(M$30),\" \",IF(ISBLANK(M38),\" \",ROUND((M38+M$31)/M$29*100,0))))","v":"  "}]
[{"$f":"IF(M4=\"Type AS1\",Spec!B$12,IF(M4=\"Type AS2\",Spec!C$12,IF(M4=\"Type AS3\",Spec!D$12,IF(M4=\"Type AS4\",Spec!E$12))))","v":"0-5"},200,null,{"$f":"IF(ISBLANK(C$29),\"  \",IF(ISBLANK(C$30),\" \",IF(ISBLANK(C39),\" \",ROUND((C39+C$31)/C$29*100,2))))","v":"  "},null,{"$f":"IF(ISBLANK(E$29),\"  \",IF(ISBLANK(E$30),\" \",IF(ISBLANK(E39),\" \",ROUND((E39+E$31)/E$29*100,2))))","v":"  "},null,{"$f":"IF(ISBLANK(G$29),\"  \",IF(ISBLANK(G$30),\" \",IF(ISBLANK(G39),\" \",ROUND((G39+G$31)/G$29*100,2))))","v":"  "},null,{"$f":"IF(ISBLANK(I$29),\"  \",IF(ISBLANK(I$30),\" \",IF(ISBLANK(I39),\" \",ROUND((I39+I$31)/I$29*100,2))))","v":"  "},null,{"$f":"IF(ISBLANK(K$29),\"  \",IF(ISBLANK(K$30),\" \",IF(ISBLANK(K39),\" \",ROUND((K39+K$31)/K$29*100,2))))","v":"  "},null,{"$f":"IF(ISBLANK(M$29),\"  \",IF(ISBLANK(M$30),\" \",IF(ISBLANK(M39),\" \",ROUND((M39+M$31)/M$29*100,2))))","v":"  "}]
["Tested By"]
["Remarks"]
[]
[]
[]
[]
[null,null,{"$f":"MAX(C14:C15)","v":0},null,{"$f":"MAX(E14:E15)","v":0},null,{"$f":"MAX(G14:G15)","v":0},null,{"$f":"MAX(I14:I15)","v":0},null,{"$f":"MAX(K14:K15)","v":0},null,{"$f":"MAX(M14:M15)","v":0}]
[null,null,{"$f":"MAX(C33:C34)","v":0},null,{"$f":"MAX(E33:E34)","v":0},null,{"$f":"MAX(G33:G34)","v":0},null,{"$f":"MAX(I33:I34)","v":0},null,{"$f":"MAX(K33:K34)","v":0},null,{"$f":"MAX(M33:M34)","v":0}]

{"sheet":"S6","index":5,"n_rows":47,"n_cols":14,"rows_kept":47,"cut":false,"hidden":true,"merged":[[3,10,3,11],[3,12,3,13],[0,0,3,1],[1,10,1,11],[1,12,1,13],[2,10,2,11],[2,12,2,13],[0,8,3,9],[1,2,1,7],[2,2,2,7],[3,2,3,7],[5,3,5,8],[7,0,7,1],[7,2,7,3],[7,4,7,5],[7,6,7,7],[7,8,7,9],[10,0,10,1],[9,0,9,1],[7,10,7,11],[7,12,7,13],[8,0,8,1],[8,2,8,3],[8,4,8,5],[8,6,8,7],[8,8,8,9],[8,10,8,11],[8,12,8,13],[21,12,24,13],[26,12,26,13],[27,12,27,13],[30,2,30,3],[11,10,11,11],[11,12,11,13],[11,4,11,5],[11,6,11,7],[11,8,11,9],[20,12,20,13],[30,10,30,11],[21,6,24,7],[27,2,27,3],[20,2,20,3],[26,2,26,3],[20,10,20,11],[28,0,28,1],[26,0,26,1],[27,0,27,1],[26,10,26,11],[21,0,24,1],[21,2,24,3],[21,4,24,5],[27,4,27,5],[27,6,27,7],[26,4,26,5],[26,6,26,7],[26,8,26,9],[39,6,39,7],[39,8,39,9],[11,0,11,1],[11,2,11,3],[21,8,24,9],[20,0,20,1],[39,0,39,1],[20,4,20,5],[20,6,20,7],[20,8,20,9],[30,0,30,1],[25,0,25,13],[21,10,24,11],[27,8,27,9],[27,10,27,11],[29,0,29,1],[4,0,4,1],[39,2,39,3],[30,12,30,13],[39,12,39,13],[40,0,43,1],[40,2,43,3],[40,4,43,5],[40,6,43,7],[40,8,43,9],[40,10,43,11],[40,12,43,13],[30,4,30,5],[30,6,30,7],[30,8,30,9],[39,10,39,11],[39,4,39,5]]}
[]
[null,null,"COMMONWEALTH OF PENNSYLVANIA",null,null,null,null,null,null,null,"DISTRICT",null,{"$f":"IF(ISBLANK('S1'!L2),\"\",'S1'!L2)","v":""}]
[null,null,"DEPARTMENT OF TRANSPORTATION",null,null,null,null,null,null,null,"PLANT CODE",null,{"$f":"IF(ISBLANK('S1'!L3),\"\",'S1'!L3)","v":""}]
[null,null,"PENNSYLVANIA TURNPIKE COMMISSION",null,null,null,null,null,null,null,"AGG SIZE",null,{"$f":"IF(ISBLANK('S1'!L4),\"\",'S1'!L4)","v":"Type AS4"}]
[{"$f":"'S1'!A5","v":"Aggregate 2023"}]
[null,null,null,{"$f":"'S1'!D6","v":"Material Test Results for Type AS4"}]
[]
["Sample No."]
["Date"]
[{"$f":"IF($M$4=\"Type AS3\",\"Starting Wt.\",\"St. Wt. Before Wash.\")","v":"St. Wt. Before Wash."},null,null,"% Loss",null,"% Loss",null,"% Loss",null,"% Loss",null,"% Loss",null,"% Loss"]
[{"$f":"IF($M$4=\"Type AS3\",\"Ending Wt.\",\"Dry. Wt. After Wash.\")","v":"Dry. Wt. After Wash."},null,null,{"$f":"IF(ISBLANK(C10),\" \",IF(ISBLANK(C15),\" \",IF($M$4=\"Type AS3\",(C10-C11)/C10*100,(C11-C46)/C11*100)))","v":" "},null,{"$f":"IF(ISBLANK(E10),\" \",IF(ISBLANK(E15),\" \",IF($M$4=\"Type AS3\",(E10-E11)/E10*100,(E11-E46)/E11*100)))","v":" "},null,{"$f":"IF(ISBLANK(G10),\" \",IF(ISBLANK(G15),\" \",IF($M$4=\"Type AS3\",(G10-G11)/G10*100,(G11-G46)/G11*100)))","v":" "},null,{"$f":"IF(ISBLANK(I10),\" \",IF(ISBLANK(I15),\" \",IF($M$4=\"Type AS3\",(I10-I11)/I10*100,(I11-I46)/I11*100)))","v":" "},null,{"$f":"IF(ISBLANK(K10),\" \",IF(ISBLANK(K15),\" \",IF($M$4=\"Type AS3\",(K10-K11)/K10*100,(K11-K46)/K11*100)))","v":" "},null,{"$f":"IF(ISBLANK(M10),\" \",IF(ISBLANK(M15),\" \",IF($M$4=\"Type AS3\",(M10-M11)/M10*100,(M11-M46)/M11*100)))","v":" "}]
["Wt. Loss",null,{"$f":"IF($M$4=\"Type AS3\",0,IF(ISBLANK(C10),\" \",IF(ISBLANK(C11),\" \",C10-C11)))","v":" "},null,{"$f":"IF($M$4=\"Type AS3\",0,IF(ISBLANK(E10),\" \",IF(ISBLANK(E11),\" \",E10-E11)))","v":" "},null,{"$f":"IF($M$4=\"Type AS3\",0,IF(ISBLANK(G10),\" \",IF(ISBLANK(G11),\" \",G10-G11)))","v":" "},null,{"$f":"IF($M$4=\"Type AS3\",0,IF(ISBLANK(I10),\" \",IF(ISBLANK(I11),\" \",I10-I11)))","v":" "},null,{"$f":"IF($M$4=\"Type AS3\",0,IF(ISBLANK(K10),\" \",IF(ISBLANK(K11),\" \",K10-K11)))","v":" "},null,{"$f":"IF($M$4=\"Type AS3\",0,IF(ISBLANK(M10),\" \",IF(ISBLANK(M11),\" \",M10-M11)))","v":" "}]
["Spec","Sieve","Wt","% Passing","Wt","% Passing","Wt","% Passing","Wt","% Passing","Wt","% Passing","Wt","% Passing"]
[100,0.5,null,{"$f":"IF(ISBLANK(C$10),\"  \",IF(ISBLANK(C$11),\" \",IF(ISBLANK(C14),\" \",ROUND((C14+C$12)/C$10*100,1))))","v":"  "},null,{"$f":"IF(ISBLANK(E$10),\"  \",IF(ISBLANK(E$11),\" \",IF(ISBLANK(E14),\" \",ROUND((E14+E$12)/E$10*100,0))))","v":"  "},null,{"$f":"IF(ISBLANK(G$10),\"  \",IF(ISBLANK(G$11),\" \",IF(ISBLANK(G14),\" \",ROUND((G14+G$12)/G$10*100,1))))","v":"  "},null,{"$f":"IF(ISBLANK(I$10),\"  \",IF(ISBLANK(I$11),\" \",IF(ISBLANK(I14),\" \",ROUND((I14+I$12)/I$10*100,1))))","v":"  "},null,{"$f":"IF(ISBLANK(K$10),\"  \",IF(ISBLANK(K$11),\" \",IF(ISBLANK(K14),\" \",ROUND((K14+K$12)/K$10*100,1))))","v":"  "},null,{"$f":"IF(ISBLANK(M$10),\"  \",IF(ISBLANK(M$11),\" \",IF(ISBLANK(M14),\" \",ROUND((M14+M$12)/M$10*100,1))))","v":"  "}]
[{"$f":"IF(M$4=\"Type AS3\",\"90-100\",\"100\")","v":"100"},0.375,null,{"$f":"IF(ISBLANK(C$10),\"  \",IF(ISBLANK(C$11),\" \",IF(ISBLANK(C15),\" \",ROUND((C15+C$12)/C$10*100,1))))","v":"  "},null,"  ",null,{"$f":"IF(ISBLANK(G$10),\"  \",IF(ISBLANK(G$11),\" \",IF(ISBLANK(G15),\" \",ROUND((G15+G$12)/G$10*100,1))))","v":"  "},null,{"$f":"IF(ISBLANK(I$10),\"  \",IF(ISBLANK(I$11),\" \",IF(ISBLANK(I15),\" \",ROUND((I15+I$12)/I$10*100,1))))","v":"  "},null,{"$f":"IF(ISBLANK(K$10),\"  \",IF(ISBLANK(K$11),\" \",IF(ISBLANK(K15),\" \",ROUND((K15+K$12)/K$10*100,1))))","v":"  "},null,{"$f":"IF(ISBLANK(M$10),\"  \",IF(ISBLANK(M$11),\" \",IF(ISBLANK(M15),\" \",ROUND((M15+M$12)/M$10*100,1))))","v":"  "}]
["Breaker",0.25,null,{"$f":"IF(ISBLANK(C$10),\"  \",IF(ISBLANK(C$11),\" \",IF(ISBLANK(C16),\" \",ROUND((C16+C$12)/C$10*100,0))))","v":"  "},null,"  ",null,{"$f":"IF(ISBLANK(G$10),\"  \",IF(ISBLANK(G$11),\" \",IF(ISBLANK(G16),\" \",ROUND((G16+G$12)/G$10*100,0))))","v":"  "},null,{"$f":"IF(ISBLANK(I$10),\"  \",IF(ISBLANK(I$11),\" \",IF(ISBLANK(I16),\" \",ROUND((I16+I$12)/I$10*100,0))))","v":"  "},null,{"$f":"IF(ISBLANK(K$10),\"  \",IF(ISBLANK(K$11),\" \",IF(ISBLANK(K16),\" \",ROUND((K16+K$12)/K$10*100,0))))","v":"  "},null,{"$f":"IF(ISBLANK(M$10),\"  \",IF(ISBLANK(M$11),\" \",IF(ISBLANK(M16),\" \",ROUND((M16+M$12)/M$10*100,0))))","v":"  "}]
[{"$f":"IF(M4=\"Type AS1\",Spec!B$9,IF(M4=\"Type AS2\",Spec!C$9,IF(M4=\"Type AS3\",Spec!D$9,IF(M4=\"Type AS4\",Spec!E$9))))","v":0},4,null,{"$f":"IF(ISBLANK(C$10),\"  \",IF(ISBLANK(C$11),\" \",IF(ISBLANK(C17),\" \",ROUND((C17+C$12)/C$10*100,0))))","v":"  "},null,"  ",null,{"$f":"IF(ISBLANK(G$10),\"  \",IF(ISBLANK(G$11),\" \",IF(ISBLANK(G17),\" \",ROUND((G17+G$12)/G$10*100,0))))","v":"  "},null,{"$f":"IF(ISBLANK(I$10),\"  \",IF(ISBLANK(I$11),\" \",IF(ISBLANK(I17),\" \",ROUND((I17+I$12)/I$10*100,0))))","v":"  "},null,{"$f":"IF(ISBLANK(K$10),\"  \",IF(ISBLANK(K$11),\" \",IF(ISBLANK(K17),\" \",ROUND((K17+K$12)/K$10*100,0))))","v":"  "},null,{"$f":"IF(ISBLANK(M$10),\"  \",IF(ISBLANK(M$11),\" \",IF(ISBLANK(M17),\" \",ROUND((M17+M$12)/M$10*100,0))))","v":"  "}]
[{"$f":"IF(M4=\"Type AS1\",Spec!B$10,IF(M4=\"Type AS2\",Spec!C$10,IF(M4=\"Type AS3\",Spec!D$10,IF(M4=\"Type AS4\",Spec!E$10))))","v":"0-30"},8,null,{"$f":"IF(ISBLANK(C$10),\"  \",IF(ISBLANK(C$11),\" \",IF(ISBLANK(C18),\" \",ROUND((C18+C$12)/C$10*100,0))))","v":"  "},null,"  ",null,{"$f":"IF(ISBLANK(G$10),\"  \",IF(ISBLANK(G$11),\" \",IF(ISBLANK(G18),\" \",ROUND((G18+G$12)/G$10*100,0))))","v":"  "},null,{"$f":"IF(ISBLANK(I$10),\"  \",IF(ISBLANK(I$11),\" \",IF(ISBLANK(I18),\" \",ROUND((I18+I$12)/I$10*100,0))))","v":"  "},null,{"$f":"IF(ISBLANK(K$10),\"  \",IF(ISBLANK(K$11),\" \",IF(ISBLANK(K18),\" \",ROUND((K18+K$12)/K$10*100,0))))","v":"  "},null,{"$f":"IF(ISBLANK(M$10),\"  \",IF(ISBLANK(M$11),\" \",IF(ISBLANK(M18),\" \",ROUND((M18+M$12)/M$10*100,0))))","v":"  "}]
[{"$f":"IF(M4=\"Type AS1\",Spec!B$11,IF(M4=\"Type AS2\",Spec!C$11,IF(M4=\"Type AS3\",Spec!D$11,IF(M4=\"Type AS4\",Spec!E$11))))","v":"0-8"},100,null,{"$f":"IF(ISBLANK(C$10),\"  \",IF(ISBLANK(C$11),\" \",IF(ISBLANK(C19),\" \",ROUND((C19+C$12)/C$10*100,0))))","v":"  "},null,"  ",null,{"$f":"IF(ISBLANK(G$10),\"  \",IF(ISBLANK(G$11),\" \",IF(ISBLANK(G19),\" \",ROUND((G19+G$12)/G$10*100,0))))","v":"  "},null,{"$f":"IF(ISBLANK(I$10),\"  \",IF(ISBLANK(I$11),\" \",IF(ISBLANK(I19),\" \",ROUND((I19+I$12)/I$10*100,0))))","v":"  "},null,{"$f":"IF(ISBLANK(K$10),\"  \",IF(ISBLANK(K$11),\" \",IF(ISBLANK(K19),\" \",ROUND((K19+K$12)/K$10*100,0))))","v":"  "},null,{"$f":"IF(ISBLANK(M$10),\"  \",IF(ISBLANK(M$11),\" \",IF(ISBLANK(M19),\" \",ROUND((M19+M$12)/M$10*100,0))))","v":"  "}]
[{"$f":"IF(M4=\"Type AS1\",Spec!B$12,IF(M4=\"Type AS2\",Spec!C$12,IF(M4=\"Type AS3\",Spec!D$12,IF(M4=\"Type AS4\",Spec!E$12))))","v":"0-5"},200,null,{"$f":"IF(ISBLANK(C$10),\"  \",IF(ISBLANK(C$11),\" \",IF(ISBLANK(C20),\" \",ROUND((C20+C$12)/C$10*100,2))))","v":"  "},null,{"$f":"IF(ISBLANK(E$10),\"  \",IF(ISBLANK(E$11),\" \",IF(ISBLANK(E20),\" \",ROUND((E20+E$12)/E$10*100,2))))","v":"  "},null,{"$f":"IF(ISBLANK(G$10),\"  \",IF(ISBLANK(G$11),\" \",IF(ISBLANK(G20),\" \",ROUND((G20+G$12)/G$10*100,2))))","v":"  "},null,{"$f":"IF(ISBLANK(I$10),\"  \",IF(ISBLANK(I$11),\" \",IF(ISBLANK(I20),\" \",ROUND((I20+I$12)/I$10*100,2))))","v":"  "},null,{"$f":"IF(ISBLANK(K$10),\"  \",IF(ISBLANK(K$11),\" \",IF(ISBLANK(K20),\" \",ROUND((K20+K$12)/K$10*100,2))))","v":"  "},null,{"$f":"IF(ISBLANK(M$10),\"  \",IF(ISBLANK(M$11),\" \",IF(ISBLANK(M20),\" \",ROUND((M20+M$12)/M$10*100,2))))","v":"  "}]
["Tested By"]
["Remarks"]
[]
[]
[]
[{"$f":"'S1'!A26","v":""}]
["Sample No."]
["Date"]
[{"$f":"IF($M$4=\"Type AS3\",\"Starting Wt.\",\"St. Wt. Before Wash.\")","v":"St. Wt. Before Wash."},null,null,"% Loss",null,"% Loss",null,"% Loss",null,"% Loss",null,"% Loss",null,"% Loss"]
[{"$f":"IF($M$4=\"Type AS3\",\"Ending Wt.\",\"Dry. Wt. After Wash.\")","v":"Dry. Wt. After Wash."},null,null,{"$f":"IF(ISBLANK(C29),\" \",IF(ISBLANK(C34),\" \",IF($M$4=\"Type AS3\",(C29-C30)/C29*100,(C30-C47)/C30*100)))","v":" "},null,{"$f":"IF(ISBLANK(E29),\" \",IF(ISBLANK(E34),\" \",IF($M$4=\"Type AS3\",(E29-E30)/E29*100,(E30-E47)/E30*100)))","v":" "},null,{"$f":"IF(ISBLANK(G29),\" \",IF(ISBLANK(G34),\" \",IF($M$4=\"Type AS3\",(G29-G30)/G29*100,(G30-G47)/G30*100)))","v":" "},null,{"$f":"IF(ISBLANK(I29),\" \",IF(ISBLANK(I34),\" \",IF($M$4=\"Type AS3\",(I29-I30)/I29*100,(I30-I47)/I30*100)))","v":" "},null,{"$f":"IF(ISBLANK(K29),\" \",IF(ISBLANK(K34),\" \",IF($M$4=\"Type AS3\",(K29-K30)/K29*100,(K30-K47)/K30*100)))","v":" "},null,{"$f":"IF(ISBLANK(M29),\" \",IF(ISBLANK(M34),\" \",IF($M$4=\"Type AS3\",(M29-M30)/M29*100,(M30-M47)/M30*100)))","v":" "}]
["Wt. Loss",null,{"$f":"IF($M$4=\"Type AS3\",0,IF(ISBLANK(C29),\" \",IF(ISBLANK(C30),\" \",C29-C30)))","v":" "},null,{"$f":"IF($M$4=\"Type AS3\",0,IF(ISBLANK(E29),\" \",IF(ISBLANK(E30),\" \",E29-E30)))","v":" "},null,{"$f":"IF($M$4=\"Type AS3\",0,IF(ISBLANK(G29),\" \",IF(ISBLANK(G30),\" \",G29-G30)))","v":" "},null,{"$f":"IF($M$4=\"Type AS3\",0,IF(ISBLANK(I29),\" \",IF(ISBLANK(I30),\" \",I29-I30)))","v":" "},null,{"$f":"IF($M$4=\"Type AS3\",0,IF(ISBLANK(K29),\" \",IF(ISBLANK(K30),\" \",K29-K30)))","v":" "},null,{"$f":"IF($M$4=\"Type AS3\",0,IF(ISBLANK(M29),\" \",IF(ISBLANK(M30),\" \",M29-M30)))","v":" "}]
["Spec","Sieve","Wt","% Passing","Wt","% Passing","Wt","% Passing","Wt","% Passing","Wt","% Passing","Wt","% Passing"]
[100,0.5,null,{"$f":"IF(ISBLANK(C$29),\"  \",IF(ISBLANK(C$30),\" \",IF(ISBLANK(C33),\" \",ROUND((C33+C$31)/C$29*100,1))))","v":"  "},null,{"$f":"IF(ISBLANK(E$29),\"  \",IF(ISBLANK(E$30),\" \",IF(ISBLANK(E33),\" \",ROUND((E33+E$31)/E$29*100,1))))","v":"  "},null,{"$f":"IF(ISBLANK(G$29),\"  \",IF(ISBLANK(G$30),\" \",IF(ISBLANK(G33),\" \",ROUND((G33+G$31)/G$29*100,1))))","v":"  "},null,{"$f":"IF(ISBLANK(I$29),\"  \",IF(ISBLANK(I$30),\" \",IF(ISBLANK(I33),\" \",ROUND((I33+I$31)/I$29*100,1))))","v":"  "},null,{"$f":"IF(ISBLANK(K$29),\"  \",IF(ISBLANK(K$30),\" \",IF(ISBLANK(K33),\" \",ROUND((K33+K$31)/K$29*100,1))))","v":"  "},null,{"$f":"IF(ISBLANK(M$29),\"  \",IF(ISBLANK(M$30),\" \",IF(ISBLANK(M33),\" \",ROUND((M33+M$31)/M$29*100,1))))","v":"  "}]
[{"$f":"IF(M$4=\"Type AS3\",\"90-100\",\"100\")","v":"100"},0.375,null,{"$f":"IF(ISBLANK(C$29),\"  \",IF(ISBLANK(C$30),\" \",IF(ISBLANK(C34),\" \",ROUND((C34+C$31)/C$29*100,1))))","v":"  "},null,{"$f":"IF(ISBLANK(E$29),\"  \",IF(ISBLANK(E$30),\" \",IF(ISBLANK(E34),\" \",ROUND((E34+E$31)/E$29*100,1))))","v":"  "},null,{"$f":"IF(ISBLANK(G$29),\"  \",IF(ISBLANK(G$30),\" \",IF(ISBLANK(G34),\" \",ROUND((G34+G$31)/G$29*100,1))))","v":"  "},null,{"$f":"IF(ISBLANK(I$29),\"  \",IF(ISBLANK(I$30),\" \",IF(ISBLANK(I34),\" \",ROUND((I34+I$31)/I$29*100,1))))","v":"  "},null,{"$f":"IF(ISBLANK(K$29),\"  \",IF(ISBLANK(K$30),\" \",IF(ISBLANK(K34),\" \",ROUND((K34+K$31)/K$29*100,1))))","v":"  "},null,{"$f":"IF(ISBLANK(M$29),\"  \",IF(ISBLANK(M$30),\" \",IF(ISBLANK(M34),\" \",ROUND((M34+M$31)/M$29*100,1))))","v":"  "}]
["Breaker",0.25,null,{"$f":"IF(ISBLANK(C$29),\"  \",IF(ISBLANK(C$30),\" \",IF(ISBLANK(C35),\" \",ROUND((C35+C$31)/C$29*100,0))))","v":"  "},null,{"$f":"IF(ISBLANK(E$29),\"  \",IF(ISBLANK(E$30),\" \",IF(ISBLANK(E35),\" \",ROUND((E35+E$31)/E$29*100,0))))","v":"  "},null,{"$f":"IF(ISBLANK(G$29),\"  \",IF(ISBLANK(G$30),\" \",IF(ISBLANK(G35),\" \",ROUND((G35+G$31)/G$29*100,0))))","v":"  "},null,{"$f":"IF(ISBLANK(I$29),\"  \",IF(ISBLANK(I$30),\" \",IF(ISBLANK(I35),\" \",ROUND((I35+I$31)/I$29*100,0))))","v":"  "},null,{"$f":"IF(ISBLANK(K$29),\"  \",IF(ISBLANK(K$30),\" \",IF(ISBLANK(K35),\" \",ROUND((K35+K$31)/K$29*100,0))))","v":"  "},null,{"$f":"IF(ISBLANK(M$29),\"  \",IF(ISBLANK(M$30),\" \",IF(ISBLANK(M35),\" \",ROUND((M35+M$31)/M$29*100,0))))","v":"  "}]
[{"$f":"IF(M4=\"Type AS1\",Spec!B$9,IF(M4=\"Type AS2\",Spec!C$9,IF(M4=\"Type AS3\",Spec!D$9,IF(M4=\"Type AS4\",Spec!E$9))))","v":0},4,null,{"$f":"IF(ISBLANK(C$29),\"  \",IF(ISBLANK(C$30),\" \",IF(ISBLANK(C36),\" \",ROUND((C36+C$31)/C$29*100,0))))","v":"  "},null,{"$f":"IF(ISBLANK(E$29),\"  \",IF(ISBLANK(E$30),\" \",IF(ISBLANK(E36),\" \",ROUND((E36+E$31)/E$29*100,0))))","v":"  "},null,{"$f":"IF(ISBLANK(G$29),\"  \",IF(ISBLANK(G$30),\" \",IF(ISBLANK(G36),\" \",ROUND((G36+G$31)/G$29*100,0))))","v":"  "},null,{"$f":"IF(ISBLANK(I$29),\"  \",IF(ISBLANK(I$30),\" \",IF(ISBLANK(I36),\" \",ROUND((I36+I$31)/I$29*100,0))))","v":"  "},null,{"$f":"IF(ISBLANK(K$29),\"  \",IF(ISBLANK(K$30),\" \",IF(ISBLANK(K36),\" \",ROUND((K36+K$31)/K$29*100,0))))","v":"  "},null,{"$f":"IF(ISBLANK(M$29),\"  \",IF(ISBLANK(M$30),\" \",IF(ISBLANK(M36),\" \",ROUND((M36+M$31)/M$29*100,0))))","v":"  "}]
[{"$f":"IF(M4=\"Type AS1\",Spec!B$10,IF(M4=\"Type AS2\",Spec!C$10,IF(M4=\"Type AS3\",Spec!D$10,IF(M4=\"Type AS4\",Spec!E$10))))","v":"0-30"},8,null,{"$f":"IF(ISBLANK(C$29),\"  \",IF(ISBLANK(C$30),\" \",IF(ISBLANK(C37),\" \",ROUND((C37+C$31)/C$29*100,0))))","v":"  "},null,{"$f":"IF(ISBLANK(E$29),\"  \",IF(ISBLANK(E$30),\" \",IF(ISBLANK(E37),\" \",ROUND((E37+E$31)/E$29*100,0))))","v":"  "},null,{"$f":"IF(ISBLANK(G$29),\"  \",IF(ISBLANK(G$30),\" \",IF(ISBLANK(G37),\" \",ROUND((G37+G$31)/G$29*100,0))))","v":"  "},null,{"$f":"IF(ISBLANK(I$29),\"  \",IF(ISBLANK(I$30),\" \",IF(ISBLANK(I37),\" \",ROUND((I37+I$31)/I$29*100,0))))","v":"  "},null,{"$f":"IF(ISBLANK(K$29),\"  \",IF(ISBLANK(K$30),\" \",IF(ISBLANK(K37),\" \",ROUND((K37+K$31)/K$29*100,0))))","v":"  "},null,{"$f":"IF(ISBLANK(M$29),\"  \",IF(ISBLANK(M$30),\" \",IF(ISBLANK(M37),\" \",ROUND((M37+M$31)/M$29*100,0))))","v":"  "}]
[{"$f":"IF(M4=\"Type AS1\",Spec!B$11,IF(M4=\"Type AS2\",Spec!C$11,IF(M4=\"Type AS3\",Spec!D$11,IF(M4=\"Type AS4\",Spec!E$11))))","v":"0-8"},100,null,{"$f":"IF(ISBLANK(C$29),\"  \",IF(ISBLANK(C$30),\" \",IF(ISBLANK(C38),\" \",ROUND((C38+C$31)/C$29*100,0))))","v":"  "},null,{"$f":"IF(ISBLANK(E$29),\"  \",IF(ISBLANK(E$30),\" \",IF(ISBLANK(E38),\" \",ROUND((E38+E$31)/E$29*100,0))))","v":"  "},null,{"$f":"IF(ISBLANK(G$29),\"  \",IF(ISBLANK(G$30),\" \",IF(ISBLANK(G38),\" \",ROUND((G38+G$31)/G$29*100,0))))","v":"  "},null,{"$f":"IF(ISBLANK(I$29),\"  \",IF(ISBLANK(I$30),\" \",IF(ISBLANK(I38),\" \",ROUND((I38+I$31)/I$29*100,0))))","v":"  "},null,{"$f":"IF(ISBLANK(K$29),\"  \",IF(ISBLANK(K$30),\" \",IF(ISBLANK(K38),\" \",ROUND((K38+K$31)/K$29*100,0))))","v":"  "},null,{"$f":"IF(ISBLANK(M$29),\"  \",IF(ISBLANK(M$30),\" \",IF(ISBLANK(M38),\" \",ROUND((M38+M$31)/M$29*100,0))))","v":"  "}]
[{"$f":"IF(M4=\"Type AS1\",Spec!B$12,IF(M4=\"Type AS2\",Spec!C$12,IF(M4=\"Type AS3\",Spec!D$12,IF(M4=\"Type AS4\",Spec!E$12))))","v":"0-5"},200,null,{"$f":"IF(ISBLANK(C$29),\"  \",IF(ISBLANK(C$30),\" \",IF(ISBLANK(C39),\" \",ROUND((C39+C$31)/C$29*100,2))))","v":"  "},null,{"$f":"IF(ISBLANK(E$29),\"  \",IF(ISBLANK(E$30),\" \",IF(ISBLANK(E39),\" \",ROUND((E39+E$31)/E$29*100,2))))","v":"  "},null,{"$f":"IF(ISBLANK(G$29),\"  \",IF(ISBLANK(G$30),\" \",IF(ISBLANK(G39),\" \",ROUND((G39+G$31)/G$29*100,2))))","v":"  "},null,{"$f":"IF(ISBLANK(I$29),\"  \",IF(ISBLANK(I$30),\" \",IF(ISBLANK(I39),\" \",ROUND((I39+I$31)/I$29*100,2))))","v":"  "},null,{"$f":"IF(ISBLANK(K$29),\"  \",IF(ISBLANK(K$30),\" \",IF(ISBLANK(K39),\" \",ROUND((K39+K$31)/K$29*100,2))))","v":"  "},null,{"$f":"IF(ISBLANK(M$29),\"  \",IF(ISBLANK(M$30),\" \",IF(ISBLANK(M39),\" \",ROUND((M39+M$31)/M$29*100,2))))","v":"  "}]
["Tested By"]
["Remarks"]
[]
[]
[]
[]
[null,null,{"$f":"MAX(C14:C15)","v":0},null,{"$f":"MAX(E14:E15)","v":0},null,{"$f":"MAX(G14:G15)","v":0},null,{"$f":"MAX(I14:I15)","v":0},null,{"$f":"MAX(K14:K15)","v":0},null,{"$f":"MAX(M14:M15)","v":0}]
[null,null,{"$f":"MAX(C33:C34)","v":0},null,{"$f":"MAX(E33:E34)","v":0},null,{"$f":"MAX(G33:G34)","v":0},null,{"$f":"MAX(I33:I34)","v":0},null,{"$f":"MAX(K33:K34)","v":0},null,{"$f":"MAX(M33:M34)","v":0}]

{"sheet":"S7","index":6,"n_rows":47,"n_cols":14,"rows_kept":47,"cut":false,"hidden":true,"merged":[[3,10,3,11],[3,12,3,13],[0,0,3,1],[1,10,1,11],[1,12,1,13],[2,10,2,11],[2,12,2,13],[0,8,3,9],[1,2,1,7],[2,2,2,7],[3,2,3,7],[5,3,5,8],[7,0,7,1],[7,2,7,3],[7,4,7,5],[7,6,7,7],[7,8,7,9],[10,0,10,1],[9,0,9,1],[7,10,7,11],[7,12,7,13],[8,0,8,1],[8,2,8,3],[8,4,8,5],[8,6,8,7],[8,8,8,9],[8,10,8,11],[8,12,8,13],[21,12,24,13],[26,12,26,13],[27,12,27,13],[30,2,30,3],[11,10,11,11],[11,12,11,13],[11,4,11,5],[11,6,11,7],[11,8,11,9],[20,12,20,13],[30,10,30,11],[21,6,24,7],[27,2,27,3],[20,2,20,3],[26,2,26,3],[20,10,20,11],[28,0,28,1],[26,0,26,1],[27,0,27,1],[26,10,26,11],[21,0,24,1],[21,2,24,3],[21,4,24,5],[27,4,27,5],[27,6,27,7],[26,4,26,5],[26,6,26,7],[26,8,26,9],[39,6,39,7],[39,8,39,9],[11,0,11,1],[11,2,11,3],[21,8,24,9],[20,0,20,1],[39,0,39,1],[20,4,20,5],[20,6,20,7],[20,8,20,9],[30,0,30,1],[25,0,25,13],[21,10,24,11],[27,8,27,9],[27,10,27,11],[29,0,29,1],[4,0,4,1],[39,2,39,3],[30,12,30,13],[39,12,39,13],[40,0,43,1],[40,2,43,3],[40,4,43,5],[40,6,43,7],[40,8,43,9],[40,10,43,11],[40,12,43,13],[30,4,30,5],[30,6,30,7],[30,8,30,9],[39,10,39,11],[39,4,39,5]]}
[]
[null,null,"COMMONWEALTH OF PENNSYLVANIA",null,null,null,null,null,null,null,"DISTRICT",null,{"$f":"IF(ISBLANK('S1'!L2),\"\",'S1'!L2)","v":""}]
[null,null,"DEPARTMENT OF TRANSPORTATION",null,null,null,null,null,null,null,"PLANT CODE",null,{"$f":"IF(ISBLANK('S1'!L3),\"\",'S1'!L3)","v":""}]
[null,null,"PENNSYLVANIA TURNPIKE COMMISSION",null,null,null,null,null,null,null,"AGG SIZE",null,{"$f":"IF(ISBLANK('S1'!L4),\"\",'S1'!L4)","v":"Type AS4"}]
[{"$f":"'S1'!A5","v":"Aggregate 2023"}]
[null,null,null,{"$f":"'S1'!D6","v":"Material Test Results for Type AS4"}]
[]
["Sample No."]
["Date"]
[{"$f":"IF($M$4=\"Type AS3\",\"Starting Wt.\",\"St. Wt. Before Wash.\")","v":"St. Wt. Before Wash."},null,null,"% Loss",null,"% Loss",null,"% Loss",null,"% Loss",null,"% Loss",null,"% Loss"]
[{"$f":"IF($M$4=\"Type AS3\",\"Ending Wt.\",\"Dry. Wt. After Wash.\")","v":"Dry. Wt. After Wash."},null,null,{"$f":"IF(ISBLANK(C10),\" \",IF(ISBLANK(C15),\" \",IF($M$4=\"Type AS3\",(C10-C11)/C10*100,(C11-C46)/C11*100)))","v":" "},null,{"$f":"IF(ISBLANK(E10),\" \",IF(ISBLANK(E15),\" \",IF($M$4=\"Type AS3\",(E10-E11)/E10*100,(E11-E46)/E11*100)))","v":" "},null,{"$f":"IF(ISBLANK(G10),\" \",IF(ISBLANK(G15),\" \",IF($M$4=\"Type AS3\",(G10-G11)/G10*100,(G11-G46)/G11*100)))","v":" "},null,{"$f":"IF(ISBLANK(I10),\" \",IF(ISBLANK(I15),\" \",IF($M$4=\"Type AS3\",(I10-I11)/I10*100,(I11-I46)/I11*100)))","v":" "},null,{"$f":"IF(ISBLANK(K10),\" \",IF(ISBLANK(K15),\" \",IF($M$4=\"Type AS3\",(K10-K11)/K10*100,(K11-K46)/K11*100)))","v":" "},null,{"$f":"IF(ISBLANK(M10),\" \",IF(ISBLANK(M15),\" \",IF($M$4=\"Type AS3\",(M10-M11)/M10*100,(M11-M46)/M11*100)))","v":" "}]
["Wt. Loss",null,{"$f":"IF($M$4=\"Type AS3\",0,IF(ISBLANK(C10),\" \",IF(ISBLANK(C11),\" \",C10-C11)))","v":" "},null,{"$f":"IF($M$4=\"Type AS3\",0,IF(ISBLANK(E10),\" \",IF(ISBLANK(E11),\" \",E10-E11)))","v":" "},null,{"$f":"IF($M$4=\"Type AS3\",0,IF(ISBLANK(G10),\" \",IF(ISBLANK(G11),\" \",G10-G11)))","v":" "},null,{"$f":"IF($M$4=\"Type AS3\",0,IF(ISBLANK(I10),\" \",IF(ISBLANK(I11),\" \",I10-I11)))","v":" "},null,{"$f":"IF($M$4=\"Type AS3\",0,IF(ISBLANK(K10),\" \",IF(ISBLANK(K11),\" \",K10-K11)))","v":" "},null,{"$f":"IF($M$4=\"Type AS3\",0,IF(ISBLANK(M10),\" \",IF(ISBLANK(M11),\" \",M10-M11)))","v":" "}]
["Spec","Sieve","Wt","% Passing","Wt","% Passing","Wt","% Passing","Wt","% Passing","Wt","% Passing","Wt","% Passing"]
[100,0.5,null,{"$f":"IF(ISBLANK(C$10),\"  \",IF(ISBLANK(C$11),\" \",IF(ISBLANK(C14),\" \",ROUND((C14+C$12)/C$10*100,1))))","v":"  "},null,{"$f":"IF(ISBLANK(E$10),\"  \",IF(ISBLANK(E$11),\" \",IF(ISBLANK(E14),\" \",ROUND((E14+E$12)/E$10*100,0))))","v":"  "},null,{"$f":"IF(ISBLANK(G$10),\"  \",IF(ISBLANK(G$11),\" \",IF(ISBLANK(G14),\" \",ROUND((G14+G$12)/G$10*100,1))))","v":"  "},null,{"$f":"IF(ISBLANK(I$10),\"  \",IF(ISBLANK(I$11),\" \",IF(ISBLANK(I14),\" \",ROUND((I14+I$12)/I$10*100,1))))","v":"  "},null,{"$f":"IF(ISBLANK(K$10),\"  \",IF(ISBLANK(K$11),\" \",IF(ISBLANK(K14),\" \",ROUND((K14+K$12)/K$10*100,1))))","v":"  "},null,{"$f":"IF(ISBLANK(M$10),\"  \",IF(ISBLANK(M$11),\" \",IF(ISBLANK(M14),\" \",ROUND((M14+M$12)/M$10*100,1))))","v":"  "}]
[{"$f":"IF(M$4=\"Type AS3\",\"90-100\",\"100\")","v":"100"},0.375,null,{"$f":"IF(ISBLANK(C$10),\"  \",IF(ISBLANK(C$11),\" \",IF(ISBLANK(C15),\" \",ROUND((C15+C$12)/C$10*100,1))))","v":"  "},null,"  ",null,{"$f":"IF(ISBLANK(G$10),\"  \",IF(ISBLANK(G$11),\" \",IF(ISBLANK(G15),\" \",ROUND((G15+G$12)/G$10*100,1))))","v":"  "},null,{"$f":"IF(ISBLANK(I$10),\"  \",IF(ISBLANK(I$11),\" \",IF(ISBLANK(I15),\" \",ROUND((I15+I$12)/I$10*100,1))))","v":"  "},null,{"$f":"IF(ISBLANK(K$10),\"  \",IF(ISBLANK(K$11),\" \",IF(ISBLANK(K15),\" \",ROUND((K15+K$12)/K$10*100,1))))","v":"  "},null,{"$f":"IF(ISBLANK(M$10),\"  \",IF(ISBLANK(M$11),\" \",IF(ISBLANK(M15),\" \",ROUND((M15+M$12)/M$10*100,1))))","v":"  "}]
["Breaker",0.25,null,{"$f":"IF(ISBLANK(C$10),\"  \",IF(ISBLANK(C$11),\" \",IF(ISBLANK(C16),\" \",ROUND((C16+C$12)/C$10*100,0))))","v":"  "},null,"  ",null,{"$f":"IF(ISBLANK(G$10),\"  \",IF(ISBLANK(G$11),\" \",IF(ISBLANK(G16),\" \",ROUND((G16+G$12)/G$10*100,0))))","v":"  "},null,{"$f":"IF(ISBLANK(I$10),\"  \",IF(ISBLANK(I$11),\" \",IF(ISBLANK(I16),\" \",ROUND((I16+I$12)/I$10*100,0))))","v":"  "},null,{"$f":"IF(ISBLANK(K$10),\"  \",IF(ISBLANK(K$11),\" \",IF(ISBLANK(K16),\" \",ROUND((K16+K$12)/K$10*100,0))))","v":"  "},null,{"$f":"IF(ISBLANK(M$10),\"  \",IF(ISBLANK(M$11),\" \",IF(ISBLANK(M16),\" \",ROUND((M16+M$12)/M$10*100,0))))","v":"  "}]
[{"$f":"IF(M4=\"Type AS1\",Spec!B$9,IF(M4=\"Type AS2\",Spec!C$9,IF(M4=\"Type AS3\",Spec!D$9,IF(M4=\"Type AS4\",Spec!E$9))))","v":0},4,null,{"$f":"IF(ISBLANK(C$10),\"  \",IF(ISBLANK(C$11),\" \",IF(ISBLANK(C17),\" \",ROUND((C17+C$12)/C$10*100,0))))","v":"  "},null,"  ",null,{"$f":"IF(ISBLANK(G$10),\"  \",IF(ISBLANK(G$11),\" \",IF(ISBLANK(G17),\" \",ROUND((G17+G$12)/G$10*100,0))))","v":"  "},null,{"$f":"IF(ISBLANK(I$10),\"  \",IF(ISBLANK(I$11),\" \",IF(ISBLANK(I17),\" \",ROUND((I17+I$12)/I$10*100,0))))","v":"  "},null,{"$f":"IF(ISBLANK(K$10),\"  \",IF(ISBLANK(K$11),\" \",IF(ISBLANK(K17),\" \",ROUND((K17+K$12)/K$10*100,0))))","v":"  "},null,{"$f":"IF(ISBLANK(M$10),\"  \",IF(ISBLANK(M$11),\" \",IF(ISBLANK(M17),\" \",ROUND((M17+M$12)/M$10*100,0))))","v":"  "}]
[{"$f":"IF(M4=\"Type AS1\",Spec!B$10,IF(M4=\"Type AS2\",Spec!C$10,IF(M4=\"Type AS3\",Spec!D$10,IF(M4=\"Type AS4\",Spec!E$10))))","v":"0-30"},8,null,{"$f":"IF(ISBLANK(C$10),\"  \",IF(ISBLANK(C$11),\" \",IF(ISBLANK(C18),\" \",ROUND((C18+C$12)/C$10*100,0))))","v":"  "},null,"  ",null,{"$f":"IF(ISBLANK(G$10),\"  \",IF(ISBLANK(G$11),\" \",IF(ISBLANK(G18),\" \",ROUND((G18+G$12)/G$10*100,0))))","v":"  "},null,{"$f":"IF(ISBLANK(I$10),\"  \",IF(ISBLANK(I$11),\" \",IF(ISBLANK(I18),\" \",ROUND((I18+I$12)/I$10*100,0))))","v":"  "},null,{"$f":"IF(ISBLANK(K$10),\"  \",IF(ISBLANK(K$11),\" \",IF(ISBLANK(K18),\" \",ROUND((K18+K$12)/K$10*100,0))))","v":"  "},null,{"$f":"IF(ISBLANK(M$10),\"  \",IF(ISBLANK(M$11),\" \",IF(ISBLANK(M18),\" \",ROUND((M18+M$12)/M$10*100,0))))","v":"  "}]
[{"$f":"IF(M4=\"Type AS1\",Spec!B$11,IF(M4=\"Type AS2\",Spec!C$11,IF(M4=\"Type AS3\",Spec!D$11,IF(M4=\"Type AS4\",Spec!E$11))))","v":"0-8"},100,null,{"$f":"IF(ISBLANK(C$10),\"  \",IF(ISBLANK(C$11),\" \",IF(ISBLANK(C19),\" \",ROUND((C19+C$12)/C$10*100,0))))","v":"  "},null,"  ",null,{"$f":"IF(ISBLANK(G$10),\"  \",IF(ISBLANK(G$11),\" \",IF(ISBLANK(G19),\" \",ROUND((G19+G$12)/G$10*100,0))))","v":"  "},null,{"$f":"IF(ISBLANK(I$10),\"  \",IF(ISBLANK(I$11),\" \",IF(ISBLANK(I19),\" \",ROUND((I19+I$12)/I$10*100,0))))","v":"  "},null,{"$f":"IF(ISBLANK(K$10),\"  \",IF(ISBLANK(K$11),\" \",IF(ISBLANK(K19),\" \",ROUND((K19+K$12)/K$10*100,0))))","v":"  "},null,{"$f":"IF(ISBLANK(M$10),\"  \",IF(ISBLANK(M$11),\" \",IF(ISBLANK(M19),\" \",ROUND((M19+M$12)/M$10*100,0))))","v":"  "}]
[{"$f":"IF(M4=\"Type AS1\",Spec!B$12,IF(M4=\"Type AS2\",Spec!C$12,IF(M4=\"Type AS3\",Spec!D$12,IF(M4=\"Type AS4\",Spec!E$12))))","v":"0-5"},200,null,{"$f":"IF(ISBLANK(C$10),\"  \",IF(ISBLANK(C$11),\" \",IF(ISBLANK(C20),\" \",ROUND((C20+C$12)/C$10*100,2))))","v":"  "},null,{"$f":"IF(ISBLANK(E$10),\"  \",IF(ISBLANK(E$11),\" \",IF(ISBLANK(E20),\" \",ROUND((E20+E$12)/E$10*100,2))))","v":"  "},null,{"$f":"IF(ISBLANK(G$10),\"  \",IF(ISBLANK(G$11),\" \",IF(ISBLANK(G20),\" \",ROUND((G20+G$12)/G$10*100,2))))","v":"  "},null,{"$f":"IF(ISBLANK(I$10),\"  \",IF(ISBLANK(I$11),\" \",IF(ISBLANK(I20),\" \",ROUND((I20+I$12)/I$10*100,2))))","v":"  "},null,{"$f":"IF(ISBLANK(K$10),\"  \",IF(ISBLANK(K$11),\" \",IF(ISBLANK(K20),\" \",ROUND((K20+K$12)/K$10*100,2))))","v":"  "},null,{"$f":"IF(ISBLANK(M$10),\"  \",IF(ISBLANK(M$11),\" \",IF(ISBLANK(M20),\" \",ROUND((M20+M$12)/M$10*100,2))))","v":"  "}]
["Tested By"]
["Remarks"]
[]
[]
[]
[{"$f":"'S1'!A26","v":""}]
["Sample No."]
["Date"]
[{"$f":"IF($M$4=\"Type AS3\",\"Starting Wt.\",\"St. Wt. Before Wash.\")","v":"St. Wt. Before Wash."},null,null,"% Loss",null,"% Loss",null,"% Loss",null,"% Loss",null,"% Loss",null,"% Loss"]
[{"$f":"IF($M$4=\"Type AS3\",\"Ending Wt.\",\"Dry. Wt. After Wash.\")","v":"Dry. Wt. After Wash."},null,null,{"$f":"IF(ISBLANK(C29),\" \",IF(ISBLANK(C34),\" \",IF($M$4=\"Type AS3\",(C29-C30)/C29*100,(C30-C47)/C30*100)))","v":" "},null,{"$f":"IF(ISBLANK(E29),\" \",IF(ISBLANK(E34),\" \",IF($M$4=\"Type AS3\",(E29-E30)/E29*100,(E30-E47)/E30*100)))","v":" "},null,{"$f":"IF(ISBLANK(G29),\" \",IF(ISBLANK(G34),\" \",IF($M$4=\"Type AS3\",(G29-G30)/G29*100,(G30-G47)/G30*100)))","v":" "},null,{"$f":"IF(ISBLANK(I29),\" \",IF(ISBLANK(I34),\" \",IF($M$4=\"Type AS3\",(I29-I30)/I29*100,(I30-I47)/I30*100)))","v":" "},null,{"$f":"IF(ISBLANK(K29),\" \",IF(ISBLANK(K34),\" \",IF($M$4=\"Type AS3\",(K29-K30)/K29*100,(K30-K47)/K30*100)))","v":" "},null,{"$f":"IF(ISBLANK(M29),\" \",IF(ISBLANK(M34),\" \",IF($M$4=\"Type AS3\",(M29-M30)/M29*100,(M30-M47)/M30*100)))","v":" "}]
["Wt. Loss",null,{"$f":"IF($M$4=\"Type AS3\",0,IF(ISBLANK(C29),\" \",IF(ISBLANK(C30),\" \",C29-C30)))","v":" "},null,{"$f":"IF($M$4=\"Type AS3\",0,IF(ISBLANK(E29),\" \",IF(ISBLANK(E30),\" \",E29-E30)))","v":" "},null,{"$f":"IF($M$4=\"Type AS3\",0,IF(ISBLANK(G29),\" \",IF(ISBLANK(G30),\" \",G29-G30)))","v":" "},null,{"$f":"IF($M$4=\"Type AS3\",0,IF(ISBLANK(I29),\" \",IF(ISBLANK(I30),\" \",I29-I30)))","v":" "},null,{"$f":"IF($M$4=\"Type AS3\",0,IF(ISBLANK(K29),\" \",IF(ISBLANK(K30),\" \",K29-K30)))","v":" "},null,{"$f":"IF($M$4=\"Type AS3\",0,IF(ISBLANK(M29),\" \",IF(ISBLANK(M30),\" \",M29-M30)))","v":" "}]
["Spec","Sieve","Wt","% Passing","Wt","% Passing","Wt","% Passing","Wt","% Passing","Wt","% Passing","Wt","% Passing"]
[100,0.5,null,{"$f":"IF(ISBLANK(C$29),\"  \",IF(ISBLANK(C$30),\" \",IF(ISBLANK(C33),\" \",ROUND((C33+C$31)/C$29*100,1))))","v":"  "},null,{"$f":"IF(ISBLANK(E$29),\"  \",IF(ISBLANK(E$30),\" \",IF(ISBLANK(E33),\" \",ROUND((E33+E$31)/E$29*100,1))))","v":"  "},null,{"$f":"IF(ISBLANK(G$29),\"  \",IF(ISBLANK(G$30),\" \",IF(ISBLANK(G33),\" \",ROUND((G33+G$31)/G$29*100,1))))","v":"  "},null,{"$f":"IF(ISBLANK(I$29),\"  \",IF(ISBLANK(I$30),\" \",IF(ISBLANK(I33),\" \",ROUND((I33+I$31)/I$29*100,1))))","v":"  "},null,{"$f":"IF(ISBLANK(K$29),\"  \",IF(ISBLANK(K$30),\" \",IF(ISBLANK(K33),\" \",ROUND((K33+K$31)/K$29*100,1))))","v":"  "},null,{"$f":"IF(ISBLANK(M$29),\"  \",IF(ISBLANK(M$30),\" \",IF(ISBLANK(M33),\" \",ROUND((M33+M$31)/M$29*100,1))))","v":"  "}]
[{"$f":"IF(M$4=\"Type AS3\",\"90-100\",\"100\")","v":"100"},0.375,null,{"$f":"IF(ISBLANK(C$29),\"  \",IF(ISBLANK(C$30),\" \",IF(ISBLANK(C34),\" \",ROUND((C34+C$31)/C$29*100,1))))","v":"  "},null,{"$f":"IF(ISBLANK(E$29),\"  \",IF(ISBLANK(E$30),\" \",IF(ISBLANK(E34),\" \",ROUND((E34+E$31)/E$29*100,1))))","v":"  "},null,{"$f":"IF(ISBLANK(G$29),\"  \",IF(ISBLANK(G$30),\" \",IF(ISBLANK(G34),\" \",ROUND((G34+G$31)/G$29*100,1))))","v":"  "},null,{"$f":"IF(ISBLANK(I$29),\"  \",IF(ISBLANK(I$30),\" \",IF(ISBLANK(I34),\" \",ROUND((I34+I$31)/I$29*100,1))))","v":"  "},null,{"$f":"IF(ISBLANK(K$29),\"  \",IF(ISBLANK(K$30),\" \",IF(ISBLANK(K34),\" \",ROUND((K34+K$31)/K$29*100,1))))","v":"  "},null,{"$f":"IF(ISBLANK(M$29),\"  \",IF(ISBLANK(M$30),\" \",IF(ISBLANK(M34),\" \",ROUND((M34+M$31)/M$29*100,1))))","v":"  "}]
["Breaker",0.25,null,{"$f":"IF(ISBLANK(C$29),\"  \",IF(ISBLANK(C$30),\" \",IF(ISBLANK(C35),\" \",ROUND((C35+C$31)/C$29*100,0))))","v":"  "},null,{"$f":"IF(ISBLANK(E$29),\"  \",IF(ISBLANK(E$30),\" \",IF(ISBLANK(E35),\" \",ROUND((E35+E$31)/E$29*100,0))))","v":"  "},null,{"$f":"IF(ISBLANK(G$29),\"  \",IF(ISBLANK(G$30),\" \",IF(ISBLANK(G35),\" \",ROUND((G35+G$31)/G$29*100,0))))","v":"  "},null,{"$f":"IF(ISBLANK(I$29),\"  \",IF(ISBLANK(I$30),\" \",IF(ISBLANK(I35),\" \",ROUND((I35+I$31)/I$29*100,0))))","v":"  "},null,{"$f":"IF(ISBLANK(K$29),\"  \",IF(ISBLANK(K$30),\" \",IF(ISBLANK(K35),\" \",ROUND((K35+K$31)/K$29*100,0))))","v":"  "},null,{"$f":"IF(ISBLANK(M$29),\"  \",IF(ISBLANK(M$30),\" \",IF(ISBLANK(M35),\" \",ROUND((M35+M$31)/M$29*100,0))))","v":"  "}]
[{"$f":"IF(M4=\"Type AS1\",Spec!B$9,IF(M4=\"Type AS2\",Spec!C$9,IF(M4=\"Type AS3\",Spec!D$9,IF(M4=\"Type AS4\",Spec!E$9))))","v":0},4,null,{"$f":"IF(ISBLANK(C$29),\"  \",IF(ISBLANK(C$30),\" \",IF(ISBLANK(C36),\" \",ROUND((C36+C$31)/C$29*100,0))))","v":"  "},null,{"$f":"IF(ISBLANK(E$29),\"  \",IF(ISBLANK(E$30),\" \",IF(ISBLANK(E36),\" \",ROUND((E36+E$31)/E$29*100,0))))","v":"  "},null,{"$f":"IF(ISBLANK(G$29),\"  \",IF(ISBLANK(G$30),\" \",IF(ISBLANK(G36),\" \",ROUND((G36+G$31)/G$29*100,0))))","v":"  "},null,{"$f":"IF(ISBLANK(I$29),\"  \",IF(ISBLANK(I$30),\" \",IF(ISBLANK(I36),\" \",ROUND((I36+I$31)/I$29*100,0))))","v":"  "},null,{"$f":"IF(ISBLANK(K$29),\"  \",IF(ISBLANK(K$30),\" \",IF(ISBLANK(K36),\" \",ROUND((K36+K$31)/K$29*100,0))))","v":"  "},null,{"$f":"IF(ISBLANK(M$29),\"  \",IF(ISBLANK(M$30),\" \",IF(ISBLANK(M36),\" \",ROUND((M36+M$31)/M$29*100,0))))","v":"  "}]
[{"$f":"IF(M4=\"Type AS1\",Spec!B$10,IF(M4=\"Type AS2\",Spec!C$10,IF(M4=\"Type AS3\",Spec!D$10,IF(M4=\"Type AS4\",Spec!E$10))))","v":"0-30"},8,null,{"$f":"IF(ISBLANK(C$29),\"  \",IF(ISBLANK(C$30),\" \",IF(ISBLANK(C37),\" \",ROUND((C37+C$31)/C$29*100,0))))","v":"  "},null,{"$f":"IF(ISBLANK(E$29),\"  \",IF(ISBLANK(E$30),\" \",IF(ISBLANK(E37),\" \",ROUND((E37+E$31)/E$29*100,0))))","v":"  "},null,{"$f":"IF(ISBLANK(G$29),\"  \",IF(ISBLANK(G$30),\" \",IF(ISBLANK(G37),\" \",ROUND((G37+G$31)/G$29*100,0))))","v":"  "},null,{"$f":"IF(ISBLANK(I$29),\"  \",IF(ISBLANK(I$30),\" \",IF(ISBLANK(I37),\" \",ROUND((I37+I$31)/I$29*100,0))))","v":"  "},null,{"$f":"IF(ISBLANK(K$29),\"  \",IF(ISBLANK(K$30),\" \",IF(ISBLANK(K37),\" \",ROUND((K37+K$31)/K$29*100,0))))","v":"  "},null,{"$f":"IF(ISBLANK(M$29),\"  \",IF(ISBLANK(M$30),\" \",IF(ISBLANK(M37),\" \",ROUND((M37+M$31)/M$29*100,0))))","v":"  "}]
[{"$f":"IF(M4=\"Type AS1\",Spec!B$11,IF(M4=\"Type AS2\",Spec!C$11,IF(M4=\"Type AS3\",Spec!D$11,IF(M4=\"Type AS4\",Spec!E$11))))","v":"0-8"},100,null,{"$f":"IF(ISBLANK(C$29),\"  \",IF(ISBLANK(C$30),\" \",IF(ISBLANK(C38),\" \",ROUND((C38+C$31)/C$29*100,0))))","v":"  "},null,{"$f":"IF(ISBLANK(E$29),\"  \",IF(ISBLANK(E$30),\" \",IF(ISBLANK(E38),\" \",ROUND((E38+E$31)/E$29*100,0))))","v":"  "},null,{"$f":"IF(ISBLANK(G$29),\"  \",IF(ISBLANK(G$30),\" \",IF(ISBLANK(G38),\" \",ROUND((G38+G$31)/G$29*100,0))))","v":"  "},null,{"$f":"IF(ISBLANK(I$29),\"  \",IF(ISBLANK(I$30),\" \",IF(ISBLANK(I38),\" \",ROUND((I38+I$31)/I$29*100,0))))","v":"  "},null,{"$f":"IF(ISBLANK(K$29),\"  \",IF(ISBLANK(K$30),\" \",IF(ISBLANK(K38),\" \",ROUND((K38+K$31)/K$29*100,0))))","v":"  "},null,{"$f":"IF(ISBLANK(M$29),\"  \",IF(ISBLANK(M$30),\" \",IF(ISBLANK(M38),\" \",ROUND((M38+M$31)/M$29*100,0))))","v":"  "}]
[{"$f":"IF(M4=\"Type AS1\",Spec!B$12,IF(M4=\"Type AS2\",Spec!C$12,IF(M4=\"Type AS3\",Spec!D$12,IF(M4=\"Type AS4\",Spec!E$12))))","v":"0-5"},200,null,{"$f":"IF(ISBLANK(C$29),\"  \",IF(ISBLANK(C$30),\" \",IF(ISBLANK(C39),\" \",ROUND((C39+C$31)/C$29*100,2))))","v":"  "},null,{"$f":"IF(ISBLANK(E$29),\"  \",IF(ISBLANK(E$30),\" \",IF(ISBLANK(E39),\" \",ROUND((E39+E$31)/E$29*100,2))))","v":"  "},null,{"$f":"IF(ISBLANK(G$29),\"  \",IF(ISBLANK(G$30),\" \",IF(ISBLANK(G39),\" \",ROUND((G39+G$31)/G$29*100,2))))","v":"  "},null,{"$f":"IF(ISBLANK(I$29),\"  \",IF(ISBLANK(I$30),\" \",IF(ISBLANK(I39),\" \",ROUND((I39+I$31)/I$29*100,2))))","v":"  "},null,{"$f":"IF(ISBLANK(K$29),\"  \",IF(ISBLANK(K$30),\" \",IF(ISBLANK(K39),\" \",ROUND((K39+K$31)/K$29*100,2))))","v":"  "},null,{"$f":"IF(ISBLANK(M$29),\"  \",IF(ISBLANK(M$30),\" \",IF(ISBLANK(M39),\" \",ROUND((M39+M$31)/M$29*100,2))))","v":"  "}]
["Tested By"]
["Remarks"]
[]
[]
[]
[]
[null,null,{"$f":"MAX(C14:C15)","v":0},null,{"$f":"MAX(E14:E15)","v":0},null,{"$f":"MAX(G14:G15)","v":0},null,{"$f":"MAX(I14:I15)","v":0},null,{"$f":"MAX(K14:K15)","v":0},null,{"$f":"MAX(M14:M15)","v":0}]
[null,null,{"$f":"MAX(C33:C34)","v":0},null,{"$f":"MAX(E33:E34)","v":0},null,{"$f":"MAX(G33:G34)","v":0},null,{"$f":"MAX(I33:I34)","v":0},null,{"$f":"MAX(K33:K34)","v":0},null,{"$f":"MAX(M33:M34)","v":0}]

{"sheet":"S8","index":7,"n_rows":47,"n_cols":14,"rows_kept":47,"cut":false,"hidden":true,"merged":[[3,10,3,11],[3,12,3,13],[0,0,3,1],[1,10,1,11],[1,12,1,13],[2,10,2,11],[2,12,2,13],[0,8,3,9],[1,2,1,7],[2,2,2,7],[3,2,3,7],[5,3,5,8],[7,0,7,1],[7,2,7,3],[7,4,7,5],[7,6,7,7],[7,8,7,9],[10,0,10,1],[9,0,9,1],[7,10,7,11],[7,12,7,13],[8,0,8,1],[8,2,8,3],[8,4,8,5],[8,6,8,7],[8,8,8,9],[8,10,8,11],[8,12,8,13],[21,12,24,13],[26,12,26,13],[27,12,27,13],[30,2,30,3],[11,10,11,11],[11,12,11,13],[11,4,11,5],[11,6,11,7],[11,8,11,9],[20,12,20,13],[30,10,30,11],[21,6,24,7],[27,2,27,3],[20,2,20,3],[26,2,26,3],[20,10,20,11],[28,0,28,1],[26,0,26,1],[27,0,27,1],[26,10,26,11],[21,0,24,1],[21,2,24,3],[21,4,24,5],[27,4,27,5],[27,6,27,7],[26,4,26,5],[26,6,26,7],[26,8,26,9],[39,6,39,7],[39,8,39,9],[11,0,11,1],[11,2,11,3],[21,8,24,9],[20,0,20,1],[39,0,39,1],[20,4,20,5],[20,6,20,7],[20,8,20,9],[30,0,30,1],[25,0,25,13],[21,10,24,11],[27,8,27,9],[27,10,27,11],[29,0,29,1],[4,0,4,1],[39,2,39,3],[30,12,30,13],[39,12,39,13],[40,0,43,1],[40,2,43,3],[40,4,43,5],[40,6,43,7],[40,8,43,9],[40,10,43,11],[40,12,43,13],[30,4,30,5],[30,6,30,7],[30,8,30,9],[39,10,39,11],[39,4,39,5]]}
[]
[null,null,"COMMONWEALTH OF PENNSYLVANIA",null,null,null,null,null,null,null,"DISTRICT",null,{"$f":"IF(ISBLANK('S1'!L2),\"\",'S1'!L2)","v":""}]
[null,null,"DEPARTMENT OF TRANSPORTATION",null,null,null,null,null,null,null,"PLANT CODE",null,{"$f":"IF(ISBLANK('S1'!L3),\"\",'S1'!L3)","v":""}]
[null,null,"PENNSYLVANIA TURNPIKE COMMISSION",null,null,null,null,null,null,null,"AGG SIZE",null,{"$f":"IF(ISBLANK('S1'!L4),\"\",'S1'!L4)","v":"Type AS4"}]
[{"$f":"'S1'!A5","v":"Aggregate 2023"}]
[null,null,null,{"$f":"'S1'!D6","v":"Material Test Results for Type AS4"}]
[]
["Sample No."]
["Date"]
[{"$f":"IF($M$4=\"Type AS3\",\"Starting Wt.\",\"St. Wt. Before Wash.\")","v":"St. Wt. Before Wash."},null,null,"% Loss",null,"% Loss",null,"% Loss",null,"% Loss",null,"% Loss",null,"% Loss"]
[{"$f":"IF($M$4=\"Type AS3\",\"Ending Wt.\",\"Dry. Wt. After Wash.\")","v":"Dry. Wt. After Wash."},null,null,{"$f":"IF(ISBLANK(C10),\" \",IF(ISBLANK(C15),\" \",IF($M$4=\"Type AS3\",(C10-C11)/C10*100,(C11-C46)/C11*100)))","v":" "},null,{"$f":"IF(ISBLANK(E10),\" \",IF(ISBLANK(E15),\" \",IF($M$4=\"Type AS3\",(E10-E11)/E10*100,(E11-E46)/E11*100)))","v":" "},null,{"$f":"IF(ISBLANK(G10),\" \",IF(ISBLANK(G15),\" \",IF($M$4=\"Type AS3\",(G10-G11)/G10*100,(G11-G46)/G11*100)))","v":" "},null,{"$f":"IF(ISBLANK(I10),\" \",IF(ISBLANK(I15),\" \",IF($M$4=\"Type AS3\",(I10-I11)/I10*100,(I11-I46)/I11*100)))","v":" "},null,{"$f":"IF(ISBLANK(K10),\" \",IF(ISBLANK(K15),\" \",IF($M$4=\"Type AS3\",(K10-K11)/K10*100,(K11-K46)/K11*100)))","v":" "},null,{"$f":"IF(ISBLANK(M10),\" \",IF(ISBLANK(M15),\" \",IF($M$4=\"Type AS3\",(M10-M11)/M10*100,(M11-M46)/M11*100)))","v":" "}]
["Wt. Loss",null,{"$f":"IF($M$4=\"Type AS3\",0,IF(ISBLANK(C10),\" \",IF(ISBLANK(C11),\" \",C10-C11)))","v":" "},null,{"$f":"IF($M$4=\"Type AS3\",0,IF(ISBLANK(E10),\" \",IF(ISBLANK(E11),\" \",E10-E11)))","v":" "},null,{"$f":"IF($M$4=\"Type AS3\",0,IF(ISBLANK(G10),\" \",IF(ISBLANK(G11),\" \",G10-G11)))","v":" "},null,{"$f":"IF($M$4=\"Type AS3\",0,IF(ISBLANK(I10),\" \",IF(ISBLANK(I11),\" \",I10-I11)))","v":" "},null,{"$f":"IF($M$4=\"Type AS3\",0,IF(ISBLANK(K10),\" \",IF(ISBLANK(K11),\" \",K10-K11)))","v":" "},null,{"$f":"IF($M$4=\"Type AS3\",0,IF(ISBLANK(M10),\" \",IF(ISBLANK(M11),\" \",M10-M11)))","v":" "}]
["Spec","Sieve","Wt","% Passing","Wt","% Passing","Wt","% Passing","Wt","% Passing","Wt","% Passing","Wt","% Passing"]
[100,0.5,null,{"$f":"IF(ISBLANK(C$10),\"  \",IF(ISBLANK(C$11),\" \",IF(ISBLANK(C14),\" \",ROUND((C14+C$12)/C$10*100,1))))","v":"  "},null,{"$f":"IF(ISBLANK(E$10),\"  \",IF(ISBLANK(E$11),\" \",IF(ISBLANK(E14),\" \",ROUND((E14+E$12)/E$10*100,0))))","v":"  "},null,{"$f":"IF(ISBLANK(G$10),\"  \",IF(ISBLANK(G$11),\" \",IF(ISBLANK(G14),\" \",ROUND((G14+G$12)/G$10*100,1))))","v":"  "},null,{"$f":"IF(ISBLANK(I$10),\"  \",IF(ISBLANK(I$11),\" \",IF(ISBLANK(I14),\" \",ROUND((I14+I$12)/I$10*100,1))))","v":"  "},null,{"$f":"IF(ISBLANK(K$10),\"  \",IF(ISBLANK(K$11),\" \",IF(ISBLANK(K14),\" \",ROUND((K14+K$12)/K$10*100,1))))","v":"  "},null,{"$f":"IF(ISBLANK(M$10),\"  \",IF(ISBLANK(M$11),\" \",IF(ISBLANK(M14),\" \",ROUND((M14+M$12)/M$10*100,1))))","v":"  "}]
[{"$f":"IF(M$4=\"Type AS3\",\"90-100\",\"100\")","v":"100"},0.375,null,{"$f":"IF(ISBLANK(C$10),\"  \",IF(ISBLANK(C$11),\" \",IF(ISBLANK(C15),\" \",ROUND((C15+C$12)/C$10*100,1))))","v":"  "},null,"  ",null,{"$f":"IF(ISBLANK(G$10),\"  \",IF(ISBLANK(G$11),\" \",IF(ISBLANK(G15),\" \",ROUND((G15+G$12)/G$10*100,1))))","v":"  "},null,{"$f":"IF(ISBLANK(I$10),\"  \",IF(ISBLANK(I$11),\" \",IF(ISBLANK(I15),\" \",ROUND((I15+I$12)/I$10*100,1))))","v":"  "},null,{"$f":"IF(ISBLANK(K$10),\"  \",IF(ISBLANK(K$11),\" \",IF(ISBLANK(K15),\" \",ROUND((K15+K$12)/K$10*100,1))))","v":"  "},null,{"$f":"IF(ISBLANK(M$10),\"  \",IF(ISBLANK(M$11),\" \",IF(ISBLANK(M15),\" \",ROUND((M15+M$12)/M$10*100,1))))","v":"  "}]
["Breaker",0.25,null,{"$f":"IF(ISBLANK(C$10),\"  \",IF(ISBLANK(C$11),\" \",IF(ISBLANK(C16),\" \",ROUND((C16+C$12)/C$10*100,0))))","v":"  "},null,"  ",null,{"$f":"IF(ISBLANK(G$10),\"  \",IF(ISBLANK(G$11),\" \",IF(ISBLANK(G16),\" \",ROUND((G16+G$12)/G$10*100,0))))","v":"  "},null,{"$f":"IF(ISBLANK(I$10),\"  \",IF(ISBLANK(I$11),\" \",IF(ISBLANK(I16),\" \",ROUND((I16+I$12)/I$10*100,0))))","v":"  "},null,{"$f":"IF(ISBLANK(K$10),\"  \",IF(ISBLANK(K$11),\" \",IF(ISBLANK(K16),\" \",ROUND((K16+K$12)/K$10*100,0))))","v":"  "},null,{"$f":"IF(ISBLANK(M$10),\"  \",IF(ISBLANK(M$11),\" \",IF(ISBLANK(M16),\" \",ROUND((M16+M$12)/M$10*100,0))))","v":"  "}]
[{"$f":"IF(M4=\"Type AS1\",Spec!B$9,IF(M4=\"Type AS2\",Spec!C$9,IF(M4=\"Type AS3\",Spec!D$9,IF(M4=\"Type AS4\",Spec!E$9))))","v":0},4,null,{"$f":"IF(ISBLANK(C$10),\"  \",IF(ISBLANK(C$11),\" \",IF(ISBLANK(C17),\" \",ROUND((C17+C$12)/C$10*100,0))))","v":"  "},null,"  ",null,{"$f":"IF(ISBLANK(G$10),\"  \",IF(ISBLANK(G$11),\" \",IF(ISBLANK(G17),\" \",ROUND((G17+G$12)/G$10*100,0))))","v":"  "},null,{"$f":"IF(ISBLANK(I$10),\"  \",IF(ISBLANK(I$11),\" \",IF(ISBLANK(I17),\" \",ROUND((I17+I$12)/I$10*100,0))))","v":"  "},null,{"$f":"IF(ISBLANK(K$10),\"  \",IF(ISBLANK(K$11),\" \",IF(ISBLANK(K17),\" \",ROUND((K17+K$12)/K$10*100,0))))","v":"  "},null,{"$f":"IF(ISBLANK(M$10),\"  \",IF(ISBLANK(M$11),\" \",IF(ISBLANK(M17),\" \",ROUND((M17+M$12)/M$10*100,0))))","v":"  "}]
[{"$f":"IF(M4=\"Type AS1\",Spec!B$10,IF(M4=\"Type AS2\",Spec!C$10,IF(M4=\"Type AS3\",Spec!D$10,IF(M4=\"Type AS4\",Spec!E$10))))","v":"0-30"},8,null,{"$f":"IF(ISBLANK(C$10),\"  \",IF(ISBLANK(C$11),\" \",IF(ISBLANK(C18),\" \",ROUND((C18+C$12)/C$10*100,0))))","v":"  "},null,"  ",null,{"$f":"IF(ISBLANK(G$10),\"  \",IF(ISBLANK(G$11),\" \",IF(ISBLANK(G18),\" \",ROUND((G18+G$12)/G$10*100,0))))","v":"  "},null,{"$f":"IF(ISBLANK(I$10),\"  \",IF(ISBLANK(I$11),\" \",IF(ISBLANK(I18),\" \",ROUND((I18+I$12)/I$10*100,0))))","v":"  "},null,{"$f":"IF(ISBLANK(K$10),\"  \",IF(ISBLANK(K$11),\" \",IF(ISBLANK(K18),\" \",ROUND((K18+K$12)/K$10*100,0))))","v":"  "},null,{"$f":"IF(ISBLANK(M$10),\"  \",IF(ISBLANK(M$11),\" \",IF(ISBLANK(M18),\" \",ROUND((M18+M$12)/M$10*100,0))))","v":"  "}]
[{"$f":"IF(M4=\"Type AS1\",Spec!B$11,IF(M4=\"Type AS2\",Spec!C$11,IF(M4=\"Type AS3\",Spec!D$11,IF(M4=\"Type AS4\",Spec!E$11))))","v":"0-8"},100,null,{"$f":"IF(ISBLANK(C$10),\"  \",IF(ISBLANK(C$11),\" \",IF(ISBLANK(C19),\" \",ROUND((C19+C$12)/C$10*100,0))))","v":"  "},null,"  ",null,{"$f":"IF(ISBLANK(G$10),\"  \",IF(ISBLANK(G$11),\" \",IF(ISBLANK(G19),\" \",ROUND((G19+G$12)/G$10*100,0))))","v":"  "},null,{"$f":"IF(ISBLANK(I$10),\"  \",IF(ISBLANK(I$11),\" \",IF(ISBLANK(I19),\" \",ROUND((I19+I$12)/I$10*100,0))))","v":"  "},null,{"$f":"IF(ISBLANK(K$10),\"  \",IF(ISBLANK(K$11),\" \",IF(ISBLANK(K19),\" \",ROUND((K19+K$12)/K$10*100,0))))","v":"  "},null,{"$f":"IF(ISBLANK(M$10),\"  \",IF(ISBLANK(M$11),\" \",IF(ISBLANK(M19),\" \",ROUND((M19+M$12)/M$10*100,0))))","v":"  "}]
[{"$f":"IF(M4=\"Type AS1\",Spec!B$12,IF(M4=\"Type AS2\",Spec!C$12,IF(M4=\"Type AS3\",Spec!D$12,IF(M4=\"Type AS4\",Spec!E$12))))","v":"0-5"},200,null,{"$f":"IF(ISBLANK(C$10),\"  \",IF(ISBLANK(C$11),\" \",IF(ISBLANK(C20),\" \",ROUND((C20+C$12)/C$10*100,2))))","v":"  "},null,{"$f":"IF(ISBLANK(E$10),\"  \",IF(ISBLANK(E$11),\" \",IF(ISBLANK(E20),\" \",ROUND((E20+E$12)/E$10*100,2))))","v":"  "},null,{"$f":"IF(ISBLANK(G$10),\"  \",IF(ISBLANK(G$11),\" \",IF(ISBLANK(G20),\" \",ROUND((G20+G$12)/G$10*100,2))))","v":"  "},null,{"$f":"IF(ISBLANK(I$10),\"  \",IF(ISBLANK(I$11),\" \",IF(ISBLANK(I20),\" \",ROUND((I20+I$12)/I$10*100,2))))","v":"  "},null,{"$f":"IF(ISBLANK(K$10),\"  \",IF(ISBLANK(K$11),\" \",IF(ISBLANK(K20),\" \",ROUND((K20+K$12)/K$10*100,2))))","v":"  "},null,{"$f":"IF(ISBLANK(M$10),\"  \",IF(ISBLANK(M$11),\" \",IF(ISBLANK(M20),\" \",ROUND((M20+M$12)/M$10*100,2))))","v":"  "}]
["Tested By"]
["Remarks"]
[]
[]
[]
[{"$f":"'S1'!A26","v":""}]
["Sample No."]
["Date"]
[{"$f":"IF($M$4=\"Type AS3\",\"Starting Wt.\",\"St. Wt. Before Wash.\")","v":"St. Wt. Before Wash."},null,null,"% Loss",null,"% Loss",null,"% Loss",null,"% Loss",null,"% Loss",null,"% Loss"]
[{"$f":"IF($M$4=\"Type AS3\",\"Ending Wt.\",\"Dry. Wt. After Wash.\")","v":"Dry. Wt. After Wash."},null,null,{"$f":"IF(ISBLANK(C29),\" \",IF(ISBLANK(C34),\" \",IF($M$4=\"Type AS3\",(C29-C30)/C29*100,(C30-C47)/C30*100)))","v":" "},null,{"$f":"IF(ISBLANK(E29),\" \",IF(ISBLANK(E34),\" \",IF($M$4=\"Type AS3\",(E29-E30)/E29*100,(E30-E47)/E30*100)))","v":" "},null,{"$f":"IF(ISBLANK(G29),\" \",IF(ISBLANK(G34),\" \",IF($M$4=\"Type AS3\",(G29-G30)/G29*100,(G30-G47)/G30*100)))","v":" "},null,{"$f":"IF(ISBLANK(I29),\" \",IF(ISBLANK(I34),\" \",IF($M$4=\"Type AS3\",(I29-I30)/I29*100,(I30-I47)/I30*100)))","v":" "},null,{"$f":"IF(ISBLANK(K29),\" \",IF(ISBLANK(K34),\" \",IF($M$4=\"Type AS3\",(K29-K30)/K29*100,(K30-K47)/K30*100)))","v":" "},null,{"$f":"IF(ISBLANK(M29),\" \",IF(ISBLANK(M34),\" \",IF($M$4=\"Type AS3\",(M29-M30)/M29*100,(M30-M47)/M30*100)))","v":" "}]
["Wt. Loss",null,{"$f":"IF($M$4=\"Type AS3\",0,IF(ISBLANK(C29),\" \",IF(ISBLANK(C30),\" \",C29-C30)))","v":" "},null,{"$f":"IF($M$4=\"Type AS3\",0,IF(ISBLANK(E29),\" \",IF(ISBLANK(E30),\" \",E29-E30)))","v":" "},null,{"$f":"IF($M$4=\"Type AS3\",0,IF(ISBLANK(G29),\" \",IF(ISBLANK(G30),\" \",G29-G30)))","v":" "},null,{"$f":"IF($M$4=\"Type AS3\",0,IF(ISBLANK(I29),\" \",IF(ISBLANK(I30),\" \",I29-I30)))","v":" "},null,{"$f":"IF($M$4=\"Type AS3\",0,IF(ISBLANK(K29),\" \",IF(ISBLANK(K30),\" \",K29-K30)))","v":" "},null,{"$f":"IF($M$4=\"Type AS3\",0,IF(ISBLANK(M29),\" \",IF(ISBLANK(M30),\" \",M29-M30)))","v":" "}]
["Spec","Sieve","Wt","% Passing","Wt","% Passing","Wt","% Passing","Wt","% Passing","Wt","% Passing","Wt","% Passing"]
[100,0.5,null,{"$f":"IF(ISBLANK(C$29),\"  \",IF(ISBLANK(C$30),\" \",IF(ISBLANK(C33),\" \",ROUND((C33+C$31)/C$29*100,1))))","v":"  "},null,{"$f":"IF(ISBLANK(E$29),\"  \",IF(ISBLANK(E$30),\" \",IF(ISBLANK(E33),\" \",ROUND((E33+E$31)/E$29*100,1))))","v":"  "},null,{"$f":"IF(ISBLANK(G$29),\"  \",IF(ISBLANK(G$30),\" \",IF(ISBLANK(G33),\" \",ROUND((G33+G$31)/G$29*100,1))))","v":"  "},null,{"$f":"IF(ISBLANK(I$29),\"  \",IF(ISBLANK(I$30),\" \",IF(ISBLANK(I33),\" \",ROUND((I33+I$31)/I$29*100,1))))","v":"  "},null,{"$f":"IF(ISBLANK(K$29),\"  \",IF(ISBLANK(K$30),\" \",IF(ISBLANK(K33),\" \",ROUND((K33+K$31)/K$29*100,1))))","v":"  "},null,{"$f":"IF(ISBLANK(M$29),\"  \",IF(ISBLANK(M$30),\" \",IF(ISBLANK(M33),\" \",ROUND((M33+M$31)/M$29*100,1))))","v":"  "}]
[{"$f":"IF(M$4=\"Type AS3\",\"90-100\",\"100\")","v":"100"},0.375,null,{"$f":"IF(ISBLANK(C$29),\"  \",IF(ISBLANK(C$30),\" \",IF(ISBLANK(C34),\" \",ROUND((C34+C$31)/C$29*100,1))))","v":"  "},null,{"$f":"IF(ISBLANK(E$29),\"  \",IF(ISBLANK(E$30),\" \",IF(ISBLANK(E34),\" \",ROUND((E34+E$31)/E$29*100,1))))","v":"  "},null,{"$f":"IF(ISBLANK(G$29),\"  \",IF(ISBLANK(G$30),\" \",IF(ISBLANK(G34),\" \",ROUND((G34+G$31)/G$29*100,1))))","v":"  "},null,{"$f":"IF(ISBLANK(I$29),\"  \",IF(ISBLANK(I$30),\" \",IF(ISBLANK(I34),\" \",ROUND((I34+I$31)/I$29*100,1))))","v":"  "},null,{"$f":"IF(ISBLANK(K$29),\"  \",IF(ISBLANK(K$30),\" \",IF(ISBLANK(K34),\" \",ROUND((K34+K$31)/K$29*100,1))))","v":"  "},null,{"$f":"IF(ISBLANK(M$29),\"  \",IF(ISBLANK(M$30),\" \",IF(ISBLANK(M34),\" \",ROUND((M34+M$31)/M$29*100,1))))","v":"  "}]
["Breaker",0.25,null,{"$f":"IF(ISBLANK(C$29),\"  \",IF(ISBLANK(C$30),\" \",IF(ISBLANK(C35),\" \",ROUND((C35+C$31)/C$29*100,0))))","v":"  "},null,{"$f":"IF(ISBLANK(E$29),\"  \",IF(ISBLANK(E$30),\" \",IF(ISBLANK(E35),\" \",ROUND((E35+E$31)/E$29*100,0))))","v":"  "},null,{"$f":"IF(ISBLANK(G$29),\"  \",IF(ISBLANK(G$30),\" \",IF(ISBLANK(G35),\" \",ROUND((G35+G$31)/G$29*100,0))))","v":"  "},null,{"$f":"IF(ISBLANK(I$29),\"  \",IF(ISBLANK(I$30),\" \",IF(ISBLANK(I35),\" \",ROUND((I35+I$31)/I$29*100,0))))","v":"  "},null,{"$f":"IF(ISBLANK(K$29),\"  \",IF(ISBLANK(K$30),\" \",IF(ISBLANK(K35),\" \",ROUND((K35+K$31)/K$29*100,0))))","v":"  "},null,{"$f":"IF(ISBLANK(M$29),\"  \",IF(ISBLANK(M$30),\" \",IF(ISBLANK(M35),\" \",ROUND((M35+M$31)/M$29*100,0))))","v":"  "}]
[{"$f":"IF(M4=\"Type AS1\",Spec!B$9,IF(M4=\"Type AS2\",Spec!C$9,IF(M4=\"Type AS3\",Spec!D$9,IF(M4=\"Type AS4\",Spec!E$9))))","v":0},4,null,{"$f":"IF(ISBLANK(C$29),\"  \",IF(ISBLANK(C$30),\" \",IF(ISBLANK(C36),\" \",ROUND((C36+C$31)/C$29*100,0))))","v":"  "},null,{"$f":"IF(ISBLANK(E$29),\"  \",IF(ISBLANK(E$30),\" \",IF(ISBLANK(E36),\" \",ROUND((E36+E$31)/E$29*100,0))))","v":"  "},null,{"$f":"IF(ISBLANK(G$29),\"  \",IF(ISBLANK(G$30),\" \",IF(ISBLANK(G36),\" \",ROUND((G36+G$31)/G$29*100,0))))","v":"  "},null,{"$f":"IF(ISBLANK(I$29),\"  \",IF(ISBLANK(I$30),\" \",IF(ISBLANK(I36),\" \",ROUND((I36+I$31)/I$29*100,0))))","v":"  "},null,{"$f":"IF(ISBLANK(K$29),\"  \",IF(ISBLANK(K$30),\" \",IF(ISBLANK(K36),\" \",ROUND((K36+K$31)/K$29*100,0))))","v":"  "},null,{"$f":"IF(ISBLANK(M$29),\"  \",IF(ISBLANK(M$30),\" \",IF(ISBLANK(M36),\" \",ROUND((M36+M$31)/M$29*100,0))))","v":"  "}]
[{"$f":"IF(M4=\"Type AS1\",Spec!B$10,IF(M4=\"Type AS2\",Spec!C$10,IF(M4=\"Type AS3\",Spec!D$10,IF(M4=\"Type AS4\",Spec!E$10))))","v":"0-30"},8,null,{"$f":"IF(ISBLANK(C$29),\"  \",IF(ISBLANK(C$30),\" \",IF(ISBLANK(C37),\" \",ROUND((C37+C$31)/C$29*100,0))))","v":"  "},null,{"$f":"IF(ISBLANK(E$29),\"  \",IF(ISBLANK(E$30),\" \",IF(ISBLANK(E37),\" \",ROUND((E37+E$31)/E$29*100,0))))","v":"  "},null,{"$f":"IF(ISBLANK(G$29),\"  \",IF(ISBLANK(G$30),\" \",IF(ISBLANK(G37),\" \",ROUND((G37+G$31)/G$29*100,0))))","v":"  "},null,{"$f":"IF(ISBLANK(I$29),\"  \",IF(ISBLANK(I$30),\" \",IF(ISBLANK(I37),\" \",ROUND((I37+I$31)/I$29*100,0))))","v":"  "},null,{"$f":"IF(ISBLANK(K$29),\"  \",IF(ISBLANK(K$30),\" \",IF(ISBLANK(K37),\" \",ROUND((K37+K$31)/K$29*100,0))))","v":"  "},null,{"$f":"IF(ISBLANK(M$29),\"  \",IF(ISBLANK(M$30),\" \",IF(ISBLANK(M37),\" \",ROUND((M37+M$31)/M$29*100,0))))","v":"  "}]
[{"$f":"IF(M4=\"Type AS1\",Spec!B$11,IF(M4=\"Type AS2\",Spec!C$11,IF(M4=\"Type AS3\",Spec!D$11,IF(M4=\"Type AS4\",Spec!E$11))))","v":"0-8"},100,null,{"$f":"IF(ISBLANK(C$29),\"  \",IF(ISBLANK(C$30),\" \",IF(ISBLANK(C38),\" \",ROUND((C38+C$31)/C$29*100,0))))","v":"  "},null,{"$f":"IF(ISBLANK(E$29),\"  \",IF(ISBLANK(E$30),\" \",IF(ISBLANK(E38),\" \",ROUND((E38+E$31)/E$29*100,0))))","v":"  "},null,{"$f":"IF(ISBLANK(G$29),\"  \",IF(ISBLANK(G$30),\" \",IF(ISBLANK(G38),\" \",ROUND((G38+G$31)/G$29*100,0))))","v":"  "},null,{"$f":"IF(ISBLANK(I$29),\"  \",IF(ISBLANK(I$30),\" \",IF(ISBLANK(I38),\" \",ROUND((I38+I$31)/I$29*100,0))))","v":"  "},null,{"$f":"IF(ISBLANK(K$29),\"  \",IF(ISBLANK(K$30),\" \",IF(ISBLANK(K38),\" \",ROUND((K38+K$31)/K$29*100,0))))","v":"  "},null,{"$f":"IF(ISBLANK(M$29),\"  \",IF(ISBLANK(M$30),\" \",IF(ISBLANK(M38),\" \",ROUND((M38+M$31)/M$29*100,0))))","v":"  "}]
[{"$f":"IF(M4=\"Type AS1\",Spec!B$12,IF(M4=\"Type AS2\",Spec!C$12,IF(M4=\"Type AS3\",Spec!D$12,IF(M4=\"Type AS4\",Spec!E$12))))","v":"0-5"},200,null,{"$f":"IF(ISBLANK(C$29),\"  \",IF(ISBLANK(C$30),\" \",IF(ISBLANK(C39),\" \",ROUND((C39+C$31)/C$29*100,2))))","v":"  "},null,{"$f":"IF(ISBLANK(E$29),\"  \",IF(ISBLANK(E$30),\" \",IF(ISBLANK(E39),\" \",ROUND((E39+E$31)/E$29*100,2))))","v":"  "},null,{"$f":"IF(ISBLANK(G$29),\"  \",IF(ISBLANK(G$30),\" \",IF(ISBLANK(G39),\" \",ROUND((G39+G$31)/G$29*100,2))))","v":"  "},null,{"$f":"IF(ISBLANK(I$29),\"  \",IF(ISBLANK(I$30),\" \",IF(ISBLANK(I39),\" \",ROUND((I39+I$31)/I$29*100,2))))","v":"  "},null,{"$f":"IF(ISBLANK(K$29),\"  \",IF(ISBLANK(K$30),\" \",IF(ISBLANK(K39),\" \",ROUND((K39+K$31)/K$29*100,2))))","v":"  "},null,{"$f":"IF(ISBLANK(M$29),\"  \",IF(ISBLANK(M$30),\" \",IF(ISBLANK(M39),\" \",ROUND((M39+M$31)/M$29*100,2))))","v":"  "}]
["Tested By"]
["Remarks"]
[]
[]
[]
[]
[null,null,{"$f":"MAX(C14:C15)","v":0},null,{"$f":"MAX(E14:E15)","v":0},null,{"$f":"MAX(G14:G15)","v":0},null,{"$f":"MAX(I14:I15)","v":0},null,{"$f":"MAX(K14:K15)","v":0},null,{"$f":"MAX(M14:M15)","v":0}]
[null,null,{"$f":"MAX(C33:C34)","v":0},null,{"$f":"MAX(E33:E34)","v":0},null,{"$f":"MAX(G33:G34)","v":0},null,{"$f":"MAX(I33:I34)","v":0},null,{"$f":"MAX(K33:K34)","v":0},null,{"$f":"MAX(M33:M34)","v":0}]

{"sheet":"S9","index":8,"n_rows":47,"n_cols":14,"rows_kept":47,"cut":false,"hidden":true,"merged":[[3,10,3,11],[3,12,3,13],[0,0,3,1],[1,10,1,11],[1,12,1,13],[2,10,2,11],[2,12,2,13],[0,8,3,9],[1,2,1,7],[2,2,2,7],[3,2,3,7],[5,3,5,8],[7,0,7,1],[7,2,7,3],[7,4,7,5],[7,6,7,7],[7,8,7,9],[10,0,10,1],[9,0,9,1],[7,10,7,11],[7,12,7,13],[8,0,8,1],[8,2,8,3],[8,4,8,5],[8,6,8,7],[8,8,8,9],[8,10,8,11],[8,12,8,13],[21,12,24,13],[26,12,26,13],[27,12,27,13],[30,2,30,3],[11,10,11,11],[11,12,11,13],[11,4,11,5],[11,6,11,7],[11,8,11,9],[20,12,20,13],[30,10,30,11],[21,6,24,7],[27,2,27,3],[20,2,20,3],[26,2,26,3],[20,10,20,11],[28,0,28,1],[26,0,26,1],[27,0,27,1],[26,10,26,11],[21,0,24,1],[21,2,24,3],[21,4,24,5],[27,4,27,5],[27,6,27,7],[26,4,26,5],[26,6,26,7],[26,8,26,9],[39,6,39,7],[39,8,39,9],[11,0,11,1],[11,2,11,3],[21,8,24,9],[20,0,20,1],[39,0,39,1],[20,4,20,5],[20,6,20,7],[20,8,20,9],[30,0,30,1],[25,0,25,13],[21,10,24,11],[27,8,27,9],[27,10,27,11],[29,0,29,1],[4,0,4,1],[39,2,39,3],[30,12,30,13],[39,12,39,13],[40,0,43,1],[40,2,43,3],[40,4,43,5],[40,6,43,7],[40,8,43,9],[40,10,43,11],[40,12,43,13],[30,4,30,5],[30,6,30,7],[30,8,30,9],[39,10,39,11],[39,4,39,5]]}
[]
[null,null,"COMMONWEALTH OF PENNSYLVANIA",null,null,null,null,null,null,null,"DISTRICT",null,{"$f":"IF(ISBLANK('S1'!L2),\"\",'S1'!L2)","v":""}]
[null,null,"DEPARTMENT OF TRANSPORTATION",null,null,null,null,null,null,null,"PLANT CODE",null,{"$f":"IF(ISBLANK('S1'!L3),\"\",'S1'!L3)","v":""}]
[null,null,"PENNSYLVANIA TURNPIKE COMMISSION",null,null,null,null,null,null,null,"AGG SIZE",null,{"$f":"IF(ISBLANK('S1'!L4),\"\",'S1'!L4)","v":"Type AS4"}]
[{"$f":"'S1'!A5","v":"Aggregate 2023"}]
[null,null,null,{"$f":"'S1'!D6","v":"Material Test Results for Type AS4"}]
[]
["Sample No."]
["Date"]
[{"$f":"IF($M$4=\"Type AS3\",\"Starting Wt.\",\"St. Wt. Before Wash.\")","v":"St. Wt. Before Wash."},null,null,"% Loss",null,"% Loss",null,"% Loss",null,"% Loss",null,"% Loss",null,"% Loss"]
[{"$f":"IF($M$4=\"Type AS3\",\"Ending Wt.\",\"Dry. Wt. After Wash.\")","v":"Dry. Wt. After Wash."},null,null,{"$f":"IF(ISBLANK(C10),\" \",IF(ISBLANK(C15),\" \",IF($M$4=\"Type AS3\",(C10-C11)/C10*100,(C11-C46)/C11*100)))","v":" "},null,{"$f":"IF(ISBLANK(E10),\" \",IF(ISBLANK(E15),\" \",IF($M$4=\"Type AS3\",(E10-E11)/E10*100,(E11-E46)/E11*100)))","v":" "},null,{"$f":"IF(ISBLANK(G10),\" \",IF(ISBLANK(G15),\" \",IF($M$4=\"Type AS3\",(G10-G11)/G10*100,(G11-G46)/G11*100)))","v":" "},null,{"$f":"IF(ISBLANK(I10),\" \",IF(ISBLANK(I15),\" \",IF($M$4=\"Type AS3\",(I10-I11)/I10*100,(I11-I46)/I11*100)))","v":" "},null,{"$f":"IF(ISBLANK(K10),\" \",IF(ISBLANK(K15),\" \",IF($M$4=\"Type AS3\",(K10-K11)/K10*100,(K11-K46)/K11*100)))","v":" "},null,{"$f":"IF(ISBLANK(M10),\" \",IF(ISBLANK(M15),\" \",IF($M$4=\"Type AS3\",(M10-M11)/M10*100,(M11-M46)/M11*100)))","v":" "}]
["Wt. Loss",null,{"$f":"IF($M$4=\"Type AS3\",0,IF(ISBLANK(C10),\" \",IF(ISBLANK(C11),\" \",C10-C11)))","v":" "},null,{"$f":"IF($M$4=\"Type AS3\",0,IF(ISBLANK(E10),\" \",IF(ISBLANK(E11),\" \",E10-E11)))","v":" "},null,{"$f":"IF($M$4=\"Type AS3\",0,IF(ISBLANK(G10),\" \",IF(ISBLANK(G11),\" \",G10-G11)))","v":" "},null,{"$f":"IF($M$4=\"Type AS3\",0,IF(ISBLANK(I10),\" \",IF(ISBLANK(I11),\" \",I10-I11)))","v":" "},null,{"$f":"IF($M$4=\"Type AS3\",0,IF(ISBLANK(K10),\" \",IF(ISBLANK(K11),\" \",K10-K11)))","v":" "},null,{"$f":"IF($M$4=\"Type AS3\",0,IF(ISBLANK(M10),\" \",IF(ISBLANK(M11),\" \",M10-M11)))","v":" "}]
["Spec","Sieve","Wt","% Passing","Wt","% Passing","Wt","% Passing","Wt","% Passing","Wt","% Passing","Wt","% Passing"]
[100,0.5,null,{"$f":"IF(ISBLANK(C$10),\"  \",IF(ISBLANK(C$11),\" \",IF(ISBLANK(C14),\" \",ROUND((C14+C$12)/C$10*100,1))))","v":"  "},null,{"$f":"IF(ISBLANK(E$10),\"  \",IF(ISBLANK(E$11),\" \",IF(ISBLANK(E14),\" \",ROUND((E14+E$12)/E$10*100,0))))","v":"  "},null,{"$f":"IF(ISBLANK(G$10),\"  \",IF(ISBLANK(G$11),\" \",IF(ISBLANK(G14),\" \",ROUND((G14+G$12)/G$10*100,1))))","v":"  "},null,{"$f":"IF(ISBLANK(I$10),\"  \",IF(ISBLANK(I$11),\" \",IF(ISBLANK(I14),\" \",ROUND((I14+I$12)/I$10*100,1))))","v":"  "},null,{"$f":"IF(ISBLANK(K$10),\"  \",IF(ISBLANK(K$11),\" \",IF(ISBLANK(K14),\" \",ROUND((K14+K$12)/K$10*100,1))))","v":"  "},null,{"$f":"IF(ISBLANK(M$10),\"  \",IF(ISBLANK(M$11),\" \",IF(ISBLANK(M14),\" \",ROUND((M14+M$12)/M$10*100,1))))","v":"  "}]
[{"$f":"IF(M$4=\"Type AS3\",\"90-100\",\"100\")","v":"100"},0.375,null,{"$f":"IF(ISBLANK(C$10),\"  \",IF(ISBLANK(C$11),\" \",IF(ISBLANK(C15),\" \",ROUND((C15+C$12)/C$10*100,1))))","v":"  "},null,"  ",null,{"$f":"IF(ISBLANK(G$10),\"  \",IF(ISBLANK(G$11),\" \",IF(ISBLANK(G15),\" \",ROUND((G15+G$12)/G$10*100,1))))","v":"  "},null,{"$f":"IF(ISBLANK(I$10),\"  \",IF(ISBLANK(I$11),\" \",IF(ISBLANK(I15),\" \",ROUND((I15+I$12)/I$10*100,1))))","v":"  "},null,{"$f":"IF(ISBLANK(K$10),\"  \",IF(ISBLANK(K$11),\" \",IF(ISBLANK(K15),\" \",ROUND((K15+K$12)/K$10*100,1))))","v":"  "},null,{"$f":"IF(ISBLANK(M$10),\"  \",IF(ISBLANK(M$11),\" \",IF(ISBLANK(M15),\" \",ROUND((M15+M$12)/M$10*100,1))))","v":"  "}]
["Breaker",0.25,null,{"$f":"IF(ISBLANK(C$10),\"  \",IF(ISBLANK(C$11),\" \",IF(ISBLANK(C16),\" \",ROUND((C16+C$12)/C$10*100,0))))","v":"  "},null,"  ",null,{"$f":"IF(ISBLANK(G$10),\"  \",IF(ISBLANK(G$11),\" \",IF(ISBLANK(G16),\" \",ROUND((G16+G$12)/G$10*100,0))))","v":"  "},null,{"$f":"IF(ISBLANK(I$10),\"  \",IF(ISBLANK(I$11),\" \",IF(ISBLANK(I16),\" \",ROUND((I16+I$12)/I$10*100,0))))","v":"  "},null,{"$f":"IF(ISBLANK(K$10),\"  \",IF(ISBLANK(K$11),\" \",IF(ISBLANK(K16),\" \",ROUND((K16+K$12)/K$10*100,0))))","v":"  "},null,{"$f":"IF(ISBLANK(M$10),\"  \",IF(ISBLANK(M$11),\" \",IF(ISBLANK(M16),\" \",ROUND((M16+M$12)/M$10*100,0))))","v":"  "}]
[{"$f":"IF(M4=\"Type AS1\",Spec!B$9,IF(M4=\"Type AS2\",Spec!C$9,IF(M4=\"Type AS3\",Spec!D$9,IF(M4=\"Type AS4\",Spec!E$9))))","v":0},4,null,{"$f":"IF(ISBLANK(C$10),\"  \",IF(ISBLANK(C$11),\" \",IF(ISBLANK(C17),\" \",ROUND((C17+C$12)/C$10*100,0))))","v":"  "},null,"  ",null,{"$f":"IF(ISBLANK(G$10),\"  \",IF(ISBLANK(G$11),\" \",IF(ISBLANK(G17),\" \",ROUND((G17+G$12)/G$10*100,0))))","v":"  "},null,{"$f":"IF(ISBLANK(I$10),\"  \",IF(ISBLANK(I$11),\" \",IF(ISBLANK(I17),\" \",ROUND((I17+I$12)/I$10*100,0))))","v":"  "},null,{"$f":"IF(ISBLANK(K$10),\"  \",IF(ISBLANK(K$11),\" \",IF(ISBLANK(K17),\" \",ROUND((K17+K$12)/K$10*100,0))))","v":"  "},null,{"$f":"IF(ISBLANK(M$10),\"  \",IF(ISBLANK(M$11),\" \",IF(ISBLANK(M17),\" \",ROUND((M17+M$12)/M$10*100,0))))","v":"  "}]
[{"$f":"IF(M4=\"Type AS1\",Spec!B$10,IF(M4=\"Type AS2\",Spec!C$10,IF(M4=\"Type AS3\",Spec!D$10,IF(M4=\"Type AS4\",Spec!E$10))))","v":"0-30"},8,null,{"$f":"IF(ISBLANK(C$10),\"  \",IF(ISBLANK(C$11),\" \",IF(ISBLANK(C18),\" \",ROUND((C18+C$12)/C$10*100,0))))","v":"  "},null,"  ",null,{"$f":"IF(ISBLANK(G$10),\"  \",IF(ISBLANK(G$11),\" \",IF(ISBLANK(G18),\" \",ROUND((G18+G$12)/G$10*100,0))))","v":"  "},null,{"$f":"IF(ISBLANK(I$10),\"  \",IF(ISBLANK(I$11),\" \",IF(ISBLANK(I18),\" \",ROUND((I18+I$12)/I$10*100,0))))","v":"  "},null,{"$f":"IF(ISBLANK(K$10),\"  \",IF(ISBLANK(K$11),\" \",IF(ISBLANK(K18),\" \",ROUND((K18+K$12)/K$10*100,0))))","v":"  "},null,{"$f":"IF(ISBLANK(M$10),\"  \",IF(ISBLANK(M$11),\" \",IF(ISBLANK(M18),\" \",ROUND((M18+M$12)/M$10*100,0))))","v":"  "}]
[{"$f":"IF(M4=\"Type AS1\",Spec!B$11,IF(M4=\"Type AS2\",Spec!C$11,IF(M4=\"Type AS3\",Spec!D$11,IF(M4=\"Type AS4\",Spec!E$11))))","v":"0-8"},100,null,{"$f":"IF(ISBLANK(C$10),\"  \",IF(ISBLANK(C$11),\" \",IF(ISBLANK(C19),\" \",ROUND((C19+C$12)/C$10*100,0))))","v":"  "},null,"  ",null,{"$f":"IF(ISBLANK(G$10),\"  \",IF(ISBLANK(G$11),\" \",IF(ISBLANK(G19),\" \",ROUND((G19+G$12)/G$10*100,0))))","v":"  "},null,{"$f":"IF(ISBLANK(I$10),\"  \",IF(ISBLANK(I$11),\" \",IF(ISBLANK(I19),\" \",ROUND((I19+I$12)/I$10*100,0))))","v":"  "},null,{"$f":"IF(ISBLANK(K$10),\"  \",IF(ISBLANK(K$11),\" \",IF(ISBLANK(K19),\" \",ROUND((K19+K$12)/K$10*100,0))))","v":"  "},null,{"$f":"IF(ISBLANK(M$10),\"  \",IF(ISBLANK(M$11),\" \",IF(ISBLANK(M19),\" \",ROUND((M19+M$12)/M$10*100,0))))","v":"  "}]
[{"$f":"IF(M4=\"Type AS1\",Spec!B$12,IF(M4=\"Type AS2\",Spec!C$12,IF(M4=\"Type AS3\",Spec!D$12,IF(M4=\"Type AS4\",Spec!E$12))))","v":"0-5"},200,null,{"$f":"IF(ISBLANK(C$10),\"  \",IF(ISBLANK(C$11),\" \",IF(ISBLANK(C20),\" \",ROUND((C20+C$12)/C$10*100,2))))","v":"  "},null,{"$f":"IF(ISBLANK(E$10),\"  \",IF(ISBLANK(E$11),\" \",IF(ISBLANK(E20),\" \",ROUND((E20+E$12)/E$10*100,2))))","v":"  "},null,{"$f":"IF(ISBLANK(G$10),\"  \",IF(ISBLANK(G$11),\" \",IF(ISBLANK(G20),\" \",ROUND((G20+G$12)/G$10*100,2))))","v":"  "},null,{"$f":"IF(ISBLANK(I$10),\"  \",IF(ISBLANK(I$11),\" \",IF(ISBLANK(I20),\" \",ROUND((I20+I$12)/I$10*100,2))))","v":"  "},null,{"$f":"IF(ISBLANK(K$10),\"  \",IF(ISBLANK(K$11),\" \",IF(ISBLANK(K20),\" \",ROUND((K20+K$12)/K$10*100,2))))","v":"  "},null,{"$f":"IF(ISBLANK(M$10),\"  \",IF(ISBLANK(M$11),\" \",IF(ISBLANK(M20),\" \",ROUND((M20+M$12)/M$10*100,2))))","v":"  "}]
["Tested By"]
["Remarks"]
[]
[]
[]
[{"$f":"'S1'!A26","v":""}]
["Sample No."]
["Date"]
[{"$f":"IF($M$4=\"Type AS3\",\"Starting Wt.\",\"St. Wt. Before Wash.\")","v":"St. Wt. Before Wash."},null,null,"% Loss",null,"% Loss",null,"% Loss",null,"% Loss",null,"% Loss",null,"% Loss"]
[{"$f":"IF($M$4=\"Type AS3\",\"Ending Wt.\",\"Dry. Wt. After Wash.\")","v":"Dry. Wt. After Wash."},null,null,{"$f":"IF(ISBLANK(C29),\" \",IF(ISBLANK(C34),\" \",IF($M$4=\"Type AS3\",(C29-C30)/C29*100,(C30-C47)/C30*100)))","v":" "},null,{"$f":"IF(ISBLANK(E29),\" \",IF(ISBLANK(E34),\" \",IF($M$4=\"Type AS3\",(E29-E30)/E29*100,(E30-E47)/E30*100)))","v":" "},null,{"$f":"IF(ISBLANK(G29),\" \",IF(ISBLANK(G34),\" \",IF($M$4=\"Type AS3\",(G29-G30)/G29*100,(G30-G47)/G30*100)))","v":" "},null,{"$f":"IF(ISBLANK(I29),\" \",IF(ISBLANK(I34),\" \",IF($M$4=\"Type AS3\",(I29-I30)/I29*100,(I30-I47)/I30*100)))","v":" "},null,{"$f":"IF(ISBLANK(K29),\" \",IF(ISBLANK(K34),\" \",IF($M$4=\"Type AS3\",(K29-K30)/K29*100,(K30-K47)/K30*100)))","v":" "},null,{"$f":"IF(ISBLANK(M29),\" \",IF(ISBLANK(M34),\" \",IF($M$4=\"Type AS3\",(M29-M30)/M29*100,(M30-M47)/M30*100)))","v":" "}]
["Wt. Loss",null,{"$f":"IF($M$4=\"Type AS3\",0,IF(ISBLANK(C29),\" \",IF(ISBLANK(C30),\" \",C29-C30)))","v":" "},null,{"$f":"IF($M$4=\"Type AS3\",0,IF(ISBLANK(E29),\" \",IF(ISBLANK(E30),\" \",E29-E30)))","v":" "},null,{"$f":"IF($M$4=\"Type AS3\",0,IF(ISBLANK(G29),\" \",IF(ISBLANK(G30),\" \",G29-G30)))","v":" "},null,{"$f":"IF($M$4=\"Type AS3\",0,IF(ISBLANK(I29),\" \",IF(ISBLANK(I30),\" \",I29-I30)))","v":" "},null,{"$f":"IF($M$4=\"Type AS3\",0,IF(ISBLANK(K29),\" \",IF(ISBLANK(K30),\" \",K29-K30)))","v":" "},null,{"$f":"IF($M$4=\"Type AS3\",0,IF(ISBLANK(M29),\" \",IF(ISBLANK(M30),\" \",M29-M30)))","v":" "}]
["Spec","Sieve","Wt","% Passing","Wt","% Passing","Wt","% Passing","Wt","% Passing","Wt","% Passing","Wt","% Passing"]
[100,0.5,null,{"$f":"IF(ISBLANK(C$29),\"  \",IF(ISBLANK(C$30),\" \",IF(ISBLANK(C33),\" \",ROUND((C33+C$31)/C$29*100,1))))","v":"  "},null,{"$f":"IF(ISBLANK(E$29),\"  \",IF(ISBLANK(E$30),\" \",IF(ISBLANK(E33),\" \",ROUND((E33+E$31)/E$29*100,1))))","v":"  "},null,{"$f":"IF(ISBLANK(G$29),\"  \",IF(ISBLANK(G$30),\" \",IF(ISBLANK(G33),\" \",ROUND((G33+G$31)/G$29*100,1))))","v":"  "},null,{"$f":"IF(ISBLANK(I$29),\"  \",IF(ISBLANK(I$30),\" \",IF(ISBLANK(I33),\" \",ROUND((I33+I$31)/I$29*100,1))))","v":"  "},null,{"$f":"IF(ISBLANK(K$29),\"  \",IF(ISBLANK(K$30),\" \",IF(ISBLANK(K33),\" \",ROUND((K33+K$31)/K$29*100,1))))","v":"  "},null,{"$f":"IF(ISBLANK(M$29),\"  \",IF(ISBLANK(M$30),\" \",IF(ISBLANK(M33),\" \",ROUND((M33+M$31)/M$29*100,1))))","v":"  "}]
[{"$f":"IF(M$4=\"Type AS3\",\"90-100\",\"100\")","v":"100"},0.375,null,{"$f":"IF(ISBLANK(C$29),\"  \",IF(ISBLANK(C$30),\" \",IF(ISBLANK(C34),\" \",ROUND((C34+C$31)/C$29*100,1))))","v":"  "},null,{"$f":"IF(ISBLANK(E$29),\"  \",IF(ISBLANK(E$30),\" \",IF(ISBLANK(E34),\" \",ROUND((E34+E$31)/E$29*100,1))))","v":"  "},null,{"$f":"IF(ISBLANK(G$29),\"  \",IF(ISBLANK(G$30),\" \",IF(ISBLANK(G34),\" \",ROUND((G34+G$31)/G$29*100,1))))","v":"  "},null,{"$f":"IF(ISBLANK(I$29),\"  \",IF(ISBLANK(I$30),\" \",IF(ISBLANK(I34),\" \",ROUND((I34+I$31)/I$29*100,1))))","v":"  "},null,{"$f":"IF(ISBLANK(K$29),\"  \",IF(ISBLANK(K$30),\" \",IF(ISBLANK(K34),\" \",ROUND((K34+K$31)/K$29*100,1))))","v":"  "},null,{"$f":"IF(ISBLANK(M$29),\"  \",IF(ISBLANK(M$30),\" \",IF(ISBLANK(M34),\" \",ROUND((M34+M$31)/M$29*100,1))))","v":"  "}]
["Breaker",0.25,null,{"$f":"IF(ISBLANK(C$29),\"  \",IF(ISBLANK(C$30),\" \",IF(ISBLANK(C35),\" \",ROUND((C35+C$31)/C$29*100,0))))","v":"  "},null,{"$f":"IF(ISBLANK(E$29),\"  \",IF(ISBLANK(E$30),\" \",IF(ISBLANK(E35),\" \",ROUND((E35+E$31)/E$29*100,0))))","v":"  "},null,{"$f":"IF(ISBLANK(G$29),\"  \",IF(ISBLANK(G$30),\" \",IF(ISBLANK(G35),\" \",ROUND((G35+G$31)/G$29*100,0))))","v":"  "},null,{"$f":"IF(ISBLANK(I$29),\"  \",IF(ISBLANK(I$30),\" \",IF(ISBLANK(I35),\" \",ROUND((I35+I$31)/I$29*100,0))))","v":"  "},null,{"$f":"IF(ISBLANK(K$29),\"  \",IF(ISBLANK(K$30),\" \",IF(ISBLANK(K35),\" \",ROUND((K35+K$31)/K$29*100,0))))","v":"  "},null,{"$f":"IF(ISBLANK(M$29),\"  \",IF(ISBLANK(M$30),\" \",IF(ISBLANK(M35),\" \",ROUND((M35+M$31)/M$29*100,0))))","v":"  "}]
[{"$f":"IF(M4=\"Type AS1\",Spec!B$9,IF(M4=\"Type AS2\",Spec!C$9,IF(M4=\"Type AS3\",Spec!D$9,IF(M4=\"Type AS4\",Spec!E$9))))","v":0},4,null,{"$f":"IF(ISBLANK(C$29),\"  \",IF(ISBLANK(C$30),\" \",IF(ISBLANK(C36),\" \",ROUND((C36+C$31)/C$29*100,0))))","v":"  "},null,{"$f":"IF(ISBLANK(E$29),\"  \",IF(ISBLANK(E$30),\" \",IF(ISBLANK(E36),\" \",ROUND((E36+E$31)/E$29*100,0))))","v":"  "},null,{"$f":"IF(ISBLANK(G$29),\"  \",IF(ISBLANK(G$30),\" \",IF(ISBLANK(G36),\" \",ROUND((G36+G$31)/G$29*100,0))))","v":"  "},null,{"$f":"IF(ISBLANK(I$29),\"  \",IF(ISBLANK(I$30),\" \",IF(ISBLANK(I36),\" \",ROUND((I36+I$31)/I$29*100,0))))","v":"  "},null,{"$f":"IF(ISBLANK(K$29),\"  \",IF(ISBLANK(K$30),\" \",IF(ISBLANK(K36),\" \",ROUND((K36+K$31)/K$29*100,0))))","v":"  "},null,{"$f":"IF(ISBLANK(M$29),\"  \",IF(ISBLANK(M$30),\" \",IF(ISBLANK(M36),\" \",ROUND((M36+M$31)/M$29*100,0))))","v":"  "}]
[{"$f":"IF(M4=\"Type AS1\",Spec!B$10,IF(M4=\"Type AS2\",Spec!C$10,IF(M4=\"Type AS3\",Spec!D$10,IF(M4=\"Type AS4\",Spec!E$10))))","v":"0-30"},8,null,{"$f":"IF(ISBLANK(C$29),\"  \",IF(ISBLANK(C$30),\" \",IF(ISBLANK(C37),\" \",ROUND((C37+C$31)/C$29*100,0))))","v":"  "},null,{"$f":"IF(ISBLANK(E$29),\"  \",IF(ISBLANK(E$30),\" \",IF(ISBLANK(E37),\" \",ROUND((E37+E$31)/E$29*100,0))))","v":"  "},null,{"$f":"IF(ISBLANK(G$29),\"  \",IF(ISBLANK(G$30),\" \",IF(ISBLANK(G37),\" \",ROUND((G37+G$31)/G$29*100,0))))","v":"  "},null,{"$f":"IF(ISBLANK(I$29),\"  \",IF(ISBLANK(I$30),\" \",IF(ISBLANK(I37),\" \",ROUND((I37+I$31)/I$29*100,0))))","v":"  "},null,{"$f":"IF(ISBLANK(K$29),\"  \",IF(ISBLANK(K$30),\" \",IF(ISBLANK(K37),\" \",ROUND((K37+K$31)/K$29*100,0))))","v":"  "},null,{"$f":"IF(ISBLANK(M$29),\"  \",IF(ISBLANK(M$30),\" \",IF(ISBLANK(M37),\" \",ROUND((M37+M$31)/M$29*100,0))))","v":"  "}]
[{"$f":"IF(M4=\"Type AS1\",Spec!B$11,IF(M4=\"Type AS2\",Spec!C$11,IF(M4=\"Type AS3\",Spec!D$11,IF(M4=\"Type AS4\",Spec!E$11))))","v":"0-8"},100,null,{"$f":"IF(ISBLANK(C$29),\"  \",IF(ISBLANK(C$30),\" \",IF(ISBLANK(C38),\" \",ROUND((C38+C$31)/C$29*100,0))))","v":"  "},null,{"$f":"IF(ISBLANK(E$29),\"  \",IF(ISBLANK(E$30),\" \",IF(ISBLANK(E38),\" \",ROUND((E38+E$31)/E$29*100,0))))","v":"  "},null,{"$f":"IF(ISBLANK(G$29),\"  \",IF(ISBLANK(G$30),\" \",IF(ISBLANK(G38),\" \",ROUND((G38+G$31)/G$29*100,0))))","v":"  "},null,{"$f":"IF(ISBLANK(I$29),\"  \",IF(ISBLANK(I$30),\" \",IF(ISBLANK(I38),\" \",ROUND((I38+I$31)/I$29*100,0))))","v":"  "},null,{"$f":"IF(ISBLANK(K$29),\"  \",IF(ISBLANK(K$30),\" \",IF(ISBLANK(K38),\" \",ROUND((K38+K$31)/K$29*100,0))))","v":"  "},null,{"$f":"IF(ISBLANK(M$29),\"  \",IF(ISBLANK(M$30),\" \",IF(ISBLANK(M38),\" \",ROUND((M38+M$31)/M$29*100,0))))","v":"  "}]
[{"$f":"IF(M4=\"Type AS1\",Spec!B$12,IF(M4=\"Type AS2\",Spec!C$12,IF(M4=\"Type AS3\",Spec!D$12,IF(M4=\"Type AS4\",Spec!E$12))))","v":"0-5"},200,null,{"$f":"IF(ISBLANK(C$29),\"  \",IF(ISBLANK(C$30),\" \",IF(ISBLANK(C39),\" \",ROUND((C39+C$31)/C$29*100,2))))","v":"  "},null,{"$f":"IF(ISBLANK(E$29),\"  \",IF(ISBLANK(E$30),\" \",IF(ISBLANK(E39),\" \",ROUND((E39+E$31)/E$29*100,2))))","v":"  "},null,{"$f":"IF(ISBLANK(G$29),\"  \",IF(ISBLANK(G$30),\" \",IF(ISBLANK(G39),\" \",ROUND((G39+G$31)/G$29*100,2))))","v":"  "},null,{"$f":"IF(ISBLANK(I$29),\"  \",IF(ISBLANK(I$30),\" \",IF(ISBLANK(I39),\" \",ROUND((I39+I$31)/I$29*100,2))))","v":"  "},null,{"$f":"IF(ISBLANK(K$29),\"  \",IF(ISBLANK(K$30),\" \",IF(ISBLANK(K39),\" \",ROUND((K39+K$31)/K$29*100,2))))","v":"  "},null,{"$f":"IF(ISBLANK(M$29),\"  \",IF(ISBLANK(M$30),\" \",IF(ISBLANK(M39),\" \",ROUND((M39+M$31)/M$29*100,2))))","v":"  "}]
["Tested By"]
["Remarks"]
[]
[]
[]
[]
[null,null,{"$f":"MAX(C14:C15)","v":0},null,{"$f":"MAX(E14:E15)","v":0},null,{"$f":"MAX(G14:G15)","v":0},null,{"$f":"MAX(I14:I15)","v":0},null,{"$f":"MAX(K14:K15)","v":0},null,{"$f":"MAX(M14:M15)","v":0}]
[null,null,{"$f":"MAX(C33:C34)","v":0},null,{"$f":"MAX(E33:E34)","v":0},null,{"$f":"MAX(G33:G34)","v":0},null,{"$f":"MAX(I33:I34)","v":0},null,{"$f":"MAX(K33:K34)","v":0},null,{"$f":"MAX(M33:M34)","v":0}]

{"sheet":"S10","index":9,"n_rows":47,"n_cols":14,"rows_kept":47,"cut":false,"hidden":true,"merged":[[3,10,3,11],[3,12,3,13],[0,0,3,1],[1,10,1,11],[1,12,1,13],[2,10,2,11],[2,12,2,13],[0,8,3,9],[1,2,1,7],[2,2,2,7],[3,2,3,7],[5,3,5,8],[7,0,7,1],[7,2,7,3],[7,4,7,5],[7,6,7,7],[7,8,7,9],[10,0,10,1],[9,0,9,1],[7,10,7,11],[7,12,7,13],[8,0,8,1],[8,2,8,3],[8,4,8,5],[8,6,8,7],[8,8,8,9],[8,10,8,11],[8,12,8,13],[21,12,24,13],[26,12,26,13],[27,12,27,13],[30,2,30,3],[11,10,11,11],[11,12,11,13],[11,4,11,5],[11,6,11,7],[11,8,11,9],[20,12,20,13],[30,10,30,11],[21,6,24,7],[27,2,27,3],[20,2,20,3],[26,2,26,3],[20,10,20,11],[28,0,28,1],[26,0,26,1],[27,0,27,1],[26,10,26,11],[21,0,24,1],[21,2,24,3],[21,4,24,5],[27,4,27,5],[27,6,27,7],[26,4,26,5],[26,6,26,7],[26,8,26,9],[39,6,39,7],[39,8,39,9],[11,0,11,1],[11,2,11,3],[21,8,24,9],[20,0,20,1],[39,0,39,1],[20,4,20,5],[20,6,20,7],[20,8,20,9],[30,0,30,1],[25,0,25,13],[21,10,24,11],[27,8,27,9],[27,10,27,11],[29,0,29,1],[4,0,4,1],[39,2,39,3],[30,12,30,13],[39,12,39,13],[40,0,43,1],[40,2,43,3],[40,4,43,5],[40,6,43,7],[40,8,43,9],[40,10,43,11],[40,12,43,13],[30,4,30,5],[30,6,30,7],[30,8,30,9],[39,10,39,11],[39,4,39,5]]}
[]
[null,null,"COMMONWEALTH OF PENNSYLVANIA",null,null,null,null,null,null,null,"DISTRICT",null,{"$f":"IF(ISBLANK('S1'!L2),\"\",'S1'!L2)","v":""}]
[null,null,"DEPARTMENT OF TRANSPORTATION",null,null,null,null,null,null,null,"PLANT CODE",null,{"$f":"IF(ISBLANK('S1'!L3),\"\",'S1'!L3)","v":""}]
[null,null,"PENNSYLVANIA TURNPIKE COMMISSION",null,null,null,null,null,null,null,"AGG SIZE",null,{"$f":"IF(ISBLANK('S1'!L4),\"\",'S1'!L4)","v":"Type AS4"}]
[{"$f":"'S1'!A5","v":"Aggregate 2023"}]
[null,null,null,{"$f":"'S1'!D6","v":"Material Test Results for Type AS4"}]
[]
["Sample No."]
["Date"]
[{"$f":"IF($M$4=\"Type AS3\",\"Starting Wt.\",\"St. Wt. Before Wash.\")","v":"St. Wt. Before Wash."},null,null,"% Loss",null,"% Loss",null,"% Loss",null,"% Loss",null,"% Loss",null,"% Loss"]
[{"$f":"IF($M$4=\"Type AS3\",\"Ending Wt.\",\"Dry. Wt. After Wash.\")","v":"Dry. Wt. After Wash."},null,null,{"$f":"IF(ISBLANK(C10),\" \",IF(ISBLANK(C15),\" \",IF($M$4=\"Type AS3\",(C10-C11)/C10*100,(C11-C46)/C11*100)))","v":" "},null,{"$f":"IF(ISBLANK(E10),\" \",IF(ISBLANK(E15),\" \",IF($M$4=\"Type AS3\",(E10-E11)/E10*100,(E11-E46)/E11*100)))","v":" "},null,{"$f":"IF(ISBLANK(G10),\" \",IF(ISBLANK(G15),\" \",IF($M$4=\"Type AS3\",(G10-G11)/G10*100,(G11-G46)/G11*100)))","v":" "},null,{"$f":"IF(ISBLANK(I10),\" \",IF(ISBLANK(I15),\" \",IF($M$4=\"Type AS3\",(I10-I11)/I10*100,(I11-I46)/I11*100)))","v":" "},null,{"$f":"IF(ISBLANK(K10),\" \",IF(ISBLANK(K15),\" \",IF($M$4=\"Type AS3\",(K10-K11)/K10*100,(K11-K46)/K11*100)))","v":" "},null,{"$f":"IF(ISBLANK(M10),\" \",IF(ISBLANK(M15),\" \",IF($M$4=\"Type AS3\",(M10-M11)/M10*100,(M11-M46)/M11*100)))","v":" "}]
["Wt. Loss",null,{"$f":"IF($M$4=\"Type AS3\",0,IF(ISBLANK(C10),\" \",IF(ISBLANK(C11),\" \",C10-C11)))","v":" "},null,{"$f":"IF($M$4=\"Type AS3\",0,IF(ISBLANK(E10),\" \",IF(ISBLANK(E11),\" \",E10-E11)))","v":" "},null,{"$f":"IF($M$4=\"Type AS3\",0,IF(ISBLANK(G10),\" \",IF(ISBLANK(G11),\" \",G10-G11)))","v":" "},null,{"$f":"IF($M$4=\"Type AS3\",0,IF(ISBLANK(I10),\" \",IF(ISBLANK(I11),\" \",I10-I11)))","v":" "},null,{"$f":"IF($M$4=\"Type AS3\",0,IF(ISBLANK(K10),\" \",IF(ISBLANK(K11),\" \",K10-K11)))","v":" "},null,{"$f":"IF($M$4=\"Type AS3\",0,IF(ISBLANK(M10),\" \",IF(ISBLANK(M11),\" \",M10-M11)))","v":" "}]
["Spec","Sieve","Wt","% Passing","Wt","% Passing","Wt","% Passing","Wt","% Passing","Wt","% Passing","Wt","% Passing"]
[100,0.5,null,{"$f":"IF(ISBLANK(C$10),\"  \",IF(ISBLANK(C$11),\" \",IF(ISBLANK(C14),\" \",ROUND((C14+C$12)/C$10*100,1))))","v":"  "},null,{"$f":"IF(ISBLANK(E$10),\"  \",IF(ISBLANK(E$11),\" \",IF(ISBLANK(E14),\" \",ROUND((E14+E$12)/E$10*100,0))))","v":"  "},null,{"$f":"IF(ISBLANK(G$10),\"  \",IF(ISBLANK(G$11),\" \",IF(ISBLANK(G14),\" \",ROUND((G14+G$12)/G$10*100,1))))","v":"  "},null,{"$f":"IF(ISBLANK(I$10),\"  \",IF(ISBLANK(I$11),\" \",IF(ISBLANK(I14),\" \",ROUND((I14+I$12)/I$10*100,1))))","v":"  "},null,{"$f":"IF(ISBLANK(K$10),\"  \",IF(ISBLANK(K$11),\" \",IF(ISBLANK(K14),\" \",ROUND((K14+K$12)/K$10*100,1))))","v":"  "},null,{"$f":"IF(ISBLANK(M$10),\"  \",IF(ISBLANK(M$11),\" \",IF(ISBLANK(M14),\" \",ROUND((M14+M$12)/M$10*100,1))))","v":"  "}]
[{"$f":"IF(M$4=\"Type AS3\",\"90-100\",\"100\")","v":"100"},0.375,null,{"$f":"IF(ISBLANK(C$10),\"  \",IF(ISBLANK(C$11),\" \",IF(ISBLANK(C15),\" \",ROUND((C15+C$12)/C$10*100,1))))","v":"  "},null,"  ",null,{"$f":"IF(ISBLANK(G$10),\"  \",IF(ISBLANK(G$11),\" \",IF(ISBLANK(G15),\" \",ROUND((G15+G$12)/G$10*100,1))))","v":"  "},null,{"$f":"IF(ISBLANK(I$10),\"  \",IF(ISBLANK(I$11),\" \",IF(ISBLANK(I15),\" \",ROUND((I15+I$12)/I$10*100,1))))","v":"  "},null,{"$f":"IF(ISBLANK(K$10),\"  \",IF(ISBLANK(K$11),\" \",IF(ISBLANK(K15),\" \",ROUND((K15+K$12)/K$10*100,1))))","v":"  "},null,{"$f":"IF(ISBLANK(M$10),\"  \",IF(ISBLANK(M$11),\" \",IF(ISBLANK(M15),\" \",ROUND((M15+M$12)/M$10*100,1))))","v":"  "}]
["Breaker",0.25,null,{"$f":"IF(ISBLANK(C$10),\"  \",IF(ISBLANK(C$11),\" \",IF(ISBLANK(C16),\" \",ROUND((C16+C$12)/C$10*100,0))))","v":"  "},null,"  ",null,{"$f":"IF(ISBLANK(G$10),\"  \",IF(ISBLANK(G$11),\" \",IF(ISBLANK(G16),\" \",ROUND((G16+G$12)/G$10*100,0))))","v":"  "},null,{"$f":"IF(ISBLANK(I$10),\"  \",IF(ISBLANK(I$11),\" \",IF(ISBLANK(I16),\" \",ROUND((I16+I$12)/I$10*100,0))))","v":"  "},null,{"$f":"IF(ISBLANK(K$10),\"  \",IF(ISBLANK(K$11),\" \",IF(ISBLANK(K16),\" \",ROUND((K16+K$12)/K$10*100,0))))","v":"  "},null,{"$f":"IF(ISBLANK(M$10),\"  \",IF(ISBLANK(M$11),\" \",IF(ISBLANK(M16),\" \",ROUND((M16+M$12)/M$10*100,0))))","v":"  "}]
[{"$f":"IF(M4=\"Type AS1\",Spec!B$9,IF(M4=\"Type AS2\",Spec!C$9,IF(M4=\"Type AS3\",Spec!D$9,IF(M4=\"Type AS4\",Spec!E$9))))","v":0},4,null,{"$f":"IF(ISBLANK(C$10),\"  \",IF(ISBLANK(C$11),\" \",IF(ISBLANK(C17),\" \",ROUND((C17+C$12)/C$10*100,0))))","v":"  "},null,"  ",null,{"$f":"IF(ISBLANK(G$10),\"  \",IF(ISBLANK(G$11),\" \",IF(ISBLANK(G17),\" \",ROUND((G17+G$12)/G$10*100,0))))","v":"  "},null,{"$f":"IF(ISBLANK(I$10),\"  \",IF(ISBLANK(I$11),\" \",IF(ISBLANK(I17),\" \",ROUND((I17+I$12)/I$10*100,0))))","v":"  "},null,{"$f":"IF(ISBLANK(K$10),\"  \",IF(ISBLANK(K$11),\" \",IF(ISBLANK(K17),\" \",ROUND((K17+K$12)/K$10*100,0))))","v":"  "},null,{"$f":"IF(ISBLANK(M$10),\"  \",IF(ISBLANK(M$11),\" \",IF(ISBLANK(M17),\" \",ROUND((M17+M$12)/M$10*100,0))))","v":"  "}]
[{"$f":"IF(M4=\"Type AS1\",Spec!B$10,IF(M4=\"Type AS2\",Spec!C$10,IF(M4=\"Type AS3\",Spec!D$10,IF(M4=\"Type AS4\",Spec!E$10))))","v":"0-30"},8,null,{"$f":"IF(ISBLANK(C$10),\"  \",IF(ISBLANK(C$11),\" \",IF(ISBLANK(C18),\" \",ROUND((C18+C$12)/C$10*100,0))))","v":"  "},null,"  ",null,{"$f":"IF(ISBLANK(G$10),\"  \",IF(ISBLANK(G$11),\" \",IF(ISBLANK(G18),\" \",ROUND((G18+G$12)/G$10*100,0))))","v":"  "},null,{"$f":"IF(ISBLANK(I$10),\"  \",IF(ISBLANK(I$11),\" \",IF(ISBLANK(I18),\" \",ROUND((I18+I$12)/I$10*100,0))))","v":"  "},null,{"$f":"IF(ISBLANK(K$10),\"  \",IF(ISBLANK(K$11),\" \",IF(ISBLANK(K18),\" \",ROUND((K18+K$12)/K$10*100,0))))","v":"  "},null,{"$f":"IF(ISBLANK(M$10),\"  \",IF(ISBLANK(M$11),\" \",IF(ISBLANK(M18),\" \",ROUND((M18+M$12)/M$10*100,0))))","v":"  "}]
[{"$f":"IF(M4=\"Type AS1\",Spec!B$11,IF(M4=\"Type AS2\",Spec!C$11,IF(M4=\"Type AS3\",Spec!D$11,IF(M4=\"Type AS4\",Spec!E$11))))","v":"0-8"},100,null,{"$f":"IF(ISBLANK(C$10),\"  \",IF(ISBLANK(C$11),\" \",IF(ISBLANK(C19),\" \",ROUND((C19+C$12)/C$10*100,0))))","v":"  "},null,"  ",null,{"$f":"IF(ISBLANK(G$10),\"  \",IF(ISBLANK(G$11),\" \",IF(ISBLANK(G19),\" \",ROUND((G19+G$12)/G$10*100,0))))","v":"  "},null,{"$f":"IF(ISBLANK(I$10),\"  \",IF(ISBLANK(I$11),\" \",IF(ISBLANK(I19),\" \",ROUND((I19+I$12)/I$10*100,0))))","v":"  "},null,{"$f":"IF(ISBLANK(K$10),\"  \",IF(ISBLANK(K$11),\" \",IF(ISBLANK(K19),\" \",ROUND((K19+K$12)/K$10*100,0))))","v":"  "},null,{"$f":"IF(ISBLANK(M$10),\"  \",IF(ISBLANK(M$11),\" \",IF(ISBLANK(M19),\" \",ROUND((M19+M$12)/M$10*100,0))))","v":"  "}]
[{"$f":"IF(M4=\"Type AS1\",Spec!B$12,IF(M4=\"Type AS2\",Spec!C$12,IF(M4=\"Type AS3\",Spec!D$12,IF(M4=\"Type AS4\",Spec!E$12))))","v":"0-5"},200,null,{"$f":"IF(ISBLANK(C$10),\"  \",IF(ISBLANK(C$11),\" \",IF(ISBLANK(C20),\" \",ROUND((C20+C$12)/C$10*100,2))))","v":"  "},null,{"$f":"IF(ISBLANK(E$10),\"  \",IF(ISBLANK(E$11),\" \",IF(ISBLANK(E20),\" \",ROUND((E20+E$12)/E$10*100,2))))","v":"  "},null,{"$f":"IF(ISBLANK(G$10),\"  \",IF(ISBLANK(G$11),\" \",IF(ISBLANK(G20),\" \",ROUND((G20+G$12)/G$10*100,2))))","v":"  "},null,{"$f":"IF(ISBLANK(I$10),\"  \",IF(ISBLANK(I$11),\" \",IF(ISBLANK(I20),\" \",ROUND((I20+I$12)/I$10*100,2))))","v":"  "},null,{"$f":"IF(ISBLANK(K$10),\"  \",IF(ISBLANK(K$11),\" \",IF(ISBLANK(K20),\" \",ROUND((K20+K$12)/K$10*100,2))))","v":"  "},null,{"$f":"IF(ISBLANK(M$10),\"  \",IF(ISBLANK(M$11),\" \",IF(ISBLANK(M20),\" \",ROUND((M20+M$12)/M$10*100,2))))","v":"  "}]
["Tested By"]
["Remarks"]
[]
[]
[]
[{"$f":"'S1'!A26","v":""}]
["Sample No."]
["Date"]
[{"$f":"IF($M$4=\"Type AS3\",\"Starting Wt.\",\"St. Wt. Before Wash.\")","v":"St. Wt. Before Wash."},null,null,"% Loss",null,"% Loss",null,"% Loss",null,"% Loss",null,"% Loss",null,"% Loss"]
[{"$f":"IF($M$4=\"Type AS3\",\"Ending Wt.\",\"Dry. Wt. After Wash.\")","v":"Dry. Wt. After Wash."},null,null,{"$f":"IF(ISBLANK(C29),\" \",IF(ISBLANK(C34),\" \",IF($M$4=\"Type AS3\",(C29-C30)/C29*100,(C30-C47)/C30*100)))","v":" "},null,{"$f":"IF(ISBLANK(E29),\" \",IF(ISBLANK(E34),\" \",IF($M$4=\"Type AS3\",(E29-E30)/E29*100,(E30-E47)/E30*100)))","v":" "},null,{"$f":"IF(ISBLANK(G29),\" \",IF(ISBLANK(G34),\" \",IF($M$4=\"Type AS3\",(G29-G30)/G29*100,(G30-G47)/G30*100)))","v":" "},null,{"$f":"IF(ISBLANK(I29),\" \",IF(ISBLANK(I34),\" \",IF($M$4=\"Type AS3\",(I29-I30)/I29*100,(I30-I47)/I30*100)))","v":" "},null,{"$f":"IF(ISBLANK(K29),\" \",IF(ISBLANK(K34),\" \",IF($M$4=\"Type AS3\",(K29-K30)/K29*100,(K30-K47)/K30*100)))","v":" "},null,{"$f":"IF(ISBLANK(M29),\" \",IF(ISBLANK(M34),\" \",IF($M$4=\"Type AS3\",(M29-M30)/M29*100,(M30-M47)/M30*100)))","v":" "}]
["Wt. Loss",null,{"$f":"IF($M$4=\"Type AS3\",0,IF(ISBLANK(C29),\" \",IF(ISBLANK(C30),\" \",C29-C30)))","v":" "},null,{"$f":"IF($M$4=\"Type AS3\",0,IF(ISBLANK(E29),\" \",IF(ISBLANK(E30),\" \",E29-E30)))","v":" "},null,{"$f":"IF($M$4=\"Type AS3\",0,IF(ISBLANK(G29),\" \",IF(ISBLANK(G30),\" \",G29-G30)))","v":" "},null,{"$f":"IF($M$4=\"Type AS3\",0,IF(ISBLANK(I29),\" \",IF(ISBLANK(I30),\" \",I29-I30)))","v":" "},null,{"$f":"IF($M$4=\"Type AS3\",0,IF(ISBLANK(K29),\" \",IF(ISBLANK(K30),\" \",K29-K30)))","v":" "},null,{"$f":"IF($M$4=\"Type AS3\",0,IF(ISBLANK(M29),\" \",IF(ISBLANK(M30),\" \",M29-M30)))","v":" "}]
["Spec","Sieve","Wt","% Passing","Wt","% Passing","Wt","% Passing","Wt","% Passing","Wt","% Passing","Wt","% Passing"]
[100,0.5,null,{"$f":"IF(ISBLANK(C$29),\"  \",IF(ISBLANK(C$30),\" \",IF(ISBLANK(C33),\" \",ROUND((C33+C$31)/C$29*100,1))))","v":"  "},null,{"$f":"IF(ISBLANK(E$29),\"  \",IF(ISBLANK(E$30),\" \",IF(ISBLANK(E33),\" \",ROUND((E33+E$31)/E$29*100,1))))","v":"  "},null,{"$f":"IF(ISBLANK(G$29),\"  \",IF(ISBLANK(G$30),\" \",IF(ISBLANK(G33),\" \",ROUND((G33+G$31)/G$29*100,1))))","v":"  "},null,{"$f":"IF(ISBLANK(I$29),\"  \",IF(ISBLANK(I$30),\" \",IF(ISBLANK(I33),\" \",ROUND((I33+I$31)/I$29*100,1))))","v":"  "},null,{"$f":"IF(ISBLANK(K$29),\"  \",IF(ISBLANK(K$30),\" \",IF(ISBLANK(K33),\" \",ROUND((K33+K$31)/K$29*100,1))))","v":"  "},null,{"$f":"IF(ISBLANK(M$29),\"  \",IF(ISBLANK(M$30),\" \",IF(ISBLANK(M33),\" \",ROUND((M33+M$31)/M$29*100,1))))","v":"  "}]
[{"$f":"IF(M$4=\"Type AS3\",\"90-100\",\"100\")","v":"100"},0.375,null,{"$f":"IF(ISBLANK(C$29),\"  \",IF(ISBLANK(C$30),\" \",IF(ISBLANK(C34),\" \",ROUND((C34+C$31)/C$29*100,1))))","v":"  "},null,{"$f":"IF(ISBLANK(E$29),\"  \",IF(ISBLANK(E$30),\" \",IF(ISBLANK(E34),\" \",ROUND((E34+E$31)/E$29*100,1))))","v":"  "},null,{"$f":"IF(ISBLANK(G$29),\"  \",IF(ISBLANK(G$30),\" \",IF(ISBLANK(G34),\" \",ROUND((G34+G$31)/G$29*100,1))))","v":"  "},null,{"$f":"IF(ISBLANK(I$29),\"  \",IF(ISBLANK(I$30),\" \",IF(ISBLANK(I34),\" \",ROUND((I34+I$31)/I$29*100,1))))","v":"  "},null,{"$f":"IF(ISBLANK(K$29),\"  \",IF(ISBLANK(K$30),\" \",IF(ISBLANK(K34),\" \",ROUND((K34+K$31)/K$29*100,1))))","v":"  "},null,{"$f":"IF(ISBLANK(M$29),\"  \",IF(ISBLANK(M$30),\" \",IF(ISBLANK(M34),\" \",ROUND((M34+M$31)/M$29*100,1))))","v":"  "}]
["Breaker",0.25,null,{"$f":"IF(ISBLANK(C$29),\"  \",IF(ISBLANK(C$30),\" \",IF(ISBLANK(C35),\" \",ROUND((C35+C$31)/C$29*100,0))))","v":"  "},null,{"$f":"IF(ISBLANK(E$29),\"  \",IF(ISBLANK(E$30),\" \",IF(ISBLANK(E35),\" \",ROUND((E35+E$31)/E$29*100,0))))","v":"  "},null,{"$f":"IF(ISBLANK(G$29),\"  \",IF(ISBLANK(G$30),\" \",IF(ISBLANK(G35),\" \",ROUND((G35+G$31)/G$29*100,0))))","v":"  "},null,{"$f":"IF(ISBLANK(I$29),\"  \",IF(ISBLANK(I$30),\" \",IF(ISBLANK(I35),\" \",ROUND((I35+I$31)/I$29*100,0))))","v":"  "},null,{"$f":"IF(ISBLANK(K$29),\"  \",IF(ISBLANK(K$30),\" \",IF(ISBLANK(K35),\" \",ROUND((K35+K$31)/K$29*100,0))))","v":"  "},null,{"$f":"IF(ISBLANK(M$29),\"  \",IF(ISBLANK(M$30),\" \",IF(ISBLANK(M35),\" \",ROUND((M35+M$31)/M$29*100,0))))","v":"  "}]
[{"$f":"IF(M4=\"Type AS1\",Spec!B$9,IF(M4=\"Type AS2\",Spec!C$9,IF(M4=\"Type AS3\",Spec!D$9,IF(M4=\"Type AS4\",Spec!E$9))))","v":0},4,null,{"$f":"IF(ISBLANK(C$29),\"  \",IF(ISBLANK(C$30),\" \",IF(ISBLANK(C36),\" \",ROUND((C36+C$31)/C$29*100,0))))","v":"  "},null,{"$f":"IF(ISBLANK(E$29),\"  \",IF(ISBLANK(E$30),\" \",IF(ISBLANK(E36),\" \",ROUND((E36+E$31)/E$29*100,0))))","v":"  "},null,{"$f":"IF(ISBLANK(G$29),\"  \",IF(ISBLANK(G$30),\" \",IF(ISBLANK(G36),\" \",ROUND((G36+G$31)/G$29*100,0))))","v":"  "},null,{"$f":"IF(ISBLANK(I$29),\"  \",IF(ISBLANK(I$30),\" \",IF(ISBLANK(I36),\" \",ROUND((I36+I$31)/I$29*100,0))))","v":"  "},null,{"$f":"IF(ISBLANK(K$29),\"  \",IF(ISBLANK(K$30),\" \",IF(ISBLANK(K36),\" \",ROUND((K36+K$31)/K$29*100,0))))","v":"  "},null,{"$f":"IF(ISBLANK(M$29),\"  \",IF(ISBLANK(M$30),\" \",IF(ISBLANK(M36),\" \",ROUND((M36+M$31)/M$29*100,0))))","v":"  "}]
[{"$f":"IF(M4=\"Type AS1\",Spec!B$10,IF(M4=\"Type AS2\",Spec!C$10,IF(M4=\"Type AS3\",Spec!D$10,IF(M4=\"Type AS4\",Spec!E$10))))","v":"0-30"},8,null,{"$f":"IF(ISBLANK(C$29),\"  \",IF(ISBLANK(C$30),\" \",IF(ISBLANK(C37),\" \",ROUND((C37+C$31)/C$29*100,0))))","v":"  "},null,{"$f":"IF(ISBLANK(E$29),\"  \",IF(ISBLANK(E$30),\" \",IF(ISBLANK(E37),\" \",ROUND((E37+E$31)/E$29*100,0))))","v":"  "},null,{"$f":"IF(ISBLANK(G$29),\"  \",IF(ISBLANK(G$30),\" \",IF(ISBLANK(G37),\" \",ROUND((G37+G$31)/G$29*100,0))))","v":"  "},null,{"$f":"IF(ISBLANK(I$29),\"  \",IF(ISBLANK(I$30),\" \",IF(ISBLANK(I37),\" \",ROUND((I37+I$31)/I$29*100,0))))","v":"  "},null,{"$f":"IF(ISBLANK(K$29),\"  \",IF(ISBLANK(K$30),\" \",IF(ISBLANK(K37),\" \",ROUND((K37+K$31)/K$29*100,0))))","v":"  "},null,{"$f":"IF(ISBLANK(M$29),\"  \",IF(ISBLANK(M$30),\" \",IF(ISBLANK(M37),\" \",ROUND((M37+M$31)/M$29*100,0))))","v":"  "}]
[{"$f":"IF(M4=\"Type AS1\",Spec!B$11,IF(M4=\"Type AS2\",Spec!C$11,IF(M4=\"Type AS3\",Spec!D$11,IF(M4=\"Type AS4\",Spec!E$11))))","v":"0-8"},100,null,{"$f":"IF(ISBLANK(C$29),\"  \",IF(ISBLANK(C$30),\" \",IF(ISBLANK(C38),\" \",ROUND((C38+C$31)/C$29*100,0))))","v":"  "},null,{"$f":"IF(ISBLANK(E$29),\"  \",IF(ISBLANK(E$30),\" \",IF(ISBLANK(E38),\" \",ROUND((E38+E$31)/E$29*100,0))))","v":"  "},null,{"$f":"IF(ISBLANK(G$29),\"  \",IF(ISBLANK(G$30),\" \",IF(ISBLANK(G38),\" \",ROUND((G38+G$31)/G$29*100,0))))","v":"  "},null,{"$f":"IF(ISBLANK(I$29),\"  \",IF(ISBLANK(I$30),\" \",IF(ISBLANK(I38),\" \",ROUND((I38+I$31)/I$29*100,0))))","v":"  "},null,{"$f":"IF(ISBLANK(K$29),\"  \",IF(ISBLANK(K$30),\" \",IF(ISBLANK(K38),\" \",ROUND((K38+K$31)/K$29*100,0))))","v":"  "},null,{"$f":"IF(ISBLANK(M$29),\"  \",IF(ISBLANK(M$30),\" \",IF(ISBLANK(M38),\" \",ROUND((M38+M$31)/M$29*100,0))))","v":"  "}]
[{"$f":"IF(M4=\"Type AS1\",Spec!B$12,IF(M4=\"Type AS2\",Spec!C$12,IF(M4=\"Type AS3\",Spec!D$12,IF(M4=\"Type AS4\",Spec!E$12))))","v":"0-5"},200,null,{"$f":"IF(ISBLANK(C$29),\"  \",IF(ISBLANK(C$30),\" \",IF(ISBLANK(C39),\" \",ROUND((C39+C$31)/C$29*100,2))))","v":"  "},null,{"$f":"IF(ISBLANK(E$29),\"  \",IF(ISBLANK(E$30),\" \",IF(ISBLANK(E39),\" \",ROUND((E39+E$31)/E$29*100,2))))","v":"  "},null,{"$f":"IF(ISBLANK(G$29),\"  \",IF(ISBLANK(G$30),\" \",IF(ISBLANK(G39),\" \",ROUND((G39+G$31)/G$29*100,2))))","v":"  "},null,{"$f":"IF(ISBLANK(I$29),\"  \",IF(ISBLANK(I$30),\" \",IF(ISBLANK(I39),\" \",ROUND((I39+I$31)/I$29*100,2))))","v":"  "},null,{"$f":"IF(ISBLANK(K$29),\"  \",IF(ISBLANK(K$30),\" \",IF(ISBLANK(K39),\" \",ROUND((K39+K$31)/K$29*100,2))))","v":"  "},null,{"$f":"IF(ISBLANK(M$29),\"  \",IF(ISBLANK(M$30),\" \",IF(ISBLANK(M39),\" \",ROUND((M39+M$31)/M$29*100,2))))","v":"  "}]
["Tested By"]
["Remarks"]
[]
[]
[]
[]
[null,null,{"$f":"MAX(C14:C15)","v":0},null,{"$f":"MAX(E14:E15)","v":0},null,{"$f":"MAX(G14:G15)","v":0},null,{"$f":"MAX(I14:I15)","v":0},null,{"$f":"MAX(K14:K15)","v":0},null,{"$f":"MAX(M14:M15)","v":0}]
[null,null,{"$f":"MAX(C33:C34)","v":0},null,{"$f":"MAX(E33:E34)","v":0},null,{"$f":"MAX(G33:G34)","v":0},null,{"$f":"MAX(I33:I34)","v":0},null,{"$f":"MAX(K33:K34)","v":0},null,{"$f":"MAX(M33:M34)","v":0}]

{"sheet":"Chart 1-24","index":10,"n_rows":5,"n_cols":10,"rows_kept":5,"cut":false,"hidden":true,"merged":[[3,1,3,5],[3,7,3,8],[3,9,3,10],[4,0,4,1],[0,0,2,0],[1,1,1,5],[1,7,1,8],[1,9,1,10],[2,1,2,5],[2,7,2,8],[2,9,2,10]]}
[]
[null,"COMMONWEALTH OF PENNSYLVANIA",null,null,null,null,null,"DISTRICT",null,{"$f":"'S1'!L2","v":0}]
[null,"DEPARTMENT OF TRANSPORTATION",null,null,null,null,null,"PLANT CODE",null,{"$f":"'S1'!L3","v":0}]
[null,"PENNSYLVANIA TURNPIKE COMMISSION",null,null,null,null,null,"AGG SIZE",null,{"$f":"'S1'!L4","v":"Type AS4"}]
[{"$f":"'S1'!$A$5:$B$5","v":"Aggregate 2023"}]

{"sheet":"Chart 25-48","index":11,"n_rows":5,"n_cols":10,"rows_kept":5,"cut":false,"hidden":false,"merged":[[3,1,3,5],[3,7,3,8],[3,9,3,10],[4,0,4,1],[0,0,2,0],[1,1,1,5],[1,7,1,8],[1,9,1,10],[2,1,2,5],[2,7,2,8],[2,9,2,10]]}
[]
[null,"COMMONWEALTH OF PENNSYLVANIA",null,null,null,null,null,"DISTRICT",null,{"$f":"'S1'!L2","v":0}]
[null,"DEPARTMENT OF TRANSPORTATION",null,null,null,null,null,"PLANT CODE",null,{"$f":"'S1'!L3","v":0}]
[null,"PENNSYLVANIA TURNPIKE COMMISSION",null,null,null,null,null,"AGG SIZE",null,{"$f":"'S1'!L4","v":"Type AS4"}]
[{"$f":"'S1'!$A$5:$B$5","v":"Aggregate 2023"}]

{"sheet":"Chart 49-72","index":12,"n_rows":5,"n_cols":10,"rows_kept":5,"cut":false,"hidden":true,"merged":[[3,1,3,5],[3,7,3,8],[3,9,3,10],[4,0,4,1],[0,0,2,0],[1,1,1,5],[1,7,1,8],[1,9,1,10],[2,1,2,5],[2,7,2,8],[2,9,2,10]]}
[]
[null,"COMMONWEALTH OF PENNSYLVANIA",null,null,null,null,null,"DISTRICT",null,{"$f":"'S1'!L2","v":0}]
[null,"DEPARTMENT OF TRANSPORTATION",null,null,null,null,null,"PLANT CODE",null,{"$f":"'S1'!L3","v":0}]
[null,"PENNSYLVANIA TURNPIKE COMMISSION",null,null,null,null,null,"AGG SIZE",null,{"$f":"'S1'!L4","v":"Type AS4"}]
[{"$f":"'S1'!$A$5:$B$5","v":"Aggregate 2023"}]

{"sheet":"Chart 73-96","index":13,"n_rows":5,"n_cols":10,"rows_kept":5,"cut":false,"hidden":true,"merged":[[3,1,3,5],[3,7,3,8],[3,9,3,10],[4,0,4,1],[0,0,2,0],[1,1,1,5],[1,7,1,8],[1,9,1,10],[2,1,2,5],[2,7,2,8],[2,9,2,10]]}
[]
[null,"COMMONWEALTH OF PENNSYLVANIA",null,null,null,null,null,"DISTRICT",null,{"$f":"'S1'!L2","v":0}]
[null,"DEPARTMENT OF TRANSPORTATION",null,null,null,null,null,"PLANT CODE",null,{"$f":"'S1'!L3","v":0}]
[null,"PENNSYLVANIA TURNPIKE COMMISSION",null,null,null,null,null,"AGG SIZE",null,{"$f":"'S1'!L4","v":"Type AS4"}]
[{"$f":"'S1'!$A$5:$B$5","v":"Aggregate 2023"}]

{"sheet":"Chart 97-120","index":14,"n_rows":5,"n_cols":10,"rows_kept":5,"cut":false,"hidden":true,"merged":[[3,1,3,5],[3,7,3,8],[3,9,3,10],[4,0,4,1],[0,0,2,0],[1,1,1,5],[1,7,1,8],[1,9,1,10],[2,1,2,5],[2,7,2,8],[2,9,2,10]]}
[]
[null,"COMMONWEALTH OF PENNSYLVANIA",null,null,null,null,null,"DISTRICT",null,{"$f":"'S1'!L2","v":0}]
[null,"DEPARTMENT OF TRANSPORTATION",null,null,null,null,null,"PLANT CODE",null,{"$f":"'S1'!L3","v":0}]
[null,"PENNSYLVANIA TURNPIKE COMMISSION",null,null,null,null,null,"AGG SIZE",null,{"$f":"'S1'!L4","v":"Type AS4"}]
[{"$f":"'S1'!$A$5:$B$5","v":"Aggregate 2023"}]

{"sheet":"ST1","index":15,"n_rows":125,"n_cols":7,"rows_kept":125,"cut":false,"hidden":true,"merged":[]}
[]
[]
[]
["Samp #",200,100,8,4,0.25,0.375]
[]
[1,{"$f":"'S1'!$D$20","v":"  "},{"$f":"'S1'!$D$19","v":"  "},{"$f":"'S1'!$D$18","v":"  "},{"$f":"'S1'!$D$17","v":"  "},{"$f":"'S1'!$D$16","v":"  "},{"$f":"'S1'!$D$15","v":"  "}]
[2,{"$f":"'S1'!$F$20","v":"  "},{"$f":"'S1'!$F$19","v":"  "},{"$f":"'S1'!$F$18","v":"  "},{"$f":"'S1'!$F$17","v":"  "},{"$f":"'S1'!$F$16","v":"  "},{"$f":"'S1'!$F$15","v":"  "}]
[3,{"$f":"'S1'!$H$20","v":"  "},{"$f":"'S1'!$H$19","v":"  "},{"$f":"'S1'!$H$18","v":"  "},{"$f":"'S1'!$H$17","v":"  "},{"$f":"'S1'!$H$16","v":"  "},{"$f":"'S1'!$H$15","v":"  "}]
[4,{"$f":"'S1'!$J$20","v":"  "},{"$f":"'S1'!$J$19","v":"  "},{"$f":"'S1'!$J$18","v":"  "},{"$f":"'S1'!$J$17","v":"  "},{"$f":"'S1'!$J$16","v":"  "},{"$f":"'S1'!$J$15","v":"  "}]
[5,{"$f":"'S1'!$L$20","v":"  "},{"$f":"'S1'!$L$19","v":"  "},{"$f":"'S1'!$L$18","v":"  "},{"$f":"'S1'!$L$17","v":"  "},{"$f":"'S1'!$L$16","v":"  "},{"$f":"'S1'!$L$15","v":"  "}]
[6,{"$f":"'S1'!$N$20","v":"  "},{"$f":"'S1'!$N$19","v":"  "},{"$f":"'S1'!$N$18","v":"  "},{"$f":"'S1'!$N$17","v":"  "},{"$f":"'S1'!$N$16","v":"  "},{"$f":"'S1'!$N$15","v":"  "}]
[7,{"$f":"'S1'!$D$39","v":"  "},{"$f":"'S1'!$D$38","v":"  "},{"$f":"'S1'!$D$37","v":"  "},{"$f":"'S1'!$D$36","v":"  "},{"$f":"'S1'!$D$35","v":"  "},{"$f":"'S1'!$D$34","v":"  "}]
[8,{"$f":"'S1'!$F$39","v":"  "},{"$f":"'S1'!$F$38","v":"  "},{"$f":"'S1'!$F$37","v":"  "},{"$f":"'S1'!$F$36","v":"  "},{"$f":"'S1'!$F$35","v":"  "},{"$f":"'S1'!$F$34","v":"  "}]
[9,{"$f":"'S1'!$H$39","v":"  "},{"$f":"'S1'!$H$38","v":"  "},{"$f":"'S1'!$H$37","v":"  "},{"$f":"'S1'!$H$36","v":"  "},{"$f":"'S1'!$H$35","v":"  "},{"$f":"'S1'!$H$34","v":"  "}]
[10,{"$f":"'S1'!$J$39","v":"  "},{"$f":"'S1'!$J$38","v":"  "},{"$f":"'S1'!$J$37","v":"  "},{"$f":"'S1'!$J$36","v":"  "},{"$f":"'S1'!$J$35","v":"  "},{"$f":"'S1'!$J$34","v":"  "}]
[11,{"$f":"'S1'!$L$39","v":"  "},{"$f":"'S1'!$L$38","v":"  "},{"$f":"'S1'!$L$37","v":"  "},{"$f":"'S1'!$L$36","v":"  "},{"$f":"'S1'!$L$35","v":"  "},{"$f":"'S1'!$L$34","v":"  "}]
[12,{"$f":"'S1'!$N$39","v":"  "},{"$f":"'S1'!$N$38","v":"  "},{"$f":"'S1'!$N$37","v":"  "},{"$f":"'S1'!$N$36","v":"  "},{"$f":"'S1'!$N$35","v":"  "},{"$f":"'S1'!$N$34","v":"  "}]
[13,{"$f":"'S2'!$D$20","v":"  "},{"$f":"'S2'!$D$19","v":"  "},{"$f":"'S2'!$D$18","v":"  "},{"$f":"'S2'!$D$17","v":"  "},{"$f":"'S2'!$D$16","v":"  "},{"$f":"'S2'!$D$15","v":"  "}]
[14,{"$f":"'S2'!$F$20","v":"  "},{"$f":"'S2'!$F$19","v":"  "},{"$f":"'S2'!$F$18","v":"  "},{"$f":"'S2'!$F$17","v":"  "},{"$f":"'S2'!$F$16","v":"  "},{"$f":"'S2'!$F$15","v":"  "}]
[15,{"$f":"'S2'!$H$20","v":"  "},{"$f":"'S2'!$H$19","v":"  "},{"$f":"'S2'!$H$18","v":"  "},{"$f":"'S2'!$H$17","v":"  "},{"$f":"'S2'!$H$16","v":"  "},{"$f":"'S2'!$H$15","v":"  "}]
[16,{"$f":"'S2'!$J$20","v":"  "},{"$f":"'S2'!$J$19","v":"  "},{"$f":"'S2'!$J$18","v":"  "},{"$f":"'S2'!$J$17","v":"  "},{"$f":"'S2'!$J$16","v":"  "},{"$f":"'S2'!$J$15","v":"  "}]
[17,{"$f":"'S2'!$L$20","v":"  "},{"$f":"'S2'!$L$19","v":"  "},{"$f":"'S2'!$L$18","v":"  "},{"$f":"'S2'!$L$17","v":"  "},{"$f":"'S2'!$L$16","v":"  "},{"$f":"'S2'!$L$15","v":"  "}]
[18,{"$f":"'S2'!$N$20","v":"  "},{"$f":"'S2'!$N$19","v":"  "},{"$f":"'S2'!$N$18","v":"  "},{"$f":"'S2'!$N$17","v":"  "},{"$f":"'S2'!$N$16","v":"  "},{"$f":"'S2'!$N$15","v":"  "}]
[19,{"$f":"'S2'!$D$39","v":"  "},{"$f":"'S2'!$D$38","v":"  "},{"$f":"'S2'!$D$37","v":"  "},{"$f":"'S2'!$D$36","v":"  "},{"$f":"'S2'!$D$35","v":"  "},{"$f":"'S2'!$D$34","v":"  "}]
[20,{"$f":"'S2'!$F$39","v":"  "},{"$f":"'S2'!$F$38","v":"  "},{"$f":"'S2'!$F$37","v":"  "},{"$f":"'S2'!$F$36","v":"  "},{"$f":"'S2'!$F$35","v":"  "},{"$f":"'S2'!$F$34","v":"  "}]
[21,{"$f":"'S2'!$H$39","v":"  "},{"$f":"'S2'!$H$38","v":"  "},{"$f":"'S2'!$H$37","v":"  "},{"$f":"'S2'!$H$36","v":"  "},{"$f":"'S2'!$H$35","v":"  "},{"$f":"'S2'!$H$34","v":"  "}]
[22,{"$f":"'S2'!$J$39","v":"  "},{"$f":"'S2'!$J$38","v":"  "},{"$f":"'S2'!$J$37","v":"  "},{"$f":"'S2'!$J$36","v":"  "},{"$f":"'S2'!$J$35","v":"  "},{"$f":"'S2'!$J$34","v":"  "}]
[23,{"$f":"'S2'!$L$39","v":"  "},{"$f":"'S2'!$L$38","v":"  "},{"$f":"'S2'!$L$37","v":"  "},{"$f":"'S2'!$L$36","v":"  "},{"$f":"'S2'!$L$35","v":"  "},{"$f":"'S2'!$L$34","v":"  "}]
[24,{"$f":"'S2'!$N$39","v":"  "},{"$f":"'S2'!$N$38","v":"  "},{"$f":"'S2'!$N$37","v":"  "},{"$f":"'S2'!$N$36","v":"  "},{"$f":"'S2'!$N$35","v":"  "},{"$f":"'S2'!$N$34","v":"  "}]
[25,{"$f":"'S3'!$D$20","v":"  "},{"$f":"'S3'!$D$19","v":"  "},{"$f":"'S3'!$D$18","v":"  "},{"$f":"'S3'!$D$17","v":"  "},{"$f":"'S3'!$D$16","v":"  "},{"$f":"'S3'!$D$15","v":"  "}]
[26,{"$f":"'S3'!$F$20","v":"  "},{"$f":"'S3'!$F$19","v":"  "},{"$f":"'S3'!$F$18","v":"  "},{"$f":"'S3'!$F$17","v":"  "},{"$f":"'S3'!$F$16","v":"  "},{"$f":"'S3'!$F$15","v":"  "}]
[27,{"$f":"'S3'!$H$20","v":"  "},{"$f":"'S3'!$H$19","v":"  "},{"$f":"'S3'!$H$18","v":"  "},{"$f":"'S3'!$H$17","v":"  "},{"$f":"'S3'!$H$16","v":"  "},{"$f":"'S3'!$H$15","v":"  "}]
[28,{"$f":"'S3'!$J$20","v":"  "},{"$f":"'S3'!$J$19","v":"  "},{"$f":"'S3'!$J$18","v":"  "},{"$f":"'S3'!$J$17","v":"  "},{"$f":"'S3'!$J$16","v":"  "},{"$f":"'S3'!$J$15","v":"  "}]
[29,{"$f":"'S3'!$L$20","v":"  "},{"$f":"'S3'!$L$19","v":"  "},{"$f":"'S3'!$L$18","v":"  "},{"$f":"'S3'!$L$17","v":"  "},{"$f":"'S3'!$L$16","v":"  "},{"$f":"'S3'!$L$15","v":"  "}]
[30,{"$f":"'S3'!$N$20","v":"  "},{"$f":"'S3'!$N$19","v":"  "},{"$f":"'S3'!$N$18","v":"  "},{"$f":"'S3'!$N$17","v":"  "},{"$f":"'S3'!$N$16","v":"  "},{"$f":"'S3'!$N$15","v":"  "}]
[31,{"$f":"'S3'!$D$39","v":"  "},{"$f":"'S3'!$D$38","v":"  "},{"$f":"'S3'!$D$37","v":"  "},{"$f":"'S3'!$D$36","v":"  "},{"$f":"'S3'!$D$35","v":"  "},{"$f":"'S3'!$D$34","v":"  "}]
[32,{"$f":"'S3'!$F$39","v":"  "},{"$f":"'S3'!$F$38","v":"  "},{"$f":"'S3'!$F$37","v":"  "},{"$f":"'S3'!$F$36","v":"  "},{"$f":"'S3'!$F$35","v":"  "},{"$f":"'S3'!$F$34","v":"  "}]
[33,{"$f":"'S3'!$H$39","v":"  "},{"$f":"'S3'!$H$38","v":"  "},{"$f":"'S3'!$H$37","v":"  "},{"$f":"'S3'!$H$36","v":"  "},{"$f":"'S3'!$H$35","v":"  "},{"$f":"'S3'!$H$34","v":"  "}]
[34,{"$f":"'S3'!$J$39","v":"  "},{"$f":"'S3'!$J$38","v":"  "},{"$f":"'S3'!$J$37","v":"  "},{"$f":"'S3'!$J$36","v":"  "},{"$f":"'S3'!$J$35","v":"  "},{"$f":"'S3'!$J$34","v":"  "}]
[35,{"$f":"'S3'!$L$39","v":"  "},{"$f":"'S3'!$L$38","v":"  "},{"$f":"'S3'!$L$37","v":"  "},{"$f":"'S3'!$L$36","v":"  "},{"$f":"'S3'!$L$35","v":"  "},{"$f":"'S3'!$L$34","v":"  "}]
[36,{"$f":"'S3'!$N$39","v":"  "},{"$f":"'S3'!$N$38","v":"  "},{"$f":"'S3'!$N$37","v":"  "},{"$f":"'S3'!$N$36","v":"  "},{"$f":"'S3'!$N$35","v":"  "},{"$f":"'S3'!$N$34","v":"  "}]
[37,{"$f":"'S4'!$D$20","v":"  "},{"$f":"'S4'!$D$19","v":"  "},{"$f":"'S4'!$D$18","v":"  "},{"$f":"'S4'!$D$17","v":"  "},{"$f":"'S4'!$D$16","v":"  "},{"$f":"'S4'!$D$15","v":"  "}]
[38,{"$f":"'S4'!$F$20","v":"  "},{"$f":"'S4'!$F$19","v":"  "},{"$f":"'S4'!$F$18","v":"  "},{"$f":"'S4'!$F$17","v":"  "},{"$f":"'S4'!$F$16","v":"  "},{"$f":"'S4'!$F$15","v":"  "}]
[39,{"$f":"'S4'!$H$20","v":"  "},{"$f":"'S4'!$H$19","v":"  "},{"$f":"'S4'!$H$18","v":"  "},{"$f":"'S4'!$H$17","v":"  "},{"$f":"'S4'!$H$16","v":"  "},{"$f":"'S4'!$H$15","v":"  "}]
[40,{"$f":"'S4'!$J$20","v":"  "},{"$f":"'S4'!$J$19","v":"  "},{"$f":"'S4'!$J$18","v":"  "},{"$f":"'S4'!$J$17","v":"  "},{"$f":"'S4'!$J$16","v":"  "},{"$f":"'S4'!$J$15","v":"  "}]
[41,{"$f":"'S4'!$L$20","v":"  "},{"$f":"'S4'!$L$19","v":"  "},{"$f":"'S4'!$L$18","v":"  "},{"$f":"'S4'!$L$17","v":"  "},{"$f":"'S4'!$L$16","v":"  "},{"$f":"'S4'!$L$15","v":"  "}]
[42,{"$f":"'S4'!$N$20","v":"  "},{"$f":"'S4'!$N$19","v":"  "},{"$f":"'S4'!$N$18","v":"  "},{"$f":"'S4'!$N$17","v":"  "},{"$f":"'S4'!$N$16","v":"  "},{"$f":"'S4'!$N$15","v":"  "}]
[43,{"$f":"'S4'!$D$39","v":"  "},{"$f":"'S4'!$D$38","v":"  "},{"$f":"'S4'!$D$37","v":"  "},{"$f":"'S4'!$D$36","v":"  "},{"$f":"'S4'!$D$35","v":"  "},{"$f":"'S4'!$D$34","v":"  "}]
[44,{"$f":"'S4'!$F$39","v":"  "},{"$f":"'S4'!$F$38","v":"  "},{"$f":"'S4'!$F$37","v":"  "},{"$f":"'S4'!$F$36","v":"  "},{"$f":"'S4'!$F$35","v":"  "},{"$f":"'S4'!$F$34","v":"  "}]
[45,{"$f":"'S4'!$H$39","v":"  "},{"$f":"'S4'!$H$38","v":"  "},{"$f":"'S4'!$H$37","v":"  "},{"$f":"'S4'!$H$36","v":"  "},{"$f":"'S4'!$H$35","v":"  "},{"$f":"'S4'!$H$34","v":"  "}]
[46,{"$f":"'S4'!$J$39","v":"  "},{"$f":"'S4'!$J$38","v":"  "},{"$f":"'S4'!$J$37","v":"  "},{"$f":"'S4'!$J$36","v":"  "},{"$f":"'S4'!$J$35","v":"  "},{"$f":"'S4'!$J$34","v":"  "}]
[47,{"$f":"'S4'!$L$39","v":"  "},{"$f":"'S4'!$L$38","v":"  "},{"$f":"'S4'!$L$37","v":"  "},{"$f":"'S4'!$L$36","v":"  "},{"$f":"'S4'!$L$35","v":"  "},{"$f":"'S4'!$L$34","v":"  "}]
[48,{"$f":"'S4'!$N$39","v":"  "},{"$f":"'S4'!$N$38","v":"  "},{"$f":"'S4'!$N$37","v":"  "},{"$f":"'S4'!$N$36","v":"  "},{"$f":"'S4'!$N$35","v":"  "},{"$f":"'S4'!$N$34","v":"  "}]
[49,{"$f":"'S5'!$D$20","v":"  "},{"$f":"'S5'!$D$19","v":"  "},{"$f":"'S5'!$D$18","v":"  "},{"$f":"'S5'!$D$17","v":"  "},{"$f":"'S5'!$D$16","v":"  "},{"$f":"'S5'!$D$15","v":"  "}]
[50,{"$f":"'S5'!$F$20","v":"  "},{"$f":"'S5'!$F$19","v":"  "},{"$f":"'S5'!$F$18","v":"  "},{"$f":"'S5'!$F$17","v":"  "},{"$f":"'S5'!$F$16","v":"  "},{"$f":"'S5'!$F$15","v":"  "}]
[51,{"$f":"'S5'!$H$20","v":"  "},{"$f":"'S5'!$H$19","v":"  "},{"$f":"'S5'!$H$18","v":"  "},{"$f":"'S5'!$H$17","v":"  "},{"$f":"'S5'!$H$16","v":"  "},{"$f":"'S5'!$H$15","v":"  "}]
[52,{"$f":"'S5'!$J$20","v":"  "},{"$f":"'S5'!$J$19","v":"  "},{"$f":"'S5'!$J$18","v":"  "},{"$f":"'S5'!$J$17","v":"  "},{"$f":"'S5'!$J$16","v":"  "},{"$f":"'S5'!$J$15","v":"  "}]
[53,{"$f":"'S5'!$L$20","v":"  "},{"$f":"'S5'!$L$19","v":"  "},{"$f":"'S5'!$L$18","v":"  "},{"$f":"'S5'!$L$17","v":"  "},{"$f":"'S5'!$L$16","v":"  "},{"$f":"'S5'!$L$15","v":"  "}]
[54,{"$f":"'S5'!$N$20","v":"  "},{"$f":"'S5'!$N$19","v":"  "},{"$f":"'S5'!$N$18","v":"  "},{"$f":"'S5'!$N$17","v":"  "},{"$f":"'S5'!$N$16","v":"  "},{"$f":"'S5'!$N$15","v":"  "}]
[55,{"$f":"'S5'!$D$39","v":"  "},{"$f":"'S5'!$D$38","v":"  "},{"$f":"'S5'!$D$37","v":"  "},{"$f":"'S5'!$D$36","v":"  "},{"$f":"'S5'!$D$35","v":"  "},{"$f":"'S5'!$D$34","v":"  "}]
[56,{"$f":"'S5'!$F$39","v":"  "},{"$f":"'S5'!$F$38","v":"  "},{"$f":"'S5'!$F$37","v":"  "},{"$f":"'S5'!$F$36","v":"  "},{"$f":"'S5'!$F$35","v":"  "},{"$f":"'S5'!$F$34","v":"  "}]
[57,{"$f":"'S5'!$H$39","v":"  "},{"$f":"'S5'!$H$38","v":"  "},{"$f":"'S5'!$H$37","v":"  "},{"$f":"'S5'!$H$36","v":"  "},{"$f":"'S5'!$H$35","v":"  "},{"$f":"'S5'!$H$34","v":"  "}]
[58,{"$f":"'S5'!$J$39","v":"  "},{"$f":"'S5'!$J$38","v":"  "},{"$f":"'S5'!$J$37","v":"  "},{"$f":"'S5'!$J$36","v":"  "},{"$f":"'S5'!$J$35","v":"  "},{"$f":"'S5'!$J$34","v":"  "}]
[59,{"$f":"'S5'!$L$39","v":"  "},{"$f":"'S5'!$L$38","v":"  "},{"$f":"'S5'!$L$37","v":"  "},{"$f":"'S5'!$L$36","v":"  "},{"$f":"'S5'!$L$35","v":"  "},{"$f":"'S5'!$L$34","v":"  "}]
[60,{"$f":"'S5'!$N$39","v":"  "},{"$f":"'S5'!$N$38","v":"  "},{"$f":"'S5'!$N$37","v":"  "},{"$f":"'S5'!$N$36","v":"  "},{"$f":"'S5'!$N$35","v":"  "},{"$f":"'S5'!$N$34","v":"  "}]
[61,{"$f":"'S6'!$D$20","v":"  "},{"$f":"'S6'!$D$19","v":"  "},{"$f":"'S6'!$D$18","v":"  "},{"$f":"'S6'!$D$17","v":"  "},{"$f":"'S6'!$D$16","v":"  "},{"$f":"'S6'!$D$15","v":"  "}]
[62,{"$f":"'S6'!$F$20","v":"  "},{"$f":"'S6'!$F$19","v":"  "},{"$f":"'S6'!$F$18","v":"  "},{"$f":"'S6'!$F$17","v":"  "},{"$f":"'S6'!$F$16","v":"  "},{"$f":"'S6'!$F$15","v":"  "}]
[63,{"$f":"'S6'!$H$20","v":"  "},{"$f":"'S6'!$H$19","v":"  "},{"$f":"'S6'!$H$18","v":"  "},{"$f":"'S6'!$H$17","v":"  "},{"$f":"'S6'!$H$16","v":"  "},{"$f":"'S6'!$H$15","v":"  "}]
[64,{"$f":"'S6'!$J$20","v":"  "},{"$f":"'S6'!$J$19","v":"  "},{"$f":"'S6'!$J$18","v":"  "},{"$f":"'S6'!$J$17","v":"  "},{"$f":"'S6'!$J$16","v":"  "},{"$f":"'S6'!$J$15","v":"  "}]
[65,{"$f":"'S6'!$L$20","v":"  "},{"$f":"'S6'!$L$19","v":"  "},{"$f":"'S6'!$L$18","v":"  "},{"$f":"'S6'!$L$17","v":"  "},{"$f":"'S6'!$L$16","v":"  "},{"$f":"'S6'!$L$15","v":"  "}]
[66,{"$f":"'S6'!$N$20","v":"  "},{"$f":"'S6'!$N$19","v":"  "},{"$f":"'S6'!$N$18","v":"  "},{"$f":"'S6'!$N$17","v":"  "},{"$f":"'S6'!$N$16","v":"  "},{"$f":"'S6'!$N$15","v":"  "}]
[67,{"$f":"'S6'!$D$39","v":"  "},{"$f":"'S6'!$D$38","v":"  "},{"$f":"'S6'!$D$37","v":"  "},{"$f":"'S6'!$D$36","v":"  "},{"$f":"'S6'!$D$35","v":"  "},{"$f":"'S6'!$D$34","v":"  "}]
[68,{"$f":"'S6'!$F$39","v":"  "},{"$f":"'S6'!$F$38","v":"  "},{"$f":"'S6'!$F$37","v":"  "},{"$f":"'S6'!$F$36","v":"  "},{"$f":"'S6'!$F$35","v":"  "},{"$f":"'S6'!$F$34","v":"  "}]
[69,{"$f":"'S6'!$H$39","v":"  "},{"$f":"'S6'!$H$38","v":"  "},{"$f":"'S6'!$H$37","v":"  "},{"$f":"'S6'!$H$36","v":"  "},{"$f":"'S6'!$H$35","v":"  "},{"$f":"'S6'!$H$34","v":"  "}]
[70,{"$f":"'S6'!$J$39","v":"  "},{"$f":"'S6'!$J$38","v":"  "},{"$f":"'S6'!$J$37","v":"  "},{"$f":"'S6'!$J$36","v":"  "},{"$f":"'S6'!$J$35","v":"  "},{"$f":"'S6'!$J$34","v":"  "}]
[71,{"$f":"'S6'!$L$39","v":"  "},{"$f":"'S6'!$L$38","v":"  "},{"$f":"'S6'!$L$37","v":"  "},{"$f":"'S6'!$L$36","v":"  "},{"$f":"'S6'!$L$35","v":"  "},{"$f":"'S6'!$L$34","v":"  "}]
[72,{"$f":"'S6'!$N$39","v":"  "},{"$f":"'S6'!$N$38","v":"  "},{"$f":"'S6'!$N$37","v":"  "},{"$f":"'S6'!$N$36","v":"  "},{"$f":"'S6'!$N$35","v":"  "},{"$f":"'S6'!$N$34","v":"  "}]
[73,{"$f":"'S7'!$D$20","v":"  "},{"$f":"'S7'!$D$19","v":"  "},{"$f":"'S7'!$D$18","v":"  "},{"$f":"'S7'!$D$17","v":"  "},{"$f":"'S7'!$D$16","v":"  "},{"$f":"'S7'!$D$15","v":"  "}]
[74,{"$f":"'S7'!$F$20","v":"  "},{"$f":"'S7'!$F$19","v":"  "},{"$f":"'S7'!$F$18","v":"  "},{"$f":"'S7'!$F$17","v":"  "},{"$f":"'S7'!$F$16","v":"  "},{"$f":"'S7'!$F$15","v":"  "}]
[75,{"$f":"'S7'!$H$20","v":"  "},{"$f":"'S7'!$H$19","v":"  "},{"$f":"'S7'!$H$18","v":"  "},{"$f":"'S7'!$H$17","v":"  "},{"$f":"'S7'!$H$16","v":"  "},{"$f":"'S7'!$H$15","v":"  "}]
[76,{"$f":"'S7'!$J$20","v":"  "},{"$f":"'S7'!$J$19","v":"  "},{"$f":"'S7'!$J$18","v":"  "},{"$f":"'S7'!$J$17","v":"  "},{"$f":"'S7'!$J$16","v":"  "},{"$f":"'S7'!$J$15","v":"  "}]
[77,{"$f":"'S7'!$L$20","v":"  "},{"$f":"'S7'!$L$19","v":"  "},{"$f":"'S7'!$L$18","v":"  "},{"$f":"'S7'!$L$17","v":"  "},{"$f":"'S7'!$L$16","v":"  "},{"$f":"'S7'!$L$15","v":"  "}]
[78,{"$f":"'S7'!$N$20","v":"  "},{"$f":"'S7'!$N$19","v":"  "},{"$f":"'S7'!$N$18","v":"  "},{"$f":"'S7'!$N$17","v":"  "},{"$f":"'S7'!$N$16","v":"  "},{"$f":"'S7'!$N$15","v":"  "}]
[79,{"$f":"'S7'!$D$39","v":"  "},{"$f":"'S7'!$D$38","v":"  "},{"$f":"'S7'!$D$37","v":"  "},{"$f":"'S7'!$D$36","v":"  "},{"$f":"'S7'!$D$35","v":"  "},{"$f":"'S7'!$D$34","v":"  "}]
[80,{"$f":"'S7'!$F$39","v":"  "},{"$f":"'S7'!$F$38","v":"  "},{"$f":"'S7'!$F$37","v":"  "},{"$f":"'S7'!$F$36","v":"  "},{"$f":"'S7'!$F$35","v":"  "},{"$f":"'S7'!$F$34","v":"  "}]
[81,{"$f":"'S7'!$H$39","v":"  "},{"$f":"'S7'!$H$38","v":"  "},{"$f":"'S7'!$H$37","v":"  "},{"$f":"'S7'!$H$36","v":"  "},{"$f":"'S7'!$H$35","v":"  "},{"$f":"'S7'!$H$34","v":"  "}]
[82,{"$f":"'S7'!$J$39","v":"  "},{"$f":"'S7'!$J$38","v":"  "},{"$f":"'S7'!$J$37","v":"  "},{"$f":"'S7'!$J$36","v":"  "},{"$f":"'S7'!$J$35","v":"  "},{"$f":"'S7'!$J$34","v":"  "}]
[83,{"$f":"'S7'!$L$39","v":"  "},{"$f":"'S7'!$L$38","v":"  "},{"$f":"'S7'!$L$37","v":"  "},{"$f":"'S7'!$L$36","v":"  "},{"$f":"'S7'!$L$35","v":"  "},{"$f":"'S7'!$L$34","v":"  "}]
[84,{"$f":"'S7'!$N$39","v":"  "},{"$f":"'S7'!$N$38","v":"  "},{"$f":"'S7'!$N$37","v":"  "},{"$f":"'S7'!$N$36","v":"  "},{"$f":"'S7'!$N$35","v":"  "},{"$f":"'S7'!$N$34","v":"  "}]
[85,{"$f":"'S8'!$D$20","v":"  "},{"$f":"'S8'!$D$19","v":"  "},{"$f":"'S8'!$D$18","v":"  "},{"$f":"'S8'!$D$17","v":"  "},{"$f":"'S8'!$D$16","v":"  "},{"$f":"'S8'!$D$15","v":"  "}]
[86,{"$f":"'S8'!$F$20","v":"  "},{"$f":"'S8'!$F$19","v":"  "},{"$f":"'S8'!$F$18","v":"  "},{"$f":"'S8'!$F$17","v":"  "},{"$f":"'S8'!$F$16","v":"  "},{"$f":"'S8'!$F$15","v":"  "}]
[87,{"$f":"'S8'!$H$20","v":"  "},{"$f":"'S8'!$H$19","v":"  "},{"$f":"'S8'!$H$18","v":"  "},{"$f":"'S8'!$H$17","v":"  "},{"$f":"'S8'!$H$16","v":"  "},{"$f":"'S8'!$H$15","v":"  "}]
[88,{"$f":"'S8'!$J$20","v":"  "},{"$f":"'S8'!$J$19","v":"  "},{"$f":"'S8'!$J$18","v":"  "},{"$f":"'S8'!$J$17","v":"  "},{"$f":"'S8'!$J$16","v":"  "},{"$f":"'S8'!$J$15","v":"  "}]
[89,{"$f":"'S8'!$L$20","v":"  "},{"$f":"'S8'!$L$19","v":"  "},{"$f":"'S8'!$L$18","v":"  "},{"$f":"'S8'!$L$17","v":"  "},{"$f":"'S8'!$L$16","v":"  "},{"$f":"'S8'!$L$15","v":"  "}]
[90,{"$f":"'S8'!$N$20","v":"  "},{"$f":"'S8'!$N$19","v":"  "},{"$f":"'S8'!$N$18","v":"  "},{"$f":"'S8'!$N$17","v":"  "},{"$f":"'S8'!$N$16","v":"  "},{"$f":"'S8'!$N$15","v":"  "}]
[91,{"$f":"'S8'!$D$39","v":"  "},{"$f":"'S8'!$D$38","v":"  "},{"$f":"'S8'!$D$37","v":"  "},{"$f":"'S8'!$D$36","v":"  "},{"$f":"'S8'!$D$35","v":"  "},{"$f":"'S8'!$D$34","v":"  "}]
[92,{"$f":"'S8'!$F$39","v":"  "},{"$f":"'S8'!$F$38","v":"  "},{"$f":"'S8'!$F$37","v":"  "},{"$f":"'S8'!$F$36","v":"  "},{"$f":"'S8'!$F$35","v":"  "},{"$f":"'S8'!$F$34","v":"  "}]
[93,{"$f":"'S8'!$H$39","v":"  "},{"$f":"'S8'!$H$38","v":"  "},{"$f":"'S8'!$H$37","v":"  "},{"$f":"'S8'!$H$36","v":"  "},{"$f":"'S8'!$H$35","v":"  "},{"$f":"'S8'!$H$34","v":"  "}]
[94,{"$f":"'S8'!$J$39","v":"  "},{"$f":"'S8'!$J$38","v":"  "},{"$f":"'S8'!$J$37","v":"  "},{"$f":"'S8'!$J$36","v":"  "},{"$f":"'S8'!$J$35","v":"  "},{"$f":"'S8'!$J$34","v":"  "}]
[95,{"$f":"'S8'!$L$39","v":"  "},{"$f":"'S8'!$L$38","v":"  "},{"$f":"'S8'!$L$37","v":"  "},{"$f":"'S8'!$L$36","v":"  "},{"$f":"'S8'!$L$35","v":"  "},{"$f":"'S8'!$L$34","v":"  "}]
[96,{"$f":"'S8'!$N$39","v":"  "},{"$f":"'S8'!$N$38","v":"  "},{"$f":"'S8'!$N$37","v":"  "},{"$f":"'S8'!$N$36","v":"  "},{"$f":"'S8'!$N$35","v":"  "},{"$f":"'S8'!$N$34","v":"  "}]
[97,{"$f":"'S9'!$D$20","v":"  "},{"$f":"'S9'!$D$19","v":"  "},{"$f":"'S9'!$D$18","v":"  "},{"$f":"'S9'!$D$17","v":"  "},{"$f":"'S9'!$D$16","v":"  "},{"$f":"'S9'!$D$15","v":"  "}]
[98,{"$f":"'S9'!$F$20","v":"  "},{"$f":"'S9'!$F$19","v":"  "},{"$f":"'S9'!$F$18","v":"  "},{"$f":"'S9'!$F$17","v":"  "},{"$f":"'S9'!$F$16","v":"  "},{"$f":"'S9'!$F$15","v":"  "}]
[99,{"$f":"'S9'!$H$20","v":"  "},{"$f":"'S9'!$H$19","v":"  "},{"$f":"'S9'!$H$18","v":"  "},{"$f":"'S9'!$H$17","v":"  "},{"$f":"'S9'!$H$16","v":"  "},{"$f":"'S9'!$H$15","v":"  "}]
[100,{"$f":"'S9'!$J$20","v":"  "},{"$f":"'S9'!$J$19","v":"  "},{"$f":"'S9'!$J$18","v":"  "},{"$f":"'S9'!$J$17","v":"  "},{"$f":"'S9'!$J$16","v":"  "},{"$f":"'S9'!$J$15","v":"  "}]
[101,{"$f":"'S9'!$L$20","v":"  "},{"$f":"'S9'!$L$19","v":"  "},{"$f":"'S9'!$L$18","v":"  "},{"$f":"'S9'!$L$17","v":"  "},{"$f":"'S9'!$L$16","v":"  "},{"$f":"'S9'!$L$15","v":"  "}]
[102,{"$f":"'S9'!$N$20","v":"  "},{"$f":"'S9'!$N$19","v":"  "},{"$f":"'S9'!$N$18","v":"  "},{"$f":"'S9'!$N$17","v":"  "},{"$f":"'S9'!$N$16","v":"  "},{"$f":"'S9'!$N$15","v":"  "}]
[103,{"$f":"'S9'!$D$39","v":"  "},{"$f":"'S9'!$D$38","v":"  "},{"$f":"'S9'!$D$37","v":"  "},{"$f":"'S9'!$D$36","v":"  "},{"$f":"'S9'!$D$35","v":"  "},{"$f":"'S9'!$D$34","v":"  "}]
[104,{"$f":"'S9'!$F$39","v":"  "},{"$f":"'S9'!$F$38","v":"  "},{"$f":"'S9'!$F$37","v":"  "},{"$f":"'S9'!$F$36","v":"  "},{"$f":"'S9'!$F$35","v":"  "},{"$f":"'S9'!$F$34","v":"  "}]
[105,{"$f":"'S9'!$H$39","v":"  "},{"$f":"'S9'!$H$38","v":"  "},{"$f":"'S9'!$H$37","v":"  "},{"$f":"'S9'!$H$36","v":"  "},{"$f":"'S9'!$H$35","v":"  "},{"$f":"'S9'!$H$34","v":"  "}]
[106,{"$f":"'S9'!$J$39","v":"  "},{"$f":"'S9'!$J$38","v":"  "},{"$f":"'S9'!$J$37","v":"  "},{"$f":"'S9'!$J$36","v":"  "},{"$f":"'S9'!$J$35","v":"  "},{"$f":"'S9'!$J$34","v":"  "}]
[107,{"$f":"'S9'!$L$39","v":"  "},{"$f":"'S9'!$L$38","v":"  "},{"$f":"'S9'!$L$37","v":"  "},{"$f":"'S9'!$L$36","v":"  "},{"$f":"'S9'!$L$35","v":"  "},{"$f":"'S9'!$L$34","v":"  "}]
[108,{"$f":"'S9'!$N$39","v":"  "},{"$f":"'S9'!$N$38","v":"  "},{"$f":"'S9'!$N$37","v":"  "},{"$f":"'S9'!$N$36","v":"  "},{"$f":"'S9'!$N$35","v":"  "},{"$f":"'S9'!$N$34","v":"  "}]
[109,{"$f":"'S10'!$D$20","v":"  "},{"$f":"'S10'!$D$19","v":"  "},{"$f":"'S10'!$D$18","v":"  "},{"$f":"'S10'!$D$17","v":"  "},{"$f":"'S10'!$D$16","v":"  "},{"$f":"'S10'!$D$15","v":"  "}]
[110,{"$f":"'S10'!$F$20","v":"  "},{"$f":"'S10'!$F$19","v":"  "},{"$f":"'S10'!$F$18","v":"  "},{"$f":"'S10'!$F$17","v":"  "},{"$f":"'S10'!$F$16","v":"  "},{"$f":"'S10'!$F$15","v":"  "}]
[111,{"$f":"'S10'!$H$20","v":"  "},{"$f":"'S10'!$H$19","v":"  "},{"$f":"'S10'!$H$18","v":"  "},{"$f":"'S10'!$H$17","v":"  "},{"$f":"'S10'!$H$16","v":"  "},{"$f":"'S10'!$H$15","v":"  "}]
[112,{"$f":"'S10'!$J$20","v":"  "},{"$f":"'S10'!$J$19","v":"  "},{"$f":"'S10'!$J$18","v":"  "},{"$f":"'S10'!$J$17","v":"  "},{"$f":"'S10'!$J$16","v":"  "},{"$f":"'S10'!$J$15","v":"  "}]
[113,{"$f":"'S10'!$L$20","v":"  "},{"$f":"'S10'!$L$19","v":"  "},{"$f":"'S10'!$L$18","v":"  "},{"$f":"'S10'!$L$17","v":"  "},{"$f":"'S10'!$L$16","v":"  "},{"$f":"'S10'!$L$15","v":"  "}]
[114,{"$f":"'S10'!$N$20","v":"  "},{"$f":"'S10'!$N$19","v":"  "},{"$f":"'S10'!$N$18","v":"  "},{"$f":"'S10'!$N$17","v":"  "},{"$f":"'S10'!$N$16","v":"  "},{"$f":"'S10'!$N$15","v":"  "}]
[115,{"$f":"'S10'!$D$39","v":"  "},{"$f":"'S10'!$D$38","v":"  "},{"$f":"'S10'!$D$37","v":"  "},{"$f":"'S10'!$D$36","v":"  "},{"$f":"'S10'!$D$35","v":"  "},{"$f":"'S10'!$D$34","v":"  "}]
[116,{"$f":"'S10'!$F$39","v":"  "},{"$f":"'S10'!$F$38","v":"  "},{"$f":"'S10'!$F$37","v":"  "},{"$f":"'S10'!$F$36","v":"  "},{"$f":"'S10'!$F$35","v":"  "},{"$f":"'S10'!$F$34","v":"  "}]
[117,{"$f":"'S10'!$H$39","v":"  "},{"$f":"'S10'!$H$38","v":"  "},{"$f":"'S10'!$H$37","v":"  "},{"$f":"'S10'!$H$36","v":"  "},{"$f":"'S10'!$H$35","v":"  "},{"$f":"'S10'!$H$34","v":"  "}]
[118,{"$f":"'S10'!$J$39","v":"  "},{"$f":"'S10'!$J$38","v":"  "},{"$f":"'S10'!$J$37","v":"  "},{"$f":"'S10'!$J$36","v":"  "},{"$f":"'S10'!$J$35","v":"  "},{"$f":"'S10'!$J$34","v":"  "}]
[119,{"$f":"'S10'!$L$39","v":"  "},{"$f":"'S10'!$L$38","v":"  "},{"$f":"'S10'!$L$37","v":"  "},{"$f":"'S10'!$L$36","v":"  "},{"$f":"'S10'!$L$35","v":"  "},{"$f":"'S10'!$L$34","v":"  "}]
[120,{"$f":"'S10'!$N$39","v":"  "},{"$f":"'S10'!$N$38","v":"  "},{"$f":"'S10'!$N$37","v":"  "},{"$f":"'S10'!$N$36","v":"  "},{"$f":"'S10'!$N$35","v":"  "},{"$f":"'S10'!$N$34","v":"  "}]

{"sheet":"Avg","index":16,"n_rows":7,"n_cols":8,"rows_kept":7,"cut":false,"hidden":false,"merged":[[1,0,1,6],[1,7,1,8]]}
[]
["Average Gradations",null,null,null,null,null,null,{"$f":"IF(ISBLANK('S1'!L4),\" \",'S1'!L4)","v":"Type AS4"}]
[]
["Sieve",200,100,8,4,0.25,0.375]
["Count",{"$f":"COUNT('ST1'!B6:B125)","v":0},{"$f":"COUNT('ST1'!C6:C125)","v":0},{"$f":"COUNT('ST1'!D6:D125)","v":0},{"$f":"COUNT('ST1'!E6:E125)","v":0},{"$f":"COUNT('ST1'!F6:F125)","v":0},{"$f":"COUNT('ST1'!G6:G125)","v":0}]
["Avg",{"$f":"AVERAGE('ST1'!B6:B125)","v":{"$error":"#DIV/0!"}},{"$f":"AVERAGE('ST1'!C6:C125)","v":{"$error":"#DIV/0!"}},{"$f":"AVERAGE('ST1'!D6:D125)","v":{"$error":"#DIV/0!"}},{"$f":"AVERAGE('ST1'!E6:E125)","v":{"$error":"#DIV/0!"}},{"$f":"AVERAGE('ST1'!F6:F125)","v":{"$error":"#DIV/0!"}},{"$f":"AVERAGE('ST1'!G6:G125)","v":{"$error":"#DIV/0!"}}]
["St Dev",{"$f":"STDEV('ST1'!B6:B125)","v":{"$error":"#DIV/0!"}},{"$f":"STDEV('ST1'!C6:C125)","v":{"$error":"#DIV/0!"}},{"$f":"STDEV('ST1'!D6:D125)","v":{"$error":"#DIV/0!"}},{"$f":"STDEV('ST1'!E6:E125)","v":{"$error":"#DIV/0!"}},{"$f":"STDEV('ST1'!F6:F125)","v":{"$error":"#DIV/0!"}},{"$f":"STDEV('ST1'!G6:G125)","v":{"$error":"#DIV/0!"}}]

{"sheet":"ST13","index":17,"n_rows":122,"n_cols":16,"rows_kept":122,"cut":false,"hidden":true,"merged":[[0,1,0,2],[0,3,0,4],[0,5,0,6],[0,7,0,8],[0,9,0,10]]}
["Sam. No.",0.375,null,4,null,8,null,100,null,200,null,null,null,null,null,{"$f":"'S1'!L4","v":"Type AS4"}]
[null,"N=1","N=3","N=1","N=3","N=1","N=3","N=1","N=3","N=1","N=3"]
[{"$f":"IF(ISBLANK('S1'!C$8),\" \",'S1'!C$8)","v":" "},{"$f":"IF(ISTEXT('S1'!$D$15),NA(),'S1'!$D$15)","v":{"$error":"#N/A"}},null,{"$f":"IF(ISTEXT('S1'!$D$17),NA(),'S1'!$D$17)","v":{"$error":"#N/A"}},{"$f":"D3","v":{"$error":"#N/A"}},{"$f":"IF(ISTEXT('S1'!$D$18),NA(),'S1'!$D$18)","v":{"$error":"#N/A"}},{"$f":"F3","v":{"$error":"#N/A"}},{"$f":"IF(ISTEXT('S1'!$D$19),NA(),'S1'!$D$19)","v":{"$error":"#N/A"}},null,{"$f":"IF(ISTEXT('S1'!$D$20),NA(),'S1'!$D$20)","v":{"$error":"#N/A"}},{"$f":"J3","v":{"$error":"#N/A"}}]
[{"$f":"IF(ISBLANK('S1'!E$8),\" \",'S1'!E$8)","v":" "},{"$f":"IF(ISTEXT('S1'!$F$15),NA(),'S1'!$F$15)","v":{"$error":"#N/A"}},null,{"$f":"IF(ISTEXT('S1'!$F$17),NA(),'S1'!$F$17)","v":{"$error":"#N/A"}},{"$f":"ROUND(AVERAGE(D3:D4),0)","v":{"$error":"#N/A"}},{"$f":"IF(ISTEXT('S1'!$F$18),NA(),'S1'!$F$18)","v":{"$error":"#N/A"}},{"$f":"ROUND(AVERAGE(F3:F4),0)","v":{"$error":"#N/A"}},{"$f":"IF(ISTEXT('S1'!$F$19),NA(),'S1'!$F$19)","v":{"$error":"#N/A"}},null,{"$f":"IF(ISTEXT('S1'!$F$20),NA(),'S1'!$F$20)","v":{"$error":"#N/A"}},{"$f":"ROUND(AVERAGE(J3:J4),1)","v":{"$error":"#N/A"}}]
[{"$f":"IF(ISBLANK('S1'!G$8),\" \",'S1'!G$8)","v":" "},{"$f":"IF(ISTEXT('S1'!$H$15),NA(),'S1'!$H$15)","v":{"$error":"#N/A"}},null,{"$f":"IF(ISTEXT('S1'!$H$17),NA(),'S1'!$H$17)","v":{"$error":"#N/A"}},{"$f":"ROUND(AVERAGE(D3:D5),0)","v":{"$error":"#N/A"}},{"$f":"IF(ISTEXT('S1'!$H$18),NA(),'S1'!$H$18)","v":{"$error":"#N/A"}},{"$f":"ROUND(AVERAGE(F3:F5),0)","v":{"$error":"#N/A"}},{"$f":"IF(ISTEXT('S1'!$H$19),NA(),'S1'!$H$19)","v":{"$error":"#N/A"}},null,{"$f":"IF(ISTEXT('S1'!$H$20),NA(),'S1'!$H$20)","v":{"$error":"#N/A"}},{"$f":"ROUND(AVERAGE(J3:J5),1)","v":{"$error":"#N/A"}}]
[{"$f":"IF(ISBLANK('S1'!I$8),\" \",'S1'!I$8)","v":" "},{"$f":"IF(ISTEXT('S1'!$J$15),NA(),'S1'!$J$15)","v":{"$error":"#N/A"}},null,{"$f":"IF(ISTEXT('S1'!$J$17),NA(),'S1'!$J$17)","v":{"$error":"#N/A"}},{"$f":"ROUND(AVERAGE(D4:D6),0)","v":{"$error":"#N/A"}},{"$f":"IF(ISTEXT('S1'!$J$18),NA(),'S1'!$J$18)","v":{"$error":"#N/A"}},{"$f":"ROUND(AVERAGE(F4:F6),0)","v":{"$error":"#N/A"}},{"$f":"IF(ISTEXT('S1'!$J$19),NA(),'S1'!$J$19)","v":{"$error":"#N/A"}},null,{"$f":"IF(ISTEXT('S1'!$J$20),NA(),'S1'!$J$20)","v":{"$error":"#N/A"}},{"$error":"#N/A"}]
[{"$f":"IF(ISBLANK('S1'!K$8),\" \",'S1'!K$8)","v":" "},{"$f":"IF(ISTEXT('S1'!$L$15),NA(),'S1'!$L$15)","v":{"$error":"#N/A"}},null,{"$f":"IF(ISTEXT('S1'!$L$17),NA(),'S1'!$L$17)","v":{"$error":"#N/A"}},{"$f":"ROUND(AVERAGE(D5:D7),0)","v":{"$error":"#N/A"}},{"$f":"IF(ISTEXT('S1'!$L$18),NA(),'S1'!$L$18)","v":{"$error":"#N/A"}},{"$error":"#N/A"},{"$f":"IF(ISTEXT('S1'!$L$19),NA(),'S1'!$L$19)","v":{"$error":"#N/A"}},null,{"$f":"IF(ISTEXT('S1'!$L$20),NA(),'S1'!$L$20)","v":{"$error":"#N/A"}},{"$error":"#N/A"}]
[{"$f":"IF(ISBLANK('S1'!M$8),\" \",'S1'!M$8)","v":" "},{"$f":"IF(ISTEXT('S1'!$N$15),NA(),'S1'!$N$15)","v":{"$error":"#N/A"}},null,{"$f":"IF(ISTEXT('S1'!$N$17),NA(),'S1'!$N$17)","v":{"$error":"#N/A"}},{"$error":"#N/A"},{"$f":"IF(ISTEXT('S1'!$N$18),NA(),'S1'!$N$18)","v":{"$error":"#N/A"}},{"$error":"#N/A"},{"$f":"IF(ISTEXT('S1'!$N$19),NA(),'S1'!$N$19)","v":{"$error":"#N/A"}},null,{"$f":"IF(ISTEXT('S1'!$N$20),NA(),'S1'!$N$20)","v":{"$error":"#N/A"}},{"$error":"#N/A"}]
[{"$f":"IF(ISBLANK('S1'!C$27),\" \",'S1'!C$27)","v":" "},{"$f":"IF(ISTEXT('S1'!$D$34),NA(),'S1'!$D$34)","v":{"$error":"#N/A"}},null,{"$f":"IF(ISTEXT('S1'!$D$36),NA(),'S1'!$D$36)","v":{"$error":"#N/A"}},{"$error":"#N/A"},{"$f":"IF(ISTEXT('S1'!$D$37),NA(),'S1'!$D$37)","v":{"$error":"#N/A"}},{"$error":"#N/A"},{"$f":"IF(ISTEXT('S1'!$D$38),NA(),'S1'!$D$38)","v":{"$error":"#N/A"}},null,{"$f":"IF(ISTEXT('S1'!$D$39),NA(),'S1'!$D$39)","v":{"$error":"#N/A"}},{"$error":"#N/A"}]
[{"$f":"IF(ISBLANK('S1'!E$27),\" \",'S1'!E$27)","v":" "},{"$f":"IF(ISTEXT('S1'!$F$34),NA(),'S1'!$F$34)","v":{"$error":"#N/A"}},null,{"$f":"IF(ISTEXT('S1'!$F$36),NA(),'S1'!$F$36)","v":{"$error":"#N/A"}},{"$error":"#N/A"},{"$f":"IF(ISTEXT('S1'!$F$37),NA(),'S1'!$F$37)","v":{"$error":"#N/A"}},{"$error":"#N/A"},{"$f":"IF(ISTEXT('S1'!$F$38),NA(),'S1'!$F$38)","v":{"$error":"#N/A"}},null,{"$f":"IF(ISTEXT('S1'!$F$39),NA(),'S1'!$F$39)","v":{"$error":"#N/A"}},{"$error":"#N/A"}]
[{"$f":"IF(ISBLANK('S1'!G$27),\" \",'S1'!G$27)","v":" "},{"$f":"IF(ISTEXT('S1'!$H$34),NA(),'S1'!$H$34)","v":{"$error":"#N/A"}},null,{"$f":"IF(ISTEXT('S1'!$H$36),NA(),'S1'!$H$36)","v":{"$error":"#N/A"}},{"$error":"#N/A"},{"$f":"IF(ISTEXT('S1'!$H$37),NA(),'S1'!$H$37)","v":{"$error":"#N/A"}},{"$error":"#N/A"},{"$f":"IF(ISTEXT('S1'!$H$38),NA(),'S1'!$H$38)","v":{"$error":"#N/A"}},null,{"$f":"IF(ISTEXT('S1'!$H$39),NA(),'S1'!$H$39)","v":{"$error":"#N/A"}},{"$error":"#N/A"}]
[{"$f":"IF(ISBLANK('S1'!I$27),\" \",'S1'!I$27)","v":" "},{"$f":"IF(ISTEXT('S1'!$J$34),NA(),'S1'!$J$34)","v":{"$error":"#N/A"}},null,{"$f":"IF(ISTEXT('S1'!$J$36),NA(),'S1'!$J$36)","v":{"$error":"#N/A"}},{"$error":"#N/A"},{"$f":"IF(ISTEXT('S1'!$J$37),NA(),'S1'!$J$37)","v":{"$error":"#N/A"}},{"$error":"#N/A"},{"$f":"IF(ISTEXT('S1'!$J$38),NA(),'S1'!$J$38)","v":{"$error":"#N/A"}},null,{"$f":"IF(ISTEXT('S1'!$J$39),NA(),'S1'!$J$39)","v":{"$error":"#N/A"}},{"$error":"#N/A"}]
[{"$f":"IF(ISBLANK('S1'!K$27),\" \",'S1'!K$27)","v":" "},{"$f":"IF(ISTEXT('S1'!$L$34),NA(),'S1'!$L$34)","v":{"$error":"#N/A"}},null,{"$f":"IF(ISTEXT('S1'!$L$36),NA(),'S1'!$L$36)","v":{"$error":"#N/A"}},{"$error":"#N/A"},{"$f":"IF(ISTEXT('S1'!$L$37),NA(),'S1'!$L$37)","v":{"$error":"#N/A"}},{"$error":"#N/A"},{"$f":"IF(ISTEXT('S1'!$L$38),NA(),'S1'!$L$38)","v":{"$error":"#N/A"}},null,{"$f":"IF(ISTEXT('S1'!$L$39),NA(),'S1'!$L$39)","v":{"$error":"#N/A"}},{"$error":"#N/A"}]
[{"$f":"IF(ISBLANK('S1'!M$27),\" \",'S1'!M$27)","v":" "},{"$f":"IF(ISTEXT('S1'!$N$34),NA(),'S1'!$N$34)","v":{"$error":"#N/A"}},null,{"$f":"IF(ISTEXT('S1'!$N$36),NA(),'S1'!$N$36)","v":{"$error":"#N/A"}},{"$error":"#N/A"},{"$f":"IF(ISTEXT('S1'!$N$37),NA(),'S1'!$N$37)","v":{"$error":"#N/A"}},{"$error":"#N/A"},{"$f":"IF(ISTEXT('S1'!$N$38),NA(),'S1'!$N$38)","v":{"$error":"#N/A"}},null,{"$f":"IF(ISTEXT('S1'!$N$39),NA(),'S1'!$N$39)","v":{"$error":"#N/A"}},{"$error":"#N/A"}]
[{"$f":"IF(ISBLANK('S2'!C$8),\" \",'S2'!C$8)","v":" "},{"$f":"IF(ISTEXT('S2'!$D$15),NA(),'S2'!$D$15)","v":{"$error":"#N/A"}},null,{"$f":"IF(ISTEXT('S2'!$D$17),NA(),'S2'!$D$17)","v":{"$error":"#N/A"}},{"$error":"#N/A"},{"$f":"IF(ISTEXT('S2'!$D$18),NA(),'S2'!$D$18)","v":{"$error":"#N/A"}},{"$error":"#N/A"},{"$f":"IF(ISTEXT('S2'!$D$19),NA(),'S2'!$D$19)","v":{"$error":"#N/A"}},null,{"$f":"IF(ISTEXT('S2'!$D$20),NA(),'S2'!$D$20)","v":{"$error":"#N/A"}},{"$error":"#N/A"}]
[{"$f":"IF(ISBLANK('S2'!E$8),\" \",'S2'!E$8)","v":" "},{"$f":"IF(ISTEXT('S2'!$F$15),NA(),'S2'!$F$15)","v":{"$error":"#N/A"}},null,{"$f":"IF(ISTEXT('S2'!$F$17),NA(),'S2'!$F$17)","v":{"$error":"#N/A"}},{"$error":"#N/A"},{"$f":"IF(ISTEXT('S2'!$F$18),NA(),'S2'!$F$18)","v":{"$error":"#N/A"}},{"$error":"#N/A"},{"$f":"IF(ISTEXT('S2'!$F$19),NA(),'S2'!$F$19)","v":{"$error":"#N/A"}},null,{"$f":"IF(ISTEXT('S2'!$F$20),NA(),'S2'!$F$20)","v":{"$error":"#N/A"}},{"$error":"#N/A"}]
[{"$f":"IF(ISBLANK('S2'!G$8),\" \",'S2'!G$8)","v":" "},{"$f":"IF(ISTEXT('S2'!$H$15),NA(),'S2'!$H$15)","v":{"$error":"#N/A"}},null,{"$f":"IF(ISTEXT('S2'!$H$17),NA(),'S2'!$H$17)","v":{"$error":"#N/A"}},{"$error":"#N/A"},{"$f":"IF(ISTEXT('S2'!$H$18),NA(),'S2'!$H$18)","v":{"$error":"#N/A"}},{"$error":"#N/A"},{"$f":"IF(ISTEXT('S2'!$H$19),NA(),'S2'!$H$19)","v":{"$error":"#N/A"}},null,{"$f":"IF(ISTEXT('S2'!$H$20),NA(),'S2'!$H$20)","v":{"$error":"#N/A"}},{"$error":"#N/A"}]
[{"$f":"IF(ISBLANK('S2'!I$8),\" \",'S2'!I$8)","v":" "},{"$f":"IF(ISTEXT('S2'!$J$15),NA(),'S2'!$J$15)","v":{"$error":"#N/A"}},null,{"$f":"IF(ISTEXT('S2'!$J$17),NA(),'S2'!$J$17)","v":{"$error":"#N/A"}},{"$error":"#N/A"},{"$f":"IF(ISTEXT('S2'!$J$18),NA(),'S2'!$J$18)","v":{"$error":"#N/A"}},{"$error":"#N/A"},{"$f":"IF(ISTEXT('S2'!$J$19),NA(),'S2'!$J$19)","v":{"$error":"#N/A"}},null,{"$f":"IF(ISTEXT('S2'!$J$20),NA(),'S2'!$J$20)","v":{"$error":"#N/A"}},{"$error":"#N/A"}]
[{"$f":"IF(ISBLANK('S2'!K$8),\" \",'S2'!K$8)","v":" "},{"$f":"IF(ISTEXT('S2'!$L$15),NA(),'S2'!$L$15)","v":{"$error":"#N/A"}},null,{"$f":"IF(ISTEXT('S2'!$L$17),NA(),'S2'!$L$17)","v":{"$error":"#N/A"}},{"$error":"#N/A"},{"$f":"IF(ISTEXT('S2'!$L$18),NA(),'S2'!$L$18)","v":{"$error":"#N/A"}},{"$error":"#N/A"},{"$f":"IF(ISTEXT('S2'!$L$19),NA(),'S2'!$L$19)","v":{"$error":"#N/A"}},null,{"$f":"IF(ISTEXT('S2'!$L$20),NA(),'S2'!$L$20)","v":{"$error":"#N/A"}},{"$error":"#N/A"}]
[{"$f":"IF(ISBLANK('S2'!M$8),\" \",'S2'!M$8)","v":" "},{"$f":"IF(ISTEXT('S2'!$N$15),NA(),'S2'!$N$15)","v":{"$error":"#N/A"}},null,{"$f":"IF(ISTEXT('S2'!$N$17),NA(),'S2'!$N$17)","v":{"$error":"#N/A"}},{"$error":"#N/A"},{"$f":"IF(ISTEXT('S2'!$N$18),NA(),'S2'!$N$18)","v":{"$error":"#N/A"}},{"$error":"#N/A"},{"$f":"IF(ISTEXT('S2'!$N$19),NA(),'S2'!$N$19)","v":{"$error":"#N/A"}},null,{"$f":"IF(ISTEXT('S2'!$N$20),NA(),'S2'!$N$20)","v":{"$error":"#N/A"}},{"$error":"#N/A"}]
[{"$f":"IF(ISBLANK('S2'!C$27),\" \",'S2'!C$27)","v":" "},{"$f":"IF(ISTEXT('S2'!$D$34),NA(),'S2'!$D$34)","v":{"$error":"#N/A"}},null,{"$f":"IF(ISTEXT('S2'!$D$36),NA(),'S2'!$D$36)","v":{"$error":"#N/A"}},{"$error":"#N/A"},{"$f":"IF(ISTEXT('S2'!$D$37),NA(),'S2'!$D$37)","v":{"$error":"#N/A"}},{"$error":"#N/A"},{"$f":"IF(ISTEXT('S2'!$D$38),NA(),'S2'!$D$38)","v":{"$error":"#N/A"}},null,{"$f":"IF(ISTEXT('S2'!$D$39),NA(),'S2'!$D$39)","v":{"$error":"#N/A"}},{"$error":"#N/A"}]
[{"$f":"IF(ISBLANK('S2'!E$27),\" \",'S2'!E$27)","v":" "},{"$f":"IF(ISTEXT('S2'!$F$34),NA(),'S2'!$F$34)","v":{"$error":"#N/A"}},null,{"$f":"IF(ISTEXT('S2'!$F$36),NA(),'S2'!$F$36)","v":{"$error":"#N/A"}},{"$error":"#N/A"},{"$f":"IF(ISTEXT('S2'!$F$37),NA(),'S2'!$F$37)","v":{"$error":"#N/A"}},{"$error":"#N/A"},{"$f":"IF(ISTEXT('S2'!$F$38),NA(),'S2'!$F$38)","v":{"$error":"#N/A"}},null,{"$f":"IF(ISTEXT('S2'!$F$39),NA(),'S2'!$F$39)","v":{"$error":"#N/A"}},{"$error":"#N/A"}]
[{"$f":"IF(ISBLANK('S2'!G$27),\" \",'S2'!G$27)","v":" "},{"$f":"IF(ISTEXT('S2'!$H$34),NA(),'S2'!$H$34)","v":{"$error":"#N/A"}},null,{"$f":"IF(ISTEXT('S2'!$H$36),NA(),'S2'!$H$36)","v":{"$error":"#N/A"}},{"$error":"#N/A"},{"$f":"IF(ISTEXT('S2'!$H$37),NA(),'S2'!$H$37)","v":{"$error":"#N/A"}},{"$error":"#N/A"},{"$f":"IF(ISTEXT('S2'!$H$38),NA(),'S2'!$H$38)","v":{"$error":"#N/A"}},null,{"$f":"IF(ISTEXT('S2'!$H$39),NA(),'S2'!$H$39)","v":{"$error":"#N/A"}},{"$error":"#N/A"}]
[{"$f":"IF(ISBLANK('S2'!I$27),\" \",'S2'!I$27)","v":" "},{"$f":"IF(ISTEXT('S2'!$J$34),NA(),'S2'!$J$34)","v":{"$error":"#N/A"}},null,{"$f":"IF(ISTEXT('S2'!$J$36),NA(),'S2'!$J$36)","v":{"$error":"#N/A"}},{"$error":"#N/A"},{"$f":"IF(ISTEXT('S2'!$J$37),NA(),'S2'!$J$37)","v":{"$error":"#N/A"}},{"$error":"#N/A"},{"$f":"IF(ISTEXT('S2'!$J$38),NA(),'S2'!$J$38)","v":{"$error":"#N/A"}},null,{"$f":"IF(ISTEXT('S2'!$J$39),NA(),'S2'!$J$39)","v":{"$error":"#N/A"}},{"$error":"#N/A"}]
[{"$f":"IF(ISBLANK('S2'!K$27),\" \",'S2'!K$27)","v":" "},{"$f":"IF(ISTEXT('S2'!$L$34),NA(),'S2'!$L$34)","v":{"$error":"#N/A"}},null,{"$f":"IF(ISTEXT('S2'!$L$36),NA(),'S2'!$L$36)","v":{"$error":"#N/A"}},{"$error":"#N/A"},{"$f":"IF(ISTEXT('S2'!$L$37),NA(),'S2'!$L$37)","v":{"$error":"#N/A"}},{"$error":"#N/A"},{"$f":"IF(ISTEXT('S2'!$L$38),NA(),'S2'!$L$38)","v":{"$error":"#N/A"}},null,{"$f":"IF(ISTEXT('S2'!$L$39),NA(),'S2'!$L$39)","v":{"$error":"#N/A"}},{"$error":"#N/A"}]
[{"$f":"IF(ISBLANK('S2'!M$27),\" \",'S2'!M$27)","v":" "},{"$f":"IF(ISTEXT('S2'!$N$34),NA(),'S2'!$N$34)","v":{"$error":"#N/A"}},null,{"$f":"IF(ISTEXT('S2'!$N$36),NA(),'S2'!$N$36)","v":{"$error":"#N/A"}},{"$f":"ROUND(AVERAGE(D24:D26),0)","v":{"$error":"#N/A"}},{"$f":"IF(ISTEXT('S2'!$N$37),NA(),'S2'!$N$37)","v":{"$error":"#N/A"}},{"$f":"ROUND(AVERAGE(F24:F26),0)","v":{"$error":"#N/A"}},{"$f":"IF(ISTEXT('S2'!$N$38),NA(),'S2'!$N$38)","v":{"$error":"#N/A"}},null,{"$f":"IF(ISTEXT('S2'!$N$39),NA(),'S2'!$N$39)","v":{"$error":"#N/A"}},{"$error":"#N/A"}]
[{"$f":"IF(ISBLANK('S3'!C$8),\" \",'S3'!C$8)","v":" "},{"$f":"IF(ISTEXT('S3'!$D$15),NA(),'S3'!$D$15)","v":{"$error":"#N/A"}},null,{"$f":"IF(ISTEXT('S3'!$D$17),NA(),'S3'!$D$17)","v":{"$error":"#N/A"}},{"$f":"ROUND(AVERAGE(D25:D27),0)","v":{"$error":"#N/A"}},{"$f":"IF(ISTEXT('S3'!$D$18),NA(),'S3'!$D$18)","v":{"$error":"#N/A"}},{"$error":"#N/A"},{"$f":"IF(ISTEXT('S3'!$D$19),NA(),'S3'!$D$19)","v":{"$error":"#N/A"}},null,{"$f":"IF(ISTEXT('S3'!$D$20),NA(),'S3'!$D$20)","v":{"$error":"#N/A"}},{"$error":"#N/A"}]
[{"$f":"IF(ISBLANK('S3'!E$8),\" \",'S3'!E$8)","v":" "},{"$f":"IF(ISTEXT('S3'!$F$15),NA(),'S3'!$F$15)","v":{"$error":"#N/A"}},null,{"$f":"IF(ISTEXT('S3'!$F$17),NA(),'S3'!$F$17)","v":{"$error":"#N/A"}},{"$error":"#N/A"},{"$f":"IF(ISTEXT('S3'!$F$18),NA(),'S3'!$F$18)","v":{"$error":"#N/A"}},{"$error":"#N/A"},{"$f":"IF(ISTEXT('S3'!$F$19),NA(),'S3'!$F$19)","v":{"$error":"#N/A"}},null,{"$f":"IF(ISTEXT('S3'!$F$20),NA(),'S3'!$F$20)","v":{"$error":"#N/A"}},{"$error":"#N/A"}]
[{"$f":"IF(ISBLANK('S3'!G$8),\" \",'S3'!G$8)","v":" "},{"$f":"IF(ISTEXT('S3'!$H$15),NA(),'S3'!$H$15)","v":{"$error":"#N/A"}},null,{"$f":"IF(ISTEXT('S3'!$H$17),NA(),'S3'!$H$17)","v":{"$error":"#N/A"}},{"$error":"#N/A"},{"$f":"IF(ISTEXT('S3'!$H$18),NA(),'S3'!$H$18)","v":{"$error":"#N/A"}},{"$error":"#N/A"},{"$f":"IF(ISTEXT('S3'!$H$19),NA(),'S3'!$H$19)","v":{"$error":"#N/A"}},null,{"$f":"IF(ISTEXT('S3'!$H$20),NA(),'S3'!$H$20)","v":{"$error":"#N/A"}},{"$error":"#N/A"}]
[{"$f":"IF(ISBLANK('S3'!I$8),\" \",'S3'!I$8)","v":" "},{"$f":"IF(ISTEXT('S3'!$J$15),NA(),'S3'!$J$15)","v":{"$error":"#N/A"}},null,{"$f":"IF(ISTEXT('S3'!$J$17),NA(),'S3'!$J$17)","v":{"$error":"#N/A"}},{"$error":"#N/A"},{"$f":"IF(ISTEXT('S3'!$J$18),NA(),'S3'!$J$18)","v":{"$error":"#N/A"}},{"$error":"#N/A"},{"$f":"IF(ISTEXT('S3'!$J$19),NA(),'S3'!$J$19)","v":{"$error":"#N/A"}},null,{"$f":"IF(ISTEXT('S3'!$J$20),NA(),'S3'!$J$20)","v":{"$error":"#N/A"}},{"$error":"#N/A"}]
[{"$f":"IF(ISBLANK('S3'!K$8),\" \",'S3'!K$8)","v":" "},{"$f":"IF(ISTEXT('S3'!$L$15),NA(),'S3'!$L$15)","v":{"$error":"#N/A"}},null,{"$f":"IF(ISTEXT('S3'!$L$17),NA(),'S3'!$L$17)","v":{"$error":"#N/A"}},{"$error":"#N/A"},{"$f":"IF(ISTEXT('S3'!$L$18),NA(),'S3'!$L$18)","v":{"$error":"#N/A"}},{"$f":"ROUND(AVERAGE(F29:F31),0)","v":{"$error":"#N/A"}},{"$f":"IF(ISTEXT('S3'!$L$19),NA(),'S3'!$L$19)","v":{"$error":"#N/A"}},null,{"$f":"IF(ISTEXT('S3'!$L$20),NA(),'S3'!$L$20)","v":{"$error":"#N/A"}},{"$error":"#N/A"}]
[{"$f":"IF(ISBLANK('S3'!M$8),\" \",'S3'!M$8)","v":" "},{"$f":"IF(ISTEXT('S3'!$N$15),NA(),'S3'!$N$15)","v":{"$error":"#N/A"}},null,{"$f":"IF(ISTEXT('S3'!$N$17),NA(),'S3'!$N$17)","v":{"$error":"#N/A"}},{"$error":"#N/A"},{"$f":"IF(ISTEXT('S3'!$N$18),NA(),'S3'!$N$18)","v":{"$error":"#N/A"}},{"$error":"#N/A"},{"$f":"IF(ISTEXT('S3'!$N$19),NA(),'S3'!$N$19)","v":{"$error":"#N/A"}},null,{"$f":"IF(ISTEXT('S3'!$N$20),NA(),'S3'!$N$20)","v":{"$error":"#N/A"}},{"$error":"#N/A"}]
[{"$f":"IF(ISBLANK('S3'!C$27),\" \",'S3'!C$27)","v":" "},{"$f":"IF(ISTEXT('S3'!$D$34),NA(),'S3'!$D$34)","v":{"$error":"#N/A"}},null,{"$f":"IF(ISTEXT('S3'!$D$36),NA(),'S3'!$D$36)","v":{"$error":"#N/A"}},{"$error":"#N/A"},{"$f":"IF(ISTEXT('S3'!$D$37),NA(),'S3'!$D$37)","v":{"$error":"#N/A"}},{"$error":"#N/A"},{"$f":"IF(ISTEXT('S3'!$D$38),NA(),'S3'!$D$38)","v":{"$error":"#N/A"}},null,{"$f":"IF(ISTEXT('S3'!$D$39),NA(),'S3'!$D$39)","v":{"$error":"#N/A"}},{"$error":"#N/A"}]
[{"$f":"IF(ISBLANK('S3'!E$27),\" \",'S3'!E$27)","v":" "},{"$f":"IF(ISTEXT('S3'!$F$34),NA(),'S3'!$F$34)","v":{"$error":"#N/A"}},null,{"$f":"IF(ISTEXT('S3'!$F$36),NA(),'S3'!$F$36)","v":{"$error":"#N/A"}},{"$f":"ROUND(AVERAGE(D32:D34),0)","v":{"$error":"#N/A"}},{"$f":"IF(ISTEXT('S3'!$F$37),NA(),'S3'!$F$37)","v":{"$error":"#N/A"}},{"$f":"ROUND(AVERAGE(F32:F34),0)","v":{"$error":"#N/A"}},{"$f":"IF(ISTEXT('S3'!$F$38),NA(),'S3'!$F$38)","v":{"$error":"#N/A"}},null,{"$f":"IF(ISTEXT('S3'!$F$39),NA(),'S3'!$F$39)","v":{"$error":"#N/A"}},{"$error":"#N/A"}]
[{"$f":"IF(ISBLANK('S3'!G$27),\" \",'S3'!G$27)","v":" "},{"$f":"IF(ISTEXT('S3'!$H$34),NA(),'S3'!$H$34)","v":{"$error":"#N/A"}},null,{"$f":"IF(ISTEXT('S3'!$H$36),NA(),'S3'!$H$36)","v":{"$error":"#N/A"}},{"$error":"#N/A"},{"$f":"IF(ISTEXT('S3'!$H$37),NA(),'S3'!$H$37)","v":{"$error":"#N/A"}},{"$error":"#N/A"},{"$f":"IF(ISTEXT('S3'!$H$38),NA(),'S3'!$H$38)","v":{"$error":"#N/A"}},null,{"$f":"IF(ISTEXT('S3'!$H$39),NA(),'S3'!$H$39)","v":{"$error":"#N/A"}},{"$error":"#N/A"}]
[{"$f":"IF(ISBLANK('S3'!I$27),\" \",'S3'!I$27)","v":" "},{"$f":"IF(ISTEXT('S3'!$J$34),NA(),'S3'!$J$34)","v":{"$error":"#N/A"}},null,{"$f":"IF(ISTEXT('S3'!$J$36),NA(),'S3'!$J$36)","v":{"$error":"#N/A"}},{"$error":"#N/A"},{"$f":"IF(ISTEXT('S3'!$J$37),NA(),'S3'!$J$37)","v":{"$error":"#N/A"}},{"$error":"#N/A"},{"$f":"IF(ISTEXT('S3'!$J$38),NA(),'S3'!$J$38)","v":{"$error":"#N/A"}},null,{"$f":"IF(ISTEXT('S3'!$J$39),NA(),'S3'!$J$39)","v":{"$error":"#N/A"}},{"$error":"#N/A"}]
[{"$f":"IF(ISBLANK('S3'!K$27),\" \",'S3'!K$27)","v":" "},{"$f":"IF(ISTEXT('S3'!$L$34),NA(),'S3'!$L$34)","v":{"$error":"#N/A"}},null,{"$f":"IF(ISTEXT('S3'!$L$36),NA(),'S3'!$L$36)","v":{"$error":"#N/A"}},{"$error":"#N/A"},{"$f":"IF(ISTEXT('S3'!$L$37),NA(),'S3'!$L$37)","v":{"$error":"#N/A"}},{"$error":"#N/A"},{"$f":"IF(ISTEXT('S3'!$L$38),NA(),'S3'!$L$38)","v":{"$error":"#N/A"}},null,{"$f":"IF(ISTEXT('S3'!$L$39),NA(),'S3'!$L$39)","v":{"$error":"#N/A"}},{"$f":"ROUND(AVERAGE(J35:J37),1)","v":{"$error":"#N/A"}}]
[{"$f":"IF(ISBLANK('S3'!M$27),\" \",'S3'!M$27)","v":" "},{"$f":"IF(ISTEXT('S3'!$N$34),NA(),'S3'!$N$34)","v":{"$error":"#N/A"}},null,{"$f":"IF(ISTEXT('S3'!$N$36),NA(),'S3'!$N$36)","v":{"$error":"#N/A"}},{"$error":"#N/A"},{"$f":"IF(ISTEXT('S3'!$N$37),NA(),'S3'!$N$37)","v":{"$error":"#N/A"}},{"$error":"#N/A"},{"$f":"IF(ISTEXT('S3'!$N$38),NA(),'S3'!$N$38)","v":{"$error":"#N/A"}},null,{"$f":"IF(ISTEXT('S3'!$N$39),NA(),'S3'!$N$39)","v":{"$error":"#N/A"}},{"$error":"#N/A"}]
[{"$f":"IF(ISBLANK('S4'!C$8),\" \",'S4'!C$8)","v":" "},{"$f":"IF(ISTEXT('S4'!$D$15),NA(),'S4'!$D$15)","v":{"$error":"#N/A"}},null,{"$f":"IF(ISTEXT('S4'!$D$17),NA(),'S4'!$D$17)","v":{"$error":"#N/A"}},{"$error":"#N/A"},{"$f":"IF(ISTEXT('S4'!$D$18),NA(),'S4'!$D$18)","v":{"$error":"#N/A"}},{"$error":"#N/A"},{"$f":"IF(ISTEXT('S4'!$D$19),NA(),'S4'!$D$19)","v":{"$error":"#N/A"}},null,{"$f":"IF(ISTEXT('S4'!$D$20),NA(),'S4'!$D$20)","v":{"$error":"#N/A"}},{"$error":"#N/A"}]
[{"$f":"IF(ISBLANK('S4'!E$8),\" \",'S4'!E$8)","v":" "},{"$f":"IF(ISTEXT('S4'!$F$15),NA(),'S4'!$F$15)","v":{"$error":"#N/A"}},null,{"$f":"IF(ISTEXT('S4'!$F$17),NA(),'S4'!$F$17)","v":{"$error":"#N/A"}},{"$error":"#N/A"},{"$f":"IF(ISTEXT('S4'!$F$18),NA(),'S4'!$F$18)","v":{"$error":"#N/A"}},{"$error":"#N/A"},{"$f":"IF(ISTEXT('S4'!$F$19),NA(),'S4'!$F$19)","v":{"$error":"#N/A"}},null,{"$f":"IF(ISTEXT('S4'!$F$20),NA(),'S4'!$F$20)","v":{"$error":"#N/A"}},{"$error":"#N/A"}]
[{"$f":"IF(ISBLANK('S4'!G$8),\" \",'S4'!G$8)","v":" "},{"$f":"IF(ISTEXT('S4'!$H$15),NA(),'S4'!$H$15)","v":{"$error":"#N/A"}},null,{"$f":"IF(ISTEXT('S4'!$H$17),NA(),'S4'!$H$17)","v":{"$error":"#N/A"}},{"$error":"#N/A"},{"$f":"IF(ISTEXT('S4'!$H$18),NA(),'S4'!$H$18)","v":{"$error":"#N/A"}},{"$error":"#N/A"},{"$f":"IF(ISTEXT('S4'!$H$19),NA(),'S4'!$H$19)","v":{"$error":"#N/A"}},null,{"$f":"IF(ISTEXT('S4'!$H$20),NA(),'S4'!$H$20)","v":{"$error":"#N/A"}},{"$error":"#N/A"}]
[{"$f":"IF(ISBLANK('S4'!I$8),\" \",'S4'!I$8)","v":" "},{"$f":"IF(ISTEXT('S4'!$J$15),NA(),'S4'!$J$15)","v":{"$error":"#N/A"}},null,{"$f":"IF(ISTEXT('S4'!$J$17),NA(),'S4'!$J$17)","v":{"$error":"#N/A"}},{"$error":"#N/A"},{"$f":"IF(ISTEXT('S4'!$J$18),NA(),'S4'!$J$18)","v":{"$error":"#N/A"}},{"$error":"#N/A"},{"$f":"IF(ISTEXT('S4'!$J$19),NA(),'S4'!$J$19)","v":{"$error":"#N/A"}},null,{"$f":"IF(ISTEXT('S4'!$J$20),NA(),'S4'!$J$20)","v":{"$error":"#N/A"}},{"$error":"#N/A"}]
[{"$f":"IF(ISBLANK('S4'!K$8),\" \",'S4'!K$8)","v":" "},{"$f":"IF(ISTEXT('S4'!$L$15),NA(),'S4'!$L$15)","v":{"$error":"#N/A"}},null,{"$f":"IF(ISTEXT('S4'!$L$17),NA(),'S4'!$L$17)","v":{"$error":"#N/A"}},{"$error":"#N/A"},{"$f":"IF(ISTEXT('S4'!$L$18),NA(),'S4'!$L$18)","v":{"$error":"#N/A"}},{"$error":"#N/A"},{"$f":"IF(ISTEXT('S4'!$L$19),NA(),'S4'!$L$19)","v":{"$error":"#N/A"}},null,{"$f":"IF(ISTEXT('S4'!$L$20),NA(),'S4'!$L$20)","v":{"$error":"#N/A"}},{"$error":"#N/A"}]
[{"$f":"IF(ISBLANK('S4'!M$8),\" \",'S4'!M$8)","v":" "},{"$f":"IF(ISTEXT('S4'!$N$15),NA(),'S4'!$N$15)","v":{"$error":"#N/A"}},null,{"$f":"IF(ISTEXT('S4'!$N$17),NA(),'S4'!$N$17)","v":{"$error":"#N/A"}},{"$error":"#N/A"},{"$f":"IF(ISTEXT('S4'!$N$18),NA(),'S4'!$N$18)","v":{"$error":"#N/A"}},{"$error":"#N/A"},{"$f":"IF(ISTEXT('S4'!$N$19),NA(),'S4'!$N$19)","v":{"$error":"#N/A"}},null,{"$f":"IF(ISTEXT('S4'!$N$20),NA(),'S4'!$N$20)","v":{"$error":"#N/A"}},{"$error":"#N/A"}]
[{"$f":"IF(ISBLANK('S4'!C$27),\" \",'S4'!C$27)","v":" "},{"$f":"IF(ISTEXT('S4'!$D$34),NA(),'S4'!$D$34)","v":{"$error":"#N/A"}},null,{"$f":"IF(ISTEXT('S4'!$D$36),NA(),'S4'!$D$36)","v":{"$error":"#N/A"}},{"$error":"#N/A"},{"$f":"IF(ISTEXT('S4'!$D$37),NA(),'S4'!$D$37)","v":{"$error":"#N/A"}},{"$error":"#N/A"},{"$f":"IF(ISTEXT('S4'!$D$38),NA(),'S4'!$D$38)","v":{"$error":"#N/A"}},null,{"$f":"IF(ISTEXT('S4'!$D$39),NA(),'S4'!$D$39)","v":{"$error":"#N/A"}},{"$error":"#N/A"}]
[{"$f":"IF(ISBLANK('S4'!E$27),\" \",'S4'!E$27)","v":" "},{"$f":"IF(ISTEXT('S4'!$F$34),NA(),'S4'!$F$34)","v":{"$error":"#N/A"}},null,{"$f":"IF(ISTEXT('S4'!$F$36),NA(),'S4'!$F$36)","v":{"$error":"#N/A"}},{"$error":"#N/A"},{"$f":"IF(ISTEXT('S4'!$F$37),NA(),'S4'!$F$37)","v":{"$error":"#N/A"}},{"$error":"#N/A"},{"$f":"IF(ISTEXT('S4'!$F$38),NA(),'S4'!$F$38)","v":{"$error":"#N/A"}},null,{"$f":"IF(ISTEXT('S4'!$F$39),NA(),'S4'!$F$39)","v":{"$error":"#N/A"}},{"$error":"#N/A"}]
[{"$f":"IF(ISBLANK('S4'!G$27),\" \",'S4'!G$27)","v":" "},{"$f":"IF(ISTEXT('S4'!$H$34),NA(),'S4'!$H$34)","v":{"$error":"#N/A"}},null,{"$f":"IF(ISTEXT('S4'!$H$36),NA(),'S4'!$H$36)","v":{"$error":"#N/A"}},{"$error":"#N/A"},{"$f":"IF(ISTEXT('S4'!$H$37),NA(),'S4'!$H$37)","v":{"$error":"#N/A"}},{"$error":"#N/A"},{"$f":"IF(ISTEXT('S4'!$H$38),NA(),'S4'!$H$38)","v":{"$error":"#N/A"}},null,{"$f":"IF(ISTEXT('S4'!$H$39),NA(),'S4'!$H$39)","v":{"$error":"#N/A"}},{"$error":"#N/A"}]
[{"$f":"IF(ISBLANK('S4'!I$27),\" \",'S4'!I$27)","v":" "},{"$f":"IF(ISTEXT('S4'!$J$34),NA(),'S4'!$J$34)","v":{"$error":"#N/A"}},null,{"$f":"IF(ISTEXT('S4'!$J$36),NA(),'S4'!$J$36)","v":{"$error":"#N/A"}},{"$error":"#N/A"},{"$f":"IF(ISTEXT('S4'!$J$37),NA(),'S4'!$J$37)","v":{"$error":"#N/A"}},{"$error":"#N/A"},{"$f":"IF(ISTEXT('S4'!$J$38),NA(),'S4'!$J$38)","v":{"$error":"#N/A"}},null,{"$f":"IF(ISTEXT('S4'!$J$39),NA(),'S4'!$J$39)","v":{"$error":"#N/A"}},{"$error":"#N/A"}]
[{"$f":"IF(ISBLANK('S4'!K$27),\" \",'S4'!K$27)","v":" "},{"$f":"IF(ISTEXT('S4'!$L$34),NA(),'S4'!$L$34)","v":{"$error":"#N/A"}},null,{"$f":"IF(ISTEXT('S4'!$L$36),NA(),'S4'!$L$36)","v":{"$error":"#N/A"}},{"$error":"#N/A"},{"$f":"IF(ISTEXT('S4'!$L$37),NA(),'S4'!$L$37)","v":{"$error":"#N/A"}},{"$error":"#N/A"},{"$f":"IF(ISTEXT('S4'!$L$38),NA(),'S4'!$L$38)","v":{"$error":"#N/A"}},null,{"$f":"IF(ISTEXT('S4'!$L$39),NA(),'S4'!$L$39)","v":{"$error":"#N/A"}},{"$error":"#N/A"}]
[{"$f":"IF(ISBLANK('S4'!M$27),\" \",'S4'!M$27)","v":" "},{"$f":"IF(ISTEXT('S4'!$N$34),NA(),'S4'!$N$34)","v":{"$error":"#N/A"}},null,{"$f":"IF(ISTEXT('S4'!$N$36),NA(),'S4'!$N$36)","v":{"$error":"#N/A"}},{"$error":"#N/A"},{"$f":"IF(ISTEXT('S4'!$N$37),NA(),'S4'!$N$37)","v":{"$error":"#N/A"}},{"$error":"#N/A"},{"$f":"IF(ISTEXT('S4'!$N$38),NA(),'S4'!$N$38)","v":{"$error":"#N/A"}},null,{"$f":"IF(ISTEXT('S4'!$N$39),NA(),'S4'!$N$39)","v":{"$error":"#N/A"}},{"$error":"#N/A"}]
[{"$f":"IF(ISBLANK('S5'!C$8),\" \",'S5'!C$8)","v":" "},{"$f":"IF(ISTEXT('S5'!$D$15),NA(),'S5'!$D$15)","v":{"$error":"#N/A"}},null,{"$f":"IF(ISTEXT('S5'!$D$17),NA(),'S5'!$D$17)","v":{"$error":"#N/A"}},{"$error":"#N/A"},{"$f":"IF(ISTEXT('S5'!$D$18),NA(),'S5'!$D$18)","v":{"$error":"#N/A"}},{"$error":"#N/A"},{"$f":"IF(ISTEXT('S5'!$D$19),NA(),'S5'!$D$19)","v":{"$error":"#N/A"}},null,{"$f":"IF(ISTEXT('S5'!$D$20),NA(),'S5'!$D$20)","v":{"$error":"#N/A"}},{"$error":"#N/A"}]
[{"$f":"IF(ISBLANK('S5'!E$8),\" \",'S5'!E$8)","v":" "},{"$f":"IF(ISTEXT('S5'!$F$15),NA(),'S5'!$F$15)","v":{"$error":"#N/A"}},null,{"$f":"IF(ISTEXT('S5'!$F$17),NA(),'S5'!$F$17)","v":{"$error":"#N/A"}},{"$error":"#N/A"},{"$f":"IF(ISTEXT('S5'!$F$18),NA(),'S5'!$F$18)","v":{"$error":"#N/A"}},{"$error":"#N/A"},{"$f":"IF(ISTEXT('S5'!$F$19),NA(),'S5'!$F$19)","v":{"$error":"#N/A"}},null,{"$f":"IF(ISTEXT('S5'!$F$20),NA(),'S5'!$F$20)","v":{"$error":"#N/A"}},{"$error":"#N/A"}]
[{"$f":"IF(ISBLANK('S5'!G$8),\" \",'S5'!G$8)","v":" "},{"$f":"IF(ISTEXT('S5'!$H$15),NA(),'S5'!$H$15)","v":{"$error":"#N/A"}},null,{"$f":"IF(ISTEXT('S5'!$H$17),NA(),'S5'!$H$17)","v":{"$error":"#N/A"}},{"$error":"#N/A"},{"$f":"IF(ISTEXT('S5'!$H$18),NA(),'S5'!$H$18)","v":{"$error":"#N/A"}},{"$error":"#N/A"},{"$f":"IF(ISTEXT('S5'!$H$19),NA(),'S5'!$H$19)","v":{"$error":"#N/A"}},null,{"$f":"IF(ISTEXT('S5'!$H$20),NA(),'S5'!$H$20)","v":{"$error":"#N/A"}},{"$error":"#N/A"}]
[{"$f":"IF(ISBLANK('S5'!I$8),\" \",'S5'!I$8)","v":" "},{"$f":"IF(ISTEXT('S5'!$J$15),NA(),'S5'!$J$15)","v":{"$error":"#N/A"}},null,{"$f":"IF(ISTEXT('S5'!$J$17),NA(),'S5'!$J$17)","v":{"$error":"#N/A"}},{"$error":"#N/A"},{"$f":"IF(ISTEXT('S5'!$J$18),NA(),'S5'!$J$18)","v":{"$error":"#N/A"}},{"$error":"#N/A"},{"$f":"IF(ISTEXT('S5'!$J$19),NA(),'S5'!$J$19)","v":{"$error":"#N/A"}},null,{"$f":"IF(ISTEXT('S5'!$J$20),NA(),'S5'!$J$20)","v":{"$error":"#N/A"}},{"$error":"#N/A"}]
[{"$f":"IF(ISBLANK('S5'!K$8),\" \",'S5'!K$8)","v":" "},{"$f":"IF(ISTEXT('S5'!$L$15),NA(),'S5'!$L$15)","v":{"$error":"#N/A"}},null,{"$f":"IF(ISTEXT('S5'!$L$17),NA(),'S5'!$L$17)","v":{"$error":"#N/A"}},{"$error":"#N/A"},{"$f":"IF(ISTEXT('S5'!$L$18),NA(),'S5'!$L$18)","v":{"$error":"#N/A"}},{"$error":"#N/A"},{"$f":"IF(ISTEXT('S5'!$L$19),NA(),'S5'!$L$19)","v":{"$error":"#N/A"}},null,{"$f":"IF(ISTEXT('S5'!$L$20),NA(),'S5'!$L$20)","v":{"$error":"#N/A"}},{"$error":"#N/A"}]
[{"$f":"IF(ISBLANK('S5'!M$8),\" \",'S5'!M$8)","v":" "},{"$f":"IF(ISTEXT('S5'!$N$15),NA(),'S5'!$N$15)","v":{"$error":"#N/A"}},null,{"$f":"IF(ISTEXT('S5'!$N$17),NA(),'S5'!$N$17)","v":{"$error":"#N/A"}},{"$error":"#N/A"},{"$f":"IF(ISTEXT('S5'!$N$18),NA(),'S5'!$N$18)","v":{"$error":"#N/A"}},{"$error":"#N/A"},{"$f":"IF(ISTEXT('S5'!$N$19),NA(),'S5'!$N$19)","v":{"$error":"#N/A"}},null,{"$f":"IF(ISTEXT('S5'!$N$20),NA(),'S5'!$N$20)","v":{"$error":"#N/A"}},{"$error":"#N/A"}]
[{"$f":"IF(ISBLANK('S5'!C$27),\" \",'S5'!C$27)","v":" "},{"$f":"IF(ISTEXT('S5'!$D$34),NA(),'S5'!$D$34)","v":{"$error":"#N/A"}},null,{"$f":"IF(ISTEXT('S5'!$D$36),NA(),'S5'!$D$36)","v":{"$error":"#N/A"}},{"$error":"#N/A"},{"$f":"IF(ISTEXT('S5'!$D$37),NA(),'S5'!$D$37)","v":{"$error":"#N/A"}},{"$error":"#N/A"},{"$f":"IF(ISTEXT('S5'!$D$38),NA(),'S5'!$D$38)","v":{"$error":"#N/A"}},null,{"$f":"IF(ISTEXT('S5'!$D$39),NA(),'S5'!$D$39)","v":{"$error":"#N/A"}},{"$error":"#N/A"}]
[{"$f":"IF(ISBLANK('S5'!E$27),\" \",'S5'!E$27)","v":" "},{"$f":"IF(ISTEXT('S5'!$F$34),NA(),'S5'!$F$34)","v":{"$error":"#N/A"}},null,{"$f":"IF(ISTEXT('S5'!$F$36),NA(),'S5'!$F$36)","v":{"$error":"#N/A"}},{"$error":"#N/A"},{"$f":"IF(ISTEXT('S5'!$F$37),NA(),'S5'!$F$37)","v":{"$error":"#N/A"}},{"$error":"#N/A"},{"$f":"IF(ISTEXT('S5'!$F$38),NA(),'S5'!$F$38)","v":{"$error":"#N/A"}},null,{"$f":"IF(ISTEXT('S5'!$F$39),NA(),'S5'!$F$39)","v":{"$error":"#N/A"}},{"$error":"#N/A"}]
[{"$f":"IF(ISBLANK('S5'!G$27),\" \",'S5'!G$27)","v":" "},{"$f":"IF(ISTEXT('S5'!$H$34),NA(),'S5'!$H$34)","v":{"$error":"#N/A"}},null,{"$f":"IF(ISTEXT('S5'!$H$36),NA(),'S5'!$H$36)","v":{"$error":"#N/A"}},{"$error":"#N/A"},{"$f":"IF(ISTEXT('S5'!$H$37),NA(),'S5'!$H$37)","v":{"$error":"#N/A"}},{"$error":"#N/A"},{"$f":"IF(ISTEXT('S5'!$H$38),NA(),'S5'!$H$38)","v":{"$error":"#N/A"}},null,{"$f":"IF(ISTEXT('S5'!$H$39),NA(),'S5'!$H$39)","v":{"$error":"#N/A"}},{"$error":"#N/A"}]
[{"$f":"IF(ISBLANK('S5'!I$27),\" \",'S5'!I$27)","v":" "},{"$f":"IF(ISTEXT('S5'!$J$34),NA(),'S5'!$J$34)","v":{"$error":"#N/A"}},null,{"$f":"IF(ISTEXT('S5'!$J$36),NA(),'S5'!$J$36)","v":{"$error":"#N/A"}},{"$error":"#N/A"},{"$f":"IF(ISTEXT('S5'!$J$37),NA(),'S5'!$J$37)","v":{"$error":"#N/A"}},{"$error":"#N/A"},{"$f":"IF(ISTEXT('S5'!$J$38),NA(),'S5'!$J$38)","v":{"$error":"#N/A"}},null,{"$f":"IF(ISTEXT('S5'!$J$39),NA(),'S5'!$J$39)","v":{"$error":"#N/A"}},{"$error":"#N/A"}]
[{"$f":"IF(ISBLANK('S5'!K$27),\" \",'S5'!K$27)","v":" "},{"$f":"IF(ISTEXT('S5'!$L$34),NA(),'S5'!$L$34)","v":{"$error":"#N/A"}},null,{"$f":"IF(ISTEXT('S5'!$L$36),NA(),'S5'!$L$36)","v":{"$error":"#N/A"}},{"$error":"#N/A"},{"$f":"IF(ISTEXT('S5'!$L$37),NA(),'S5'!$L$37)","v":{"$error":"#N/A"}},{"$error":"#N/A"},{"$f":"IF(ISTEXT('S5'!$L$38),NA(),'S5'!$L$38)","v":{"$error":"#N/A"}},null,{"$f":"IF(ISTEXT('S5'!$L$39),NA(),'S5'!$L$39)","v":{"$error":"#N/A"}},{"$error":"#N/A"}]
[{"$f":"IF(ISBLANK('S5'!M$27),\" \",'S5'!M$27)","v":" "},{"$f":"IF(ISTEXT('S5'!$N$34),NA(),'S5'!$N$34)","v":{"$error":"#N/A"}},null,{"$f":"IF(ISTEXT('S5'!$N$36),NA(),'S5'!$N$36)","v":{"$error":"#N/A"}},{"$error":"#N/A"},{"$f":"IF(ISTEXT('S5'!$N$37),NA(),'S5'!$N$37)","v":{"$error":"#N/A"}},{"$error":"#N/A"},{"$f":"IF(ISTEXT('S5'!$N$38),NA(),'S5'!$N$38)","v":{"$error":"#N/A"}},null,{"$f":"IF(ISTEXT('S5'!$N$39),NA(),'S5'!$N$39)","v":{"$error":"#N/A"}},{"$error":"#N/A"}]
[{"$f":"IF(ISBLANK('S6'!C$8),\" \",'S6'!C$8)","v":" "},{"$f":"IF(ISTEXT('S6'!$D$15),NA(),'S6'!$D$15)","v":{"$error":"#N/A"}},null,{"$f":"IF(ISTEXT('S6'!$D$17),NA(),'S6'!$D$17)","v":{"$error":"#N/A"}},{"$error":"#N/A"},{"$f":"IF(ISTEXT('S6'!$D$18),NA(),'S6'!$D$18)","v":{"$error":"#N/A"}},{"$error":"#N/A"},{"$f":"IF(ISTEXT('S6'!$D$19),NA(),'S6'!$D$19)","v":{"$error":"#N/A"}},null,{"$f":"IF(ISTEXT('S6'!$D$20),NA(),'S6'!$D$20)","v":{"$error":"#N/A"}},{"$error":"#N/A"}]
[{"$f":"IF(ISBLANK('S6'!E$8),\" \",'S6'!E$8)","v":" "},{"$f":"IF(ISTEXT('S6'!$F$15),NA(),'S6'!$F$15)","v":{"$error":"#N/A"}},null,{"$f":"IF(ISTEXT('S6'!$F$17),NA(),'S6'!$F$17)","v":{"$error":"#N/A"}},{"$error":"#N/A"},{"$f":"IF(ISTEXT('S6'!$F$18),NA(),'S6'!$F$18)","v":{"$error":"#N/A"}},{"$error":"#N/A"},{"$f":"IF(ISTEXT('S6'!$F$19),NA(),'S6'!$F$19)","v":{"$error":"#N/A"}},null,{"$f":"IF(ISTEXT('S6'!$F$20),NA(),'S6'!$F$20)","v":{"$error":"#N/A"}},{"$error":"#N/A"}]
[{"$f":"IF(ISBLANK('S6'!G$8),\" \",'S6'!G$8)","v":" "},{"$f":"IF(ISTEXT('S6'!$H$15),NA(),'S6'!$H$15)","v":{"$error":"#N/A"}},null,{"$f":"IF(ISTEXT('S6'!$H$17),NA(),'S6'!$H$17)","v":{"$error":"#N/A"}},{"$error":"#N/A"},{"$f":"IF(ISTEXT('S6'!$H$18),NA(),'S6'!$H$18)","v":{"$error":"#N/A"}},{"$error":"#N/A"},{"$f":"IF(ISTEXT('S6'!$H$19),NA(),'S6'!$H$19)","v":{"$error":"#N/A"}},null,{"$f":"IF(ISTEXT('S6'!$H$20),NA(),'S6'!$H$20)","v":{"$error":"#N/A"}},{"$error":"#N/A"}]
[{"$f":"IF(ISBLANK('S6'!I$8),\" \",'S6'!I$8)","v":" "},{"$f":"IF(ISTEXT('S6'!$J$15),NA(),'S6'!$J$15)","v":{"$error":"#N/A"}},null,{"$f":"IF(ISTEXT('S6'!$J$17),NA(),'S6'!$J$17)","v":{"$error":"#N/A"}},{"$error":"#N/A"},{"$f":"IF(ISTEXT('S6'!$J$18),NA(),'S6'!$J$18)","v":{"$error":"#N/A"}},{"$error":"#N/A"},{"$f":"IF(ISTEXT('S6'!$J$19),NA(),'S6'!$J$19)","v":{"$error":"#N/A"}},null,{"$f":"IF(ISTEXT('S6'!$J$20),NA(),'S6'!$J$20)","v":{"$error":"#N/A"}},{"$error":"#N/A"}]
[{"$f":"IF(ISBLANK('S6'!K$8),\" \",'S6'!K$8)","v":" "},{"$f":"IF(ISTEXT('S6'!$L$15),NA(),'S6'!$L$15)","v":{"$error":"#N/A"}},null,{"$f":"IF(ISTEXT('S6'!$L$17),NA(),'S6'!$L$17)","v":{"$error":"#N/A"}},{"$error":"#N/A"},{"$f":"IF(ISTEXT('S6'!$L$18),NA(),'S6'!$L$18)","v":{"$error":"#N/A"}},{"$error":"#N/A"},{"$f":"IF(ISTEXT('S6'!$L$19),NA(),'S6'!$L$19)","v":{"$error":"#N/A"}},null,{"$f":"IF(ISTEXT('S6'!$L$20),NA(),'S6'!$L$20)","v":{"$error":"#N/A"}},{"$error":"#N/A"}]
[{"$f":"IF(ISBLANK('S6'!M$8),\" \",'S6'!M$8)","v":" "},{"$f":"IF(ISTEXT('S6'!$N$15),NA(),'S6'!$N$15)","v":{"$error":"#N/A"}},null,{"$f":"IF(ISTEXT('S6'!$N$17),NA(),'S6'!$N$17)","v":{"$error":"#N/A"}},{"$error":"#N/A"},{"$f":"IF(ISTEXT('S6'!$N$18),NA(),'S6'!$N$18)","v":{"$error":"#N/A"}},{"$error":"#N/A"},{"$f":"IF(ISTEXT('S6'!$N$19),NA(),'S6'!$N$19)","v":{"$error":"#N/A"}},null,{"$f":"IF(ISTEXT('S6'!$N$20),NA(),'S6'!$N$20)","v":{"$error":"#N/A"}},{"$error":"#N/A"}]
[{"$f":"IF(ISBLANK('S6'!C$27),\" \",'S6'!C$27)","v":" "},{"$f":"IF(ISTEXT('S6'!$D$34),NA(),'S6'!$D$34)","v":{"$error":"#N/A"}},null,{"$f":"IF(ISTEXT('S6'!$D$36),NA(),'S6'!$D$36)","v":{"$error":"#N/A"}},{"$error":"#N/A"},{"$f":"IF(ISTEXT('S6'!$D$37),NA(),'S6'!$D$37)","v":{"$error":"#N/A"}},{"$error":"#N/A"},{"$f":"IF(ISTEXT('S6'!$D$38),NA(),'S6'!$D$38)","v":{"$error":"#N/A"}},null,{"$f":"IF(ISTEXT('S6'!$D$39),NA(),'S6'!$D$39)","v":{"$error":"#N/A"}},{"$f":"ROUND(AVERAGE(J67:J69),1)","v":{"$error":"#N/A"}}]
[{"$f":"IF(ISBLANK('S6'!E$27),\" \",'S6'!E$27)","v":" "},{"$f":"IF(ISTEXT('S6'!$F$34),NA(),'S6'!$F$34)","v":{"$error":"#N/A"}},null,{"$f":"IF(ISTEXT('S6'!$F$36),NA(),'S6'!$F$36)","v":{"$error":"#N/A"}},{"$error":"#N/A"},{"$f":"IF(ISTEXT('S6'!$F$37),NA(),'S6'!$F$37)","v":{"$error":"#N/A"}},{"$error":"#N/A"},{"$f":"IF(ISTEXT('S6'!$F$38),NA(),'S6'!$F$38)","v":{"$error":"#N/A"}},null,{"$f":"IF(ISTEXT('S6'!$F$39),NA(),'S6'!$F$39)","v":{"$error":"#N/A"}},{"$error":"#N/A"}]
[{"$f":"IF(ISBLANK('S6'!G$27),\" \",'S6'!G$27)","v":" "},{"$f":"IF(ISTEXT('S6'!$H$34),NA(),'S6'!$H$34)","v":{"$error":"#N/A"}},null,{"$f":"IF(ISTEXT('S6'!$H$36),NA(),'S6'!$H$36)","v":{"$error":"#N/A"}},{"$error":"#N/A"},{"$f":"IF(ISTEXT('S6'!$H$37),NA(),'S6'!$H$37)","v":{"$error":"#N/A"}},{"$error":"#N/A"},{"$f":"IF(ISTEXT('S6'!$H$38),NA(),'S6'!$H$38)","v":{"$error":"#N/A"}},null,{"$f":"IF(ISTEXT('S6'!$H$39),NA(),'S6'!$H$39)","v":{"$error":"#N/A"}},{"$error":"#N/A"}]
[{"$f":"IF(ISBLANK('S6'!I$27),\" \",'S6'!I$27)","v":" "},{"$f":"IF(ISTEXT('S6'!$J$34),NA(),'S6'!$J$34)","v":{"$error":"#N/A"}},null,{"$f":"IF(ISTEXT('S6'!$J$36),NA(),'S6'!$J$36)","v":{"$error":"#N/A"}},{"$error":"#N/A"},{"$f":"IF(ISTEXT('S6'!$J$37),NA(),'S6'!$J$37)","v":{"$error":"#N/A"}},{"$error":"#N/A"},{"$f":"IF(ISTEXT('S6'!$J$38),NA(),'S6'!$J$38)","v":{"$error":"#N/A"}},null,{"$f":"IF(ISTEXT('S6'!$J$39),NA(),'S6'!$J$39)","v":{"$error":"#N/A"}},{"$error":"#N/A"}]
[{"$f":"IF(ISBLANK('S6'!K$27),\" \",'S6'!K$27)","v":" "},{"$f":"IF(ISTEXT('S6'!$L$34),NA(),'S6'!$L$34)","v":{"$error":"#N/A"}},null,{"$f":"IF(ISTEXT('S6'!$L$36),NA(),'S6'!$L$36)","v":{"$error":"#N/A"}},{"$error":"#N/A"},{"$f":"IF(ISTEXT('S6'!$L$37),NA(),'S6'!$L$37)","v":{"$error":"#N/A"}},{"$error":"#N/A"},{"$f":"IF(ISTEXT('S6'!$L$38),NA(),'S6'!$L$38)","v":{"$error":"#N/A"}},null,{"$f":"IF(ISTEXT('S6'!$L$39),NA(),'S6'!$L$39)","v":{"$error":"#N/A"}},{"$error":"#N/A"}]
[{"$f":"IF(ISBLANK('S6'!M$27),\" \",'S6'!M$27)","v":" "},{"$f":"IF(ISTEXT('S6'!$N$34),NA(),'S6'!$N$34)","v":{"$error":"#N/A"}},null,{"$f":"IF(ISTEXT('S6'!$N$36),NA(),'S6'!$N$36)","v":{"$error":"#N/A"}},{"$error":"#N/A"},{"$f":"IF(ISTEXT('S6'!$N$37),NA(),'S6'!$N$37)","v":{"$error":"#N/A"}},{"$error":"#N/A"},{"$f":"IF(ISTEXT('S6'!$N$38),NA(),'S6'!$N$38)","v":{"$error":"#N/A"}},null,{"$f":"IF(ISTEXT('S6'!$N$39),NA(),'S6'!$N$39)","v":{"$error":"#N/A"}},{"$error":"#N/A"}]
[{"$f":"IF(ISBLANK('S7'!C$8),\" \",'S7'!C$8)","v":" "},{"$f":"IF(ISTEXT('S7'!$D$15),NA(),'S7'!$D$15)","v":{"$error":"#N/A"}},null,{"$f":"IF(ISTEXT('S7'!$D$17),NA(),'S7'!$D$17)","v":{"$error":"#N/A"}},{"$error":"#N/A"},{"$f":"IF(ISTEXT('S7'!$D$18),NA(),'S7'!$D$18)","v":{"$error":"#N/A"}},{"$error":"#N/A"},{"$f":"IF(ISTEXT('S7'!$D$19),NA(),'S7'!$D$19)","v":{"$error":"#N/A"}},null,{"$f":"IF(ISTEXT('S7'!$D$20),NA(),'S7'!$D$20)","v":{"$error":"#N/A"}},{"$error":"#N/A"}]
[{"$f":"IF(ISBLANK('S7'!E$8),\" \",'S7'!E$8)","v":" "},{"$f":"IF(ISTEXT('S7'!$F$15),NA(),'S7'!$F$15)","v":{"$error":"#N/A"}},null,{"$f":"IF(ISTEXT('S7'!$F$17),NA(),'S7'!$F$17)","v":{"$error":"#N/A"}},{"$error":"#N/A"},{"$f":"IF(ISTEXT('S7'!$F$18),NA(),'S7'!$F$18)","v":{"$error":"#N/A"}},{"$error":"#N/A"},{"$f":"IF(ISTEXT('S7'!$F$19),NA(),'S7'!$F$19)","v":{"$error":"#N/A"}},null,{"$f":"IF(ISTEXT('S7'!$F$20),NA(),'S7'!$F$20)","v":{"$error":"#N/A"}},{"$error":"#N/A"}]
[{"$f":"IF(ISBLANK('S7'!G$8),\" \",'S7'!G$8)","v":" "},{"$f":"IF(ISTEXT('S7'!$H$15),NA(),'S7'!$H$15)","v":{"$error":"#N/A"}},null,{"$f":"IF(ISTEXT('S7'!$H$17),NA(),'S7'!$H$17)","v":{"$error":"#N/A"}},{"$error":"#N/A"},{"$f":"IF(ISTEXT('S7'!$H$18),NA(),'S7'!$H$18)","v":{"$error":"#N/A"}},{"$error":"#N/A"},{"$f":"IF(ISTEXT('S7'!$H$19),NA(),'S7'!$H$19)","v":{"$error":"#N/A"}},null,{"$f":"IF(ISTEXT('S7'!$H$20),NA(),'S7'!$H$20)","v":{"$error":"#N/A"}},{"$error":"#N/A"}]
[{"$f":"IF(ISBLANK('S7'!I$8),\" \",'S7'!I$8)","v":" "},{"$f":"IF(ISTEXT('S7'!$J$15),NA(),'S7'!$J$15)","v":{"$error":"#N/A"}},null,{"$f":"IF(ISTEXT('S7'!$J$17),NA(),'S7'!$J$17)","v":{"$error":"#N/A"}},{"$error":"#N/A"},{"$f":"IF(ISTEXT('S7'!$J$18),NA(),'S7'!$J$18)","v":{"$error":"#N/A"}},{"$error":"#N/A"},{"$f":"IF(ISTEXT('S7'!$J$19),NA(),'S7'!$J$19)","v":{"$error":"#N/A"}},null,{"$f":"IF(ISTEXT('S7'!$J$20),NA(),'S7'!$J$20)","v":{"$error":"#N/A"}},{"$error":"#N/A"}]
[{"$f":"IF(ISBLANK('S7'!K$8),\" \",'S7'!K$8)","v":" "},{"$f":"IF(ISTEXT('S7'!$L$15),NA(),'S7'!$L$15)","v":{"$error":"#N/A"}},null,{"$f":"IF(ISTEXT('S7'!$L$17),NA(),'S7'!$L$17)","v":{"$error":"#N/A"}},{"$error":"#N/A"},{"$f":"IF(ISTEXT('S7'!$L$18),NA(),'S7'!$L$18)","v":{"$error":"#N/A"}},{"$error":"#N/A"},{"$f":"IF(ISTEXT('S7'!$L$19),NA(),'S7'!$L$19)","v":{"$error":"#N/A"}},null,{"$f":"IF(ISTEXT('S7'!$L$20),NA(),'S7'!$L$20)","v":{"$error":"#N/A"}},{"$error":"#N/A"}]
[{"$f":"IF(ISBLANK('S7'!M$8),\" \",'S7'!M$8)","v":" "},{"$f":"IF(ISTEXT('S7'!$N$15),NA(),'S7'!$N$15)","v":{"$error":"#N/A"}},null,{"$f":"IF(ISTEXT('S7'!$N$17),NA(),'S7'!$N$17)","v":{"$error":"#N/A"}},{"$error":"#N/A"},{"$f":"IF(ISTEXT('S7'!$N$18),NA(),'S7'!$N$18)","v":{"$error":"#N/A"}},{"$error":"#N/A"},{"$f":"IF(ISTEXT('S7'!$N$19),NA(),'S7'!$N$19)","v":{"$error":"#N/A"}},null,{"$f":"IF(ISTEXT('S7'!$N$20),NA(),'S7'!$N$20)","v":{"$error":"#N/A"}},{"$error":"#N/A"}]
[{"$f":"IF(ISBLANK('S7'!C$27),\" \",'S7'!C$27)","v":" "},{"$f":"IF(ISTEXT('S7'!$D$34),NA(),'S7'!$D$34)","v":{"$error":"#N/A"}},null,{"$f":"IF(ISTEXT('S7'!$D$36),NA(),'S7'!$D$36)","v":{"$error":"#N/A"}},{"$error":"#N/A"},{"$f":"IF(ISTEXT('S7'!$D$37),NA(),'S7'!$D$37)","v":{"$error":"#N/A"}},{"$error":"#N/A"},{"$f":"IF(ISTEXT('S7'!$D$38),NA(),'S7'!$D$38)","v":{"$error":"#N/A"}},null,{"$f":"IF(ISTEXT('S7'!$D$39),NA(),'S7'!$D$39)","v":{"$error":"#N/A"}},{"$error":"#N/A"}]
[{"$f":"IF(ISBLANK('S7'!E$27),\" \",'S7'!E$27)","v":" "},{"$f":"IF(ISTEXT('S7'!$F$34),NA(),'S7'!$F$34)","v":{"$error":"#N/A"}},null,{"$f":"IF(ISTEXT('S7'!$F$36),NA(),'S7'!$F$36)","v":{"$error":"#N/A"}},{"$error":"#N/A"},{"$f":"IF(ISTEXT('S7'!$F$37),NA(),'S7'!$F$37)","v":{"$error":"#N/A"}},{"$error":"#N/A"},{"$f":"IF(ISTEXT('S7'!$F$38),NA(),'S7'!$F$38)","v":{"$error":"#N/A"}},null,{"$f":"IF(ISTEXT('S7'!$F$39),NA(),'S7'!$F$39)","v":{"$error":"#N/A"}},{"$error":"#N/A"}]
[{"$f":"IF(ISBLANK('S7'!G$27),\" \",'S7'!G$27)","v":" "},{"$f":"IF(ISTEXT('S7'!$H$34),NA(),'S7'!$H$34)","v":{"$error":"#N/A"}},null,{"$f":"IF(ISTEXT('S7'!$H$36),NA(),'S7'!$H$36)","v":{"$error":"#N/A"}},{"$error":"#N/A"},{"$f":"IF(ISTEXT('S7'!$H$37),NA(),'S7'!$H$37)","v":{"$error":"#N/A"}},{"$error":"#N/A"},{"$f":"IF(ISTEXT('S7'!$H$38),NA(),'S7'!$H$38)","v":{"$error":"#N/A"}},null,{"$f":"IF(ISTEXT('S7'!$H$39),NA(),'S7'!$H$39)","v":{"$error":"#N/A"}},{"$error":"#N/A"}]
[{"$f":"IF(ISBLANK('S7'!I$27),\" \",'S7'!I$27)","v":" "},{"$f":"IF(ISTEXT('S7'!$J$34),NA(),'S7'!$J$34)","v":{"$error":"#N/A"}},null,{"$f":"IF(ISTEXT('S7'!$J$36),NA(),'S7'!$J$36)","v":{"$error":"#N/A"}},{"$error":"#N/A"},{"$f":"IF(ISTEXT('S7'!$J$37),NA(),'S7'!$J$37)","v":{"$error":"#N/A"}},{"$error":"#N/A"},{"$f":"IF(ISTEXT('S7'!$J$38),NA(),'S7'!$J$38)","v":{"$error":"#N/A"}},null,{"$f":"IF(ISTEXT('S7'!$J$39),NA(),'S7'!$J$39)","v":{"$error":"#N/A"}},{"$error":"#N/A"}]
[{"$f":"IF(ISBLANK('S7'!K$27),\" \",'S7'!K$27)","v":" "},{"$f":"IF(ISTEXT('S7'!$L$34),NA(),'S7'!$L$34)","v":{"$error":"#N/A"}},null,{"$f":"IF(ISTEXT('S7'!$L$36),NA(),'S7'!$L$36)","v":{"$error":"#N/A"}},{"$error":"#N/A"},{"$f":"IF(ISTEXT('S7'!$L$37),NA(),'S7'!$L$37)","v":{"$error":"#N/A"}},{"$error":"#N/A"},{"$f":"IF(ISTEXT('S7'!$L$38),NA(),'S7'!$L$38)","v":{"$error":"#N/A"}},null,{"$f":"IF(ISTEXT('S7'!$L$39),NA(),'S7'!$L$39)","v":{"$error":"#N/A"}},{"$error":"#N/A"}]
[{"$f":"IF(ISBLANK('S7'!M$27),\" \",'S7'!M$27)","v":" "},{"$f":"IF(ISTEXT('S7'!$N$34),NA(),'S7'!$N$34)","v":{"$error":"#N/A"}},null,{"$f":"IF(ISTEXT('S7'!$N$36),NA(),'S7'!$N$36)","v":{"$error":"#N/A"}},{"$error":"#N/A"},{"$f":"IF(ISTEXT('S7'!$N$37),NA(),'S7'!$N$37)","v":{"$error":"#N/A"}},{"$error":"#N/A"},{"$f":"IF(ISTEXT('S7'!$N$38),NA(),'S7'!$N$38)","v":{"$error":"#N/A"}},null,{"$f":"IF(ISTEXT('S7'!$N$39),NA(),'S7'!$N$39)","v":{"$error":"#N/A"}},{"$error":"#N/A"}]
[{"$f":"IF(ISBLANK('S8'!C$8),\" \",'S8'!C$8)","v":" "},{"$f":"IF(ISTEXT('S8'!$D$15),NA(),'S8'!$D$15)","v":{"$error":"#N/A"}},null,{"$f":"IF(ISTEXT('S8'!$D$17),NA(),'S8'!$D$17)","v":{"$error":"#N/A"}},{"$error":"#N/A"},{"$f":"IF(ISTEXT('S8'!$D$18),NA(),'S8'!$D$18)","v":{"$error":"#N/A"}},{"$error":"#N/A"},{"$f":"IF(ISTEXT('S8'!$D$19),NA(),'S8'!$D$19)","v":{"$error":"#N/A"}},null,{"$f":"IF(ISTEXT('S8'!$D$20),NA(),'S8'!$D$20)","v":{"$error":"#N/A"}},{"$error":"#N/A"}]
[{"$f":"IF(ISBLANK('S8'!E$8),\" \",'S8'!E$8)","v":" "},{"$f":"IF(ISTEXT('S8'!$F$15),NA(),'S8'!$F$15)","v":{"$error":"#N/A"}},null,{"$f":"IF(ISTEXT('S8'!$F$17),NA(),'S8'!$F$17)","v":{"$error":"#N/A"}},{"$error":"#N/A"},{"$f":"IF(ISTEXT('S8'!$F$18),NA(),'S8'!$F$18)","v":{"$error":"#N/A"}},{"$error":"#N/A"},{"$f":"IF(ISTEXT('S8'!$F$19),NA(),'S8'!$F$19)","v":{"$error":"#N/A"}},null,{"$f":"IF(ISTEXT('S8'!$F$20),NA(),'S8'!$F$20)","v":{"$error":"#N/A"}},{"$error":"#N/A"}]
[{"$f":"IF(ISBLANK('S8'!G$8),\" \",'S8'!G$8)","v":" "},{"$f":"IF(ISTEXT('S8'!$H$15),NA(),'S8'!$H$15)","v":{"$error":"#N/A"}},null,{"$f":"IF(ISTEXT('S8'!$H$17),NA(),'S8'!$H$17)","v":{"$error":"#N/A"}},{"$error":"#N/A"},{"$f":"IF(ISTEXT('S8'!$H$18),NA(),'S8'!$H$18)","v":{"$error":"#N/A"}},{"$error":"#N/A"},{"$f":"IF(ISTEXT('S8'!$H$19),NA(),'S8'!$H$19)","v":{"$error":"#N/A"}},null,{"$f":"IF(ISTEXT('S8'!$H$20),NA(),'S8'!$H$20)","v":{"$error":"#N/A"}},{"$error":"#N/A"}]
[{"$f":"IF(ISBLANK('S8'!I$8),\" \",'S8'!I$8)","v":" "},{"$f":"IF(ISTEXT('S8'!$J$15),NA(),'S8'!$J$15)","v":{"$error":"#N/A"}},null,{"$f":"IF(ISTEXT('S8'!$J$17),NA(),'S8'!$J$17)","v":{"$error":"#N/A"}},{"$error":"#N/A"},{"$f":"IF(ISTEXT('S8'!$J$18),NA(),'S8'!$J$18)","v":{"$error":"#N/A"}},{"$error":"#N/A"},{"$f":"IF(ISTEXT('S8'!$J$19),NA(),'S8'!$J$19)","v":{"$error":"#N/A"}},null,{"$f":"IF(ISTEXT('S8'!$J$20),NA(),'S8'!$J$20)","v":{"$error":"#N/A"}},{"$error":"#N/A"}]
[{"$f":"IF(ISBLANK('S8'!K$8),\" \",'S8'!K$8)","v":" "},{"$f":"IF(ISTEXT('S8'!$L$15),NA(),'S8'!$L$15)","v":{"$error":"#N/A"}},null,{"$f":"IF(ISTEXT('S8'!$L$17),NA(),'S8'!$L$17)","v":{"$error":"#N/A"}},{"$f":"ROUND(AVERAGE(D89:D91),0)","v":{"$error":"#N/A"}},{"$f":"IF(ISTEXT('S8'!$L$18),NA(),'S8'!$L$18)","v":{"$error":"#N/A"}},{"$error":"#N/A"},{"$f":"IF(ISTEXT('S8'!$L$19),NA(),'S8'!$L$19)","v":{"$error":"#N/A"}},null,{"$f":"IF(ISTEXT('S8'!$L$20),NA(),'S8'!$L$20)","v":{"$error":"#N/A"}},{"$error":"#N/A"}]
[{"$f":"IF(ISBLANK('S8'!M$8),\" \",'S8'!M$8)","v":" "},{"$f":"IF(ISTEXT('S8'!$N$15),NA(),'S8'!$N$15)","v":{"$error":"#N/A"}},null,{"$f":"IF(ISTEXT('S8'!$N$17),NA(),'S8'!$N$17)","v":{"$error":"#N/A"}},{"$error":"#N/A"},{"$f":"IF(ISTEXT('S8'!$N$18),NA(),'S8'!$N$18)","v":{"$error":"#N/A"}},{"$error":"#N/A"},{"$f":"IF(ISTEXT('S8'!$N$19),NA(),'S8'!$N$19)","v":{"$error":"#N/A"}},null,{"$f":"IF(ISTEXT('S8'!$N$20),NA(),'S8'!$N$20)","v":{"$error":"#N/A"}},{"$error":"#N/A"}]
[{"$f":"IF(ISBLANK('S8'!C$27),\" \",'S8'!C$27)","v":" "},{"$f":"IF(ISTEXT('S8'!$D$34),NA(),'S8'!$D$34)","v":{"$error":"#N/A"}},null,{"$f":"IF(ISTEXT('S8'!$D$36),NA(),'S8'!$D$36)","v":{"$error":"#N/A"}},{"$error":"#N/A"},{"$f":"IF(ISTEXT('S8'!$D$37),NA(),'S8'!$D$37)","v":{"$error":"#N/A"}},{"$error":"#N/A"},{"$f":"IF(ISTEXT('S8'!$D$38),NA(),'S8'!$D$38)","v":{"$error":"#N/A"}},null,{"$f":"IF(ISTEXT('S8'!$D$39),NA(),'S8'!$D$39)","v":{"$error":"#N/A"}},{"$error":"#N/A"}]
[{"$f":"IF(ISBLANK('S8'!E$27),\" \",'S8'!E$27)","v":" "},{"$f":"IF(ISTEXT('S8'!$F$34),NA(),'S8'!$F$34)","v":{"$error":"#N/A"}},null,{"$f":"IF(ISTEXT('S8'!$F$36),NA(),'S8'!$F$36)","v":{"$error":"#N/A"}},{"$error":"#N/A"},{"$f":"IF(ISTEXT('S8'!$F$37),NA(),'S8'!$F$37)","v":{"$error":"#N/A"}},{"$error":"#N/A"},{"$f":"IF(ISTEXT('S8'!$F$38),NA(),'S8'!$F$38)","v":{"$error":"#N/A"}},null,{"$f":"IF(ISTEXT('S8'!$F$39),NA(),'S8'!$F$39)","v":{"$error":"#N/A"}},{"$error":"#N/A"}]
[{"$f":"IF(ISBLANK('S8'!G$27),\" \",'S8'!G$27)","v":" "},{"$f":"IF(ISTEXT('S8'!$H$34),NA(),'S8'!$H$34)","v":{"$error":"#N/A"}},null,{"$f":"IF(ISTEXT('S8'!$H$36),NA(),'S8'!$H$36)","v":{"$error":"#N/A"}},{"$error":"#N/A"},{"$f":"IF(ISTEXT('S8'!$H$37),NA(),'S8'!$H$37)","v":{"$error":"#N/A"}},{"$error":"#N/A"},{"$f":"IF(ISTEXT('S8'!$H$38),NA(),'S8'!$H$38)","v":{"$error":"#N/A"}},null,{"$f":"IF(ISTEXT('S8'!$H$39),NA(),'S8'!$H$39)","v":{"$error":"#N/A"}},{"$error":"#N/A"}]
[{"$f":"IF(ISBLANK('S8'!I$27),\" \",'S8'!I$27)","v":" "},{"$f":"IF(ISTEXT('S8'!$J$34),NA(),'S8'!$J$34)","v":{"$error":"#N/A"}},null,{"$f":"IF(ISTEXT('S8'!$J$36),NA(),'S8'!$J$36)","v":{"$error":"#N/A"}},{"$error":"#N/A"},{"$f":"IF(ISTEXT('S8'!$J$37),NA(),'S8'!$J$37)","v":{"$error":"#N/A"}},{"$error":"#N/A"},{"$f":"IF(ISTEXT('S8'!$J$38),NA(),'S8'!$J$38)","v":{"$error":"#N/A"}},null,{"$f":"IF(ISTEXT('S8'!$J$39),NA(),'S8'!$J$39)","v":{"$error":"#N/A"}},{"$error":"#N/A"}]
[{"$f":"IF(ISBLANK('S8'!K$27),\" \",'S8'!K$27)","v":" "},{"$f":"IF(ISTEXT('S8'!$L$34),NA(),'S8'!$L$34)","v":{"$error":"#N/A"}},null,{"$f":"IF(ISTEXT('S8'!$L$36),NA(),'S8'!$L$36)","v":{"$error":"#N/A"}},{"$error":"#N/A"},{"$f":"IF(ISTEXT('S8'!$L$37),NA(),'S8'!$L$37)","v":{"$error":"#N/A"}},{"$error":"#N/A"},{"$f":"IF(ISTEXT('S8'!$L$38),NA(),'S8'!$L$38)","v":{"$error":"#N/A"}},null,{"$f":"IF(ISTEXT('S8'!$L$39),NA(),'S8'!$L$39)","v":{"$error":"#N/A"}},{"$error":"#N/A"}]
[{"$f":"IF(ISBLANK('S8'!M$27),\" \",'S8'!M$27)","v":" "},{"$f":"IF(ISTEXT('S8'!$N$34),NA(),'S8'!$N$34)","v":{"$error":"#N/A"}},null,{"$f":"IF(ISTEXT('S8'!$N$36),NA(),'S8'!$N$36)","v":{"$error":"#N/A"}},{"$error":"#N/A"},{"$f":"IF(ISTEXT('S8'!$N$37),NA(),'S8'!$N$37)","v":{"$error":"#N/A"}},{"$error":"#N/A"},{"$f":"IF(ISTEXT('S8'!$N$38),NA(),'S8'!$N$38)","v":{"$error":"#N/A"}},null,{"$f":"IF(ISTEXT('S8'!$N$39),NA(),'S8'!$N$39)","v":{"$error":"#N/A"}},{"$error":"#N/A"}]
[{"$f":"IF(ISBLANK('S9'!C$8),\" \",'S9'!C$8)","v":" "},{"$f":"IF(ISTEXT('S9'!$D$15),NA(),'S9'!$D$15)","v":{"$error":"#N/A"}},null,{"$f":"IF(ISTEXT('S9'!$D$17),NA(),'S9'!$D$17)","v":{"$error":"#N/A"}},{"$error":"#N/A"},{"$f":"IF(ISTEXT('S9'!$D$18),NA(),'S9'!$D$18)","v":{"$error":"#N/A"}},{"$error":"#N/A"},{"$f":"IF(ISTEXT('S9'!$D$19),NA(),'S9'!$D$19)","v":{"$error":"#N/A"}},null,{"$f":"IF(ISTEXT('S9'!$D$20),NA(),'S9'!$D$20)","v":{"$error":"#N/A"}},{"$error":"#N/A"}]
[{"$f":"IF(ISBLANK('S9'!E$8),\" \",'S9'!E$8)","v":" "},{"$f":"IF(ISTEXT('S9'!$F$15),NA(),'S9'!$F$15)","v":{"$error":"#N/A"}},null,{"$f":"IF(ISTEXT('S9'!$F$17),NA(),'S9'!$F$17)","v":{"$error":"#N/A"}},{"$error":"#N/A"},{"$f":"IF(ISTEXT('S9'!$F$18),NA(),'S9'!$F$18)","v":{"$error":"#N/A"}},{"$error":"#N/A"},{"$f":"IF(ISTEXT('S9'!$F$19),NA(),'S9'!$F$19)","v":{"$error":"#N/A"}},null,{"$f":"IF(ISTEXT('S9'!$F$20),NA(),'S9'!$F$20)","v":{"$error":"#N/A"}},{"$error":"#N/A"}]
[{"$f":"IF(ISBLANK('S9'!G$8),\" \",'S9'!G$8)","v":" "},{"$f":"IF(ISTEXT('S9'!$H$15),NA(),'S9'!$H$15)","v":{"$error":"#N/A"}},null,{"$f":"IF(ISTEXT('S9'!$H$17),NA(),'S9'!$H$17)","v":{"$error":"#N/A"}},{"$error":"#N/A"},{"$f":"IF(ISTEXT('S9'!$H$18),NA(),'S9'!$H$18)","v":{"$error":"#N/A"}},{"$error":"#N/A"},{"$f":"IF(ISTEXT('S9'!$H$19),NA(),'S9'!$H$19)","v":{"$error":"#N/A"}},null,{"$f":"IF(ISTEXT('S9'!$H$20),NA(),'S9'!$H$20)","v":{"$error":"#N/A"}},{"$f":"ROUND(AVERAGE(J99:J101),1)","v":{"$error":"#N/A"}}]
[{"$f":"IF(ISBLANK('S9'!I$8),\" \",'S9'!I$8)","v":" "},{"$f":"IF(ISTEXT('S9'!$J$15),NA(),'S9'!$J$15)","v":{"$error":"#N/A"}},null,{"$f":"IF(ISTEXT('S9'!$J$17),NA(),'S9'!$J$17)","v":{"$error":"#N/A"}},{"$error":"#N/A"},{"$f":"IF(ISTEXT('S9'!$J$18),NA(),'S9'!$J$18)","v":{"$error":"#N/A"}},{"$error":"#N/A"},{"$f":"IF(ISTEXT('S9'!$J$19),NA(),'S9'!$J$19)","v":{"$error":"#N/A"}},null,{"$f":"IF(ISTEXT('S9'!$J$20),NA(),'S9'!$J$20)","v":{"$error":"#N/A"}},{"$error":"#N/A"}]
[{"$f":"IF(ISBLANK('S9'!K$8),\" \",'S9'!K$8)","v":" "},{"$f":"IF(ISTEXT('S9'!$L$15),NA(),'S9'!$L$15)","v":{"$error":"#N/A"}},null,{"$f":"IF(ISTEXT('S9'!$L$17),NA(),'S9'!$L$17)","v":{"$error":"#N/A"}},{"$error":"#N/A"},{"$f":"IF(ISTEXT('S9'!$L$18),NA(),'S9'!$L$18)","v":{"$error":"#N/A"}},{"$error":"#N/A"},{"$f":"IF(ISTEXT('S9'!$L$19),NA(),'S9'!$L$19)","v":{"$error":"#N/A"}},null,{"$f":"IF(ISTEXT('S9'!$L$20),NA(),'S9'!$L$20)","v":{"$error":"#N/A"}},{"$error":"#N/A"}]
[{"$f":"IF(ISBLANK('S9'!M$8),\" \",'S9'!M$8)","v":" "},{"$f":"IF(ISTEXT('S9'!$N$15),NA(),'S9'!$N$15)","v":{"$error":"#N/A"}},null,{"$f":"IF(ISTEXT('S9'!$N$17),NA(),'S9'!$N$17)","v":{"$error":"#N/A"}},{"$error":"#N/A"},{"$f":"IF(ISTEXT('S9'!$N$18),NA(),'S9'!$N$18)","v":{"$error":"#N/A"}},{"$error":"#N/A"},{"$f":"IF(ISTEXT('S9'!$N$19),NA(),'S9'!$N$19)","v":{"$error":"#N/A"}},null,{"$f":"IF(ISTEXT('S9'!$N$20),NA(),'S9'!$N$20)","v":{"$error":"#N/A"}},{"$error":"#N/A"}]
[{"$f":"IF(ISBLANK('S9'!C$27),\" \",'S9'!C$27)","v":" "},{"$f":"IF(ISTEXT('S9'!$D$34),NA(),'S9'!$D$34)","v":{"$error":"#N/A"}},null,{"$f":"IF(ISTEXT('S9'!$D$36),NA(),'S9'!$D$36)","v":{"$error":"#N/A"}},{"$error":"#N/A"},{"$f":"IF(ISTEXT('S9'!$D$37),NA(),'S9'!$D$37)","v":{"$error":"#N/A"}},{"$error":"#N/A"},{"$f":"IF(ISTEXT('S9'!$D$38),NA(),'S9'!$D$38)","v":{"$error":"#N/A"}},null,{"$f":"IF(ISTEXT('S9'!$D$39),NA(),'S9'!$D$39)","v":{"$error":"#N/A"}},{"$error":"#N/A"}]
[{"$f":"IF(ISBLANK('S9'!E$27),\" \",'S9'!E$27)","v":" "},{"$f":"IF(ISTEXT('S9'!$F$34),NA(),'S9'!$F$34)","v":{"$error":"#N/A"}},null,{"$f":"IF(ISTEXT('S9'!$F$36),NA(),'S9'!$F$36)","v":{"$error":"#N/A"}},{"$error":"#N/A"},{"$f":"IF(ISTEXT('S9'!$F$37),NA(),'S9'!$F$37)","v":{"$error":"#N/A"}},{"$error":"#N/A"},{"$f":"IF(ISTEXT('S9'!$F$38),NA(),'S9'!$F$38)","v":{"$error":"#N/A"}},null,{"$f":"IF(ISTEXT('S9'!$F$39),NA(),'S9'!$F$39)","v":{"$error":"#N/A"}},{"$error":"#N/A"}]
[{"$f":"IF(ISBLANK('S9'!G$27),\" \",'S9'!G$27)","v":" "},{"$f":"IF(ISTEXT('S9'!$H$34),NA(),'S9'!$H$34)","v":{"$error":"#N/A"}},null,{"$f":"IF(ISTEXT('S9'!$H$36),NA(),'S9'!$H$36)","v":{"$error":"#N/A"}},{"$error":"#N/A"},{"$f":"IF(ISTEXT('S9'!$H$37),NA(),'S9'!$H$37)","v":{"$error":"#N/A"}},{"$error":"#N/A"},{"$f":"IF(ISTEXT('S9'!$H$38),NA(),'S9'!$H$38)","v":{"$error":"#N/A"}},null,{"$f":"IF(ISTEXT('S9'!$H$39),NA(),'S9'!$H$39)","v":{"$error":"#N/A"}},{"$error":"#N/A"}]
[{"$f":"IF(ISBLANK('S9'!I$27),\" \",'S9'!I$27)","v":" "},{"$f":"IF(ISTEXT('S9'!$J$34),NA(),'S9'!$J$34)","v":{"$error":"#N/A"}},null,{"$f":"IF(ISTEXT('S9'!$J$36),NA(),'S9'!$J$36)","v":{"$error":"#N/A"}},{"$error":"#N/A"},{"$f":"IF(ISTEXT('S9'!$J$37),NA(),'S9'!$J$37)","v":{"$error":"#N/A"}},{"$error":"#N/A"},{"$f":"IF(ISTEXT('S9'!$J$38),NA(),'S9'!$J$38)","v":{"$error":"#N/A"}},null,{"$f":"IF(ISTEXT('S9'!$J$39),NA(),'S9'!$J$39)","v":{"$error":"#N/A"}},{"$error":"#N/A"}]
[{"$f":"IF(ISBLANK('S9'!K$27),\" \",'S9'!K$27)","v":" "},{"$f":"IF(ISTEXT('S9'!$L$34),NA(),'S9'!$L$34)","v":{"$error":"#N/A"}},null,{"$f":"IF(ISTEXT('S9'!$L$36),NA(),'S9'!$L$36)","v":{"$error":"#N/A"}},{"$error":"#N/A"},{"$f":"IF(ISTEXT('S9'!$L$37),NA(),'S9'!$L$37)","v":{"$error":"#N/A"}},{"$error":"#N/A"},{"$f":"IF(ISTEXT('S9'!$L$38),NA(),'S9'!$L$38)","v":{"$error":"#N/A"}},null,{"$f":"IF(ISTEXT('S9'!$L$39),NA(),'S9'!$L$39)","v":{"$error":"#N/A"}},{"$error":"#N/A"}]
[{"$f":"IF(ISBLANK('S9'!M$27),\" \",'S9'!M$27)","v":" "},{"$f":"IF(ISTEXT('S9'!$N$34),NA(),'S9'!$N$34)","v":{"$error":"#N/A"}},null,{"$f":"IF(ISTEXT('S9'!$N$36),NA(),'S9'!$N$36)","v":{"$error":"#N/A"}},{"$error":"#N/A"},{"$f":"IF(ISTEXT('S9'!$N$37),NA(),'S9'!$N$37)","v":{"$error":"#N/A"}},{"$error":"#N/A"},{"$f":"IF(ISTEXT('S9'!$N$38),NA(),'S9'!$N$38)","v":{"$error":"#N/A"}},null,{"$f":"IF(ISTEXT('S9'!$N$39),NA(),'S9'!$N$39)","v":{"$error":"#N/A"}},{"$error":"#N/A"}]
[{"$f":"IF(ISBLANK('S10'!C$8),\" \",'S10'!C$8)","v":" "},{"$f":"IF(ISTEXT('S10'!$D$15),NA(),'S10'!$D$15)","v":{"$error":"#N/A"}},null,{"$f":"IF(ISTEXT('S10'!$D$17),NA(),'S10'!$D$17)","v":{"$error":"#N/A"}},{"$error":"#N/A"},{"$f":"IF(ISTEXT('S10'!$D$18),NA(),'S10'!$D$18)","v":{"$error":"#N/A"}},{"$error":"#N/A"},{"$f":"IF(ISTEXT('S10'!$D$19),NA(),'S10'!$D$19)","v":{"$error":"#N/A"}},null,{"$f":"IF(ISTEXT('S10'!$D$20),NA(),'S10'!$D$20)","v":{"$error":"#N/A"}},{"$error":"#N/A"}]
[{"$f":"IF(ISBLANK('S10'!E$8),\" \",'S10'!E$8)","v":" "},{"$f":"IF(ISTEXT('S10'!$F$15),NA(),'S10'!$F$15)","v":{"$error":"#N/A"}},null,{"$f":"IF(ISTEXT('S10'!$F$17),NA(),'S10'!$F$17)","v":{"$error":"#N/A"}},{"$error":"#N/A"},{"$f":"IF(ISTEXT('S10'!$F$18),NA(),'S10'!$F$18)","v":{"$error":"#N/A"}},{"$error":"#N/A"},{"$f":"IF(ISTEXT('S10'!$F$19),NA(),'S10'!$F$19)","v":{"$error":"#N/A"}},null,{"$f":"IF(ISTEXT('S10'!$F$20),NA(),'S10'!$F$20)","v":{"$error":"#N/A"}},{"$error":"#N/A"}]
[{"$f":"IF(ISBLANK('S10'!G$8),\" \",'S10'!G$8)","v":" "},{"$f":"IF(ISTEXT('S10'!$H$15),NA(),'S10'!$H$15)","v":{"$error":"#N/A"}},null,{"$f":"IF(ISTEXT('S10'!$H$17),NA(),'S10'!$H$17)","v":{"$error":"#N/A"}},{"$error":"#N/A"},{"$f":"IF(ISTEXT('S10'!$H$18),NA(),'S10'!$H$18)","v":{"$error":"#N/A"}},{"$error":"#N/A"},{"$f":"IF(ISTEXT('S10'!$H$19),NA(),'S10'!$H$19)","v":{"$error":"#N/A"}},null,{"$f":"IF(ISTEXT('S10'!$H$20),NA(),'S10'!$H$20)","v":{"$error":"#N/A"}},{"$error":"#N/A"}]
[{"$f":"IF(ISBLANK('S10'!I$8),\" \",'S10'!I$8)","v":" "},{"$f":"IF(ISTEXT('S10'!$J$15),NA(),'S10'!$J$15)","v":{"$error":"#N/A"}},null,{"$f":"IF(ISTEXT('S10'!$J$17),NA(),'S10'!$J$17)","v":{"$error":"#N/A"}},{"$error":"#N/A"},{"$f":"IF(ISTEXT('S10'!$J$18),NA(),'S10'!$J$18)","v":{"$error":"#N/A"}},{"$error":"#N/A"},{"$f":"IF(ISTEXT('S10'!$J$19),NA(),'S10'!$J$19)","v":{"$error":"#N/A"}},null,{"$f":"IF(ISTEXT('S10'!$J$20),NA(),'S10'!$J$20)","v":{"$error":"#N/A"}},{"$error":"#N/A"}]
[{"$f":"IF(ISBLANK('S10'!K$8),\" \",'S10'!K$8)","v":" "},{"$f":"IF(ISTEXT('S10'!$L$15),NA(),'S10'!$L$15)","v":{"$error":"#N/A"}},null,{"$f":"IF(ISTEXT('S10'!$L$17),NA(),'S10'!$L$17)","v":{"$error":"#N/A"}},{"$error":"#N/A"},{"$f":"IF(ISTEXT('S10'!$L$18),NA(),'S10'!$L$18)","v":{"$error":"#N/A"}},{"$error":"#N/A"},{"$f":"IF(ISTEXT('S10'!$L$19),NA(),'S10'!$L$19)","v":{"$error":"#N/A"}},null,{"$f":"IF(ISTEXT('S10'!$L$20),NA(),'S10'!$L$20)","v":{"$error":"#N/A"}},{"$error":"#N/A"}]
[{"$f":"IF(ISBLANK('S10'!M$8),\" \",'S10'!M$8)","v":" "},{"$f":"IF(ISTEXT('S10'!$N$15),NA(),'S10'!$N$15)","v":{"$error":"#N/A"}},null,{"$f":"IF(ISTEXT('S10'!$N$17),NA(),'S10'!$N$17)","v":{"$error":"#N/A"}},{"$error":"#N/A"},{"$f":"IF(ISTEXT('S10'!$N$18),NA(),'S10'!$N$18)","v":{"$error":"#N/A"}},{"$error":"#N/A"},{"$f":"IF(ISTEXT('S10'!$N$19),NA(),'S10'!$N$19)","v":{"$error":"#N/A"}},null,{"$f":"IF(ISTEXT('S10'!$N$20),NA(),'S10'!$N$20)","v":{"$error":"#N/A"}},{"$error":"#N/A"}]
[{"$f":"IF(ISBLANK('S10'!C$27),\" \",'S10'!C$27)","v":" "},{"$f":"IF(ISTEXT('S10'!$D$34),NA(),'S10'!$D$34)","v":{"$error":"#N/A"}},null,{"$f":"IF(ISTEXT('S10'!$D$36),NA(),'S10'!$D$36)","v":{"$error":"#N/A"}},{"$error":"#N/A"},{"$f":"IF(ISTEXT('S10'!$D$37),NA(),'S10'!$D$37)","v":{"$error":"#N/A"}},{"$error":"#N/A"},{"$f":"IF(ISTEXT('S10'!$D$38),NA(),'S10'!$D$38)","v":{"$error":"#N/A"}},null,{"$f":"IF(ISTEXT('S10'!$D$39),NA(),'S10'!$D$39)","v":{"$error":"#N/A"}},{"$error":"#N/A"}]
[{"$f":"IF(ISBLANK('S10'!E$27),\" \",'S10'!E$27)","v":" "},{"$f":"IF(ISTEXT('S10'!$F$34),NA(),'S10'!$F$34)","v":{"$error":"#N/A"}},null,{"$f":"IF(ISTEXT('S10'!$F$36),NA(),'S10'!$F$36)","v":{"$error":"#N/A"}},{"$error":"#N/A"},{"$f":"IF(ISTEXT('S10'!$F$37),NA(),'S10'!$F$37)","v":{"$error":"#N/A"}},{"$error":"#N/A"},{"$f":"IF(ISTEXT('S10'!$F$38),NA(),'S10'!$F$38)","v":{"$error":"#N/A"}},null,{"$f":"IF(ISTEXT('S10'!$F$39),NA(),'S10'!$F$39)","v":{"$error":"#N/A"}},{"$error":"#N/A"}]
[{"$f":"IF(ISBLANK('S10'!G$27),\" \",'S10'!G$27)","v":" "},{"$f":"IF(ISTEXT('S10'!$H$34),NA(),'S10'!$H$34)","v":{"$error":"#N/A"}},null,{"$f":"IF(ISTEXT('S10'!$H$36),NA(),'S10'!$H$36)","v":{"$error":"#N/A"}},{"$error":"#N/A"},{"$f":"IF(ISTEXT('S10'!$H$37),NA(),'S10'!$H$37)","v":{"$error":"#N/A"}},{"$error":"#N/A"},{"$f":"IF(ISTEXT('S10'!$H$38),NA(),'S10'!$H$38)","v":{"$error":"#N/A"}},null,{"$f":"IF(ISTEXT('S10'!$H$39),NA(),'S10'!$H$39)","v":{"$error":"#N/A"}},{"$error":"#N/A"}]
[{"$f":"IF(ISBLANK('S10'!I$27),\" \",'S10'!I$27)","v":" "},{"$f":"IF(ISTEXT('S10'!$J$34),NA(),'S10'!$J$34)","v":{"$error":"#N/A"}},null,{"$f":"IF(ISTEXT('S10'!$J$36),NA(),'S10'!$J$36)","v":{"$error":"#N/A"}},{"$error":"#N/A"},{"$f":"IF(ISTEXT('S10'!$J$37),NA(),'S10'!$J$37)","v":{"$error":"#N/A"}},{"$error":"#N/A"},{"$f":"IF(ISTEXT('S10'!$J$38),NA(),'S10'!$J$38)","v":{"$error":"#N/A"}},null,{"$f":"IF(ISTEXT('S10'!$J$39),NA(),'S10'!$J$39)","v":{"$error":"#N/A"}},{"$error":"#N/A"}]
[{"$f":"IF(ISBLANK('S10'!K$27),\" \",'S10'!K$27)","v":" "},{"$f":"IF(ISTEXT('S10'!$L$34),NA(),'S10'!$L$34)","v":{"$error":"#N/A"}},null,{"$f":"IF(ISTEXT('S10'!$L$36),NA(),'S10'!$L$36)","v":{"$error":"#N/A"}},{"$error":"#N/A"},{"$f":"IF(ISTEXT('S10'!$L$37),NA(),'S10'!$L$37)","v":{"$error":"#N/A"}},{"$error":"#N/A"},{"$f":"IF(ISTEXT('S10'!$L$38),NA(),'S10'!$L$38)","v":{"$error":"#N/A"}},null,{"$f":"IF(ISTEXT('S10'!$L$39),NA(),'S10'!$L$39)","v":{"$error":"#N/A"}},{"$error":"#N/A"}]
[{"$f":"IF(ISBLANK('S10'!M$27),\" \",'S10'!M$27)","v":" "},{"$f":"IF(ISTEXT('S10'!$N$34),NA(),'S10'!$N$34)","v":{"$error":"#N/A"}},null,{"$f":"IF(ISTEXT('S10'!$N$36),NA(),'S10'!$N$36)","v":{"$error":"#N/A"}},{"$error":"#N/A"},{"$f":"IF(ISTEXT('S10'!$N$37),NA(),'S10'!$N$37)","v":{"$error":"#N/A"}},{"$error":"#N/A"},{"$f":"IF(ISTEXT('S10'!$N$38),NA(),'S10'!$N$38)","v":{"$error":"#N/A"}},null,{"$f":"IF(ISTEXT('S10'!$N$39),NA(),'S10'!$N$39)","v":{"$error":"#N/A"}},{"$error":"#N/A"}]

{"sheet":"AP","index":18,"n_rows":23,"n_cols":36,"rows_kept":23,"cut":false,"hidden":false,"merged":[[16,7,18,7],[20,7,22,7],[4,7,6,7],[8,7,10,7],[12,7,14,7]]}
[]
[null,null,null,null,null,null,null,null,null,{"$f":"'S1'!L4","v":"Type AS4"}]
[]
[]
[null,null,null,null,null,null,null,0.375,"Max",104]
[]
[null,null,null,null,null,null,null,null,"Min",90]
[]
[null,null,null,null,null,null,null,4,"Max",{"$f":"IF($J$2=\"Type AS1\",100,IF($J$2=\"Type AS2\",80,IF($J$2=\"Type AS3\",0,IF($J$2=\"Type AS4\",80))))","v":80},null,"High",{"$f":"IF(OR('S1'!$X4=1,'S1'!$X4=3),\"\",$J$9-5)","v":""},{"$f":"IF(OR('S1'!$X4=1,'S1'!$X4=3),\"\",$J$9-5)","v":""},{"$f":"IF(OR('S1'!$X4=1,'S1'!$X4=3),\"\",$J$9-5)","v":""},{"$f":"IF(OR('S1'!$X4=1,'S1'!$X4=3),\"\",$J$9-5)","v":""},{"$f":"IF(OR('S1'!$X4=1,'S1'!$X4=3),\"\",$J$9-5)","v":""},{"$f":"IF(OR('S1'!$X4=1,'S1'!$X4=3),\"\",$J$9-5)","v":""},{"$f":"IF(OR('S1'!$X4=1,'S1'!$X4=3),\"\",$J$9-5)","v":""},{"$f":"IF(OR('S1'!$X4=1,'S1'!$X4=3),\"\",$J$9-5)","v":""},{"$f":"IF(OR('S1'!$X4=1,'S1'!$X4=3),\"\",$J$9-5)","v":""},{"$f":"IF(OR('S1'!$X4=1,'S1'!$X4=3),\"\",$J$9-5)","v":""},{"$f":"IF(OR('S1'!$X4=1,'S1'!$X4=3),\"\",$J$9-5)","v":""},{"$f":"IF(OR('S1'!$X4=1,'S1'!$X4=3),\"\",$J$9-5)","v":""},{"$f":"IF(OR('S1'!$X4=1,'S1'!$X4=3),\"\",$J$9-5)","v":""},{"$f":"IF(OR('S1'!$X4=1,'S1'!$X4=3),\"\",$J$9-5)","v":""},{"$f":"IF(OR('S1'!$X4=1,'S1'!$X4=3),\"\",$J$9-5)","v":""},{"$f":"IF(OR('S1'!$X4=1,'S1'!$X4=3),\"\",$J$9-5)","v":""},{"$f":"IF(OR('S1'!$X4=1,'S1'!$X4=3),\"\",$J$9-5)","v":""},{"$f":"IF(OR('S1'!$X4=1,'S1'!$X4=3),\"\",$J$9-5)","v":""},{"$f":"IF(OR('S1'!$X4=1,'S1'!$X4=3),\"\",$J$9-5)","v":""},{"$f":"IF(OR('S1'!$X4=1,'S1'!$X4=3),\"\",$J$9-5)","v":""},{"$f":"IF(OR('S1'!$X4=1,'S1'!$X4=3),\"\",$J$9-5)","v":""},{"$f":"IF(OR('S1'!$X4=1,'S1'!$X4=3),\"\",$J$9-5)","v":""},{"$f":"IF(OR('S1'!$X4=1,'S1'!$X4=3),\"\",$J$9-5)","v":""},{"$f":"IF(OR('S1'!$X4=1,'S1'!$X4=3),\"\",$J$9-5)","v":""}]
[]
[null,null,null,null,null,null,null,null,"Min",{"$f":"IF($J$2=\"Type AS1\",60,IF($J$2=\"Type AS2\",35,IF($J$2=\"Type AS3\",0,IF($J$2=\"Type AS4\",35))))","v":35},null,"Low",{"$f":"IF('S1'!$X$4=3,\"\",$J$11+5)","v":40},{"$f":"IF('S1'!$X$4=3,\"\",$J$11+5)","v":40},{"$f":"IF('S1'!$X$4=3,\"\",$J$11+5)","v":40},{"$f":"IF('S1'!$X$4=3,\"\",$J$11+5)","v":40},{"$f":"IF('S1'!$X$4=3,\"\",$J$11+5)","v":40},{"$f":"IF('S1'!$X$4=3,\"\",$J$11+5)","v":40},{"$f":"IF('S1'!$X$4=3,\"\",$J$11+5)","v":40},{"$f":"IF('S1'!$X$4=3,\"\",$J$11+5)","v":40},{"$f":"IF('S1'!$X$4=3,\"\",$J$11+5)","v":40},{"$f":"IF('S1'!$X$4=3,\"\",$J$11+5)","v":40},{"$f":"IF('S1'!$X$4=3,\"\",$J$11+5)","v":40},{"$f":"IF('S1'!$X$4=3,\"\",$J$11+5)","v":40},{"$f":"IF('S1'!$X$4=3,\"\",$J$11+5)","v":40},{"$f":"IF('S1'!$X$4=3,\"\",$J$11+5)","v":40},{"$f":"IF('S1'!$X$4=3,\"\",$J$11+5)","v":40},{"$f":"IF('S1'!$X$4=3,\"\",$J$11+5)","v":40},{"$f":"IF('S1'!$X$4=3,\"\",$J$11+5)","v":40},{"$f":"IF('S1'!$X$4=3,\"\",$J$11+5)","v":40},{"$f":"IF('S1'!$X$4=3,\"\",$J$11+5)","v":40},{"$f":"IF('S1'!$X$4=3,\"\",$J$11+5)","v":40},{"$f":"IF('S1'!$X$4=3,\"\",$J$11+5)","v":40},{"$f":"IF('S1'!$X$4=3,\"\",$J$11+5)","v":40},{"$f":"IF('S1'!$X$4=3,\"\",$J$11+5)","v":40},{"$f":"IF('S1'!$X$4=3,\"\",$J$11+5)","v":40}]
[]
[null,null,null,null,null,null,null,8,"Max",{"$f":"IF($J$2=\"Type AS1\",80,IF($J$2=\"Type AS2\",45,IF($J$2=\"Type AS3\",30,IF($J$2=\"Type AS4\",45))))","v":45},null,"High",{"$f":"$J$13-5","v":40},{"$f":"$J$13-5","v":40},40,40,40,40,40,40,40,40,40,40,40,40,40,40,40,40,40,40,40,40,40,40]
[]
[null,null,null,null,null,null,null,null,"Min",0]
[]
[null,null,null,null,null,null,null,100,"Max",{"$f":"IF($J$2=\"Type AS1\",8,IF($J$2=\"Type AS2\",6,IF($J$2=\"Type AS3\",8,IF($J$2=\"Type AS4\",6))))","v":6}]
[]
[null,null,null,null,null,null,null,null,"Min",0]
[null,null,null,null,null,null,null,null,null,null,null,null,null,"`"]
[null,null,null,null,null,null,null,200,"Max",{"$f":"IF($J$2=\"Type AS1\",5,IF($J$2=\"Type AS2\",5,IF($J$2=\"Type AS3\",0,IF($J$2=\"Type AS4\",5))))","v":5},null,"High",{"$f":"IF('S1'!$X4=1,$J$21-1,$J$21-2)","v":4},{"$f":"IF('S1'!$X4=1,$J$21-1,$J$21-2)","v":4},{"$f":"IF('S1'!$X4=1,$J$21-1,$J$21-2)","v":4},{"$f":"IF('S1'!$X4=1,$J$21-1,$J$21-2)","v":4},{"$f":"IF('S1'!$X4=1,$J$21-1,$J$21-2)","v":4},{"$f":"IF('S1'!$X4=1,$J$21-1,$J$21-2)","v":4},{"$f":"IF('S1'!$X4=1,$J$21-1,$J$21-2)","v":4},{"$f":"IF('S1'!$X4=1,$J$21-1,$J$21-2)","v":4},{"$f":"IF('S1'!$X4=1,$J$21-1,$J$21-2)","v":4},{"$f":"IF('S1'!$X4=1,$J$21-1,$J$21-2)","v":4},{"$f":"IF('S1'!$X4=1,$J$21-1,$J$21-2)","v":4},{"$f":"IF('S1'!$X4=1,$J$21-1,$J$21-2)","v":4},{"$f":"IF('S1'!$X4=1,$J$21-1,$J$21-2)","v":4},{"$f":"IF('S1'!$X4=1,$J$21-1,$J$21-2)","v":4},{"$f":"IF('S1'!$X4=1,$J$21-1,$J$21-2)","v":4},{"$f":"IF('S1'!$X4=1,$J$21-1,$J$21-2)","v":4},{"$f":"IF('S1'!$X4=1,$J$21-1,$J$21-2)","v":4},{"$f":"IF('S1'!$X4=1,$J$21-1,$J$21-2)","v":4},{"$f":"IF('S1'!$X4=1,$J$21-1,$J$21-2)","v":4},{"$f":"IF('S1'!$X4=1,$J$21-1,$J$21-2)","v":4},{"$f":"IF('S1'!$X4=1,$J$21-1,$J$21-2)","v":4},{"$f":"IF('S1'!$X4=1,$J$21-1,$J$21-2)","v":4},{"$f":"IF('S1'!$X4=1,$J$21-1,$J$21-2)","v":4},{"$f":"IF('S1'!$X4=1,$J$21-1,$J$21-2)","v":4}]
[]
[null,null,null,null,null,null,null,null,"Min",0]

{"sheet":"Spec","index":19,"n_rows":12,"n_cols":5,"rows_kept":12,"cut":false,"hidden":true,"merged":[[0,0,0,5],[1,0,1,5],[2,0,2,5],[3,0,3,5]]}
["Material Test Results for Type AS1"]
["Material Test Results for Type AS2"]
["Material Test Results for Type AS3"]
["Material Test Results for Type AS4"]
[]
[null,"AS1","AS2","AS3","AS4"]
[0.5,100,100,100,100]
[0.375,100,100,"90-100",100]
[4,"60-100","35-80"]
[8,"0-80","0-45","0-30","0-30"]
[100,"0-8","0-6","0-8","0-8"]
[200,"0-5","0-3**",null,"0-5"]